poi-dev mailing list archives

Site index · List index
Message view « Date » · « Thread »
Top « Date » · « Thread »
From Apache Jenkins Server <jenk...@builds.apache.org>
Subject Build failed in Jenkins: POI #1467
Date Mon, 18 Jul 2016 19:29:02 GMT
See <https://builds.apache.org/job/POI/1467/changes>

Changes:

[onealj] +svn:eol-style=native

[onealj] bug 59881: fix spelling; patch from Patrick Zimmermann

------------------------------------------
[...truncated 4117 lines...]

jar-javadocs:
     [echo] Building poi javadocs from <https://builds.apache.org/job/POI/ws/src/java>
    [mkdir] Created dir: <https://builds.apache.org/job/POI/ws/build/tmp/maven-javadocs>
  [javadoc] Generating Javadoc
  [javadoc] Javadoc execution
  [javadoc] Patched 1 link injection vulnerable javadocs
      [jar] Building jar: <https://builds.apache.org/job/POI/ws/build/dist/maven/poi/poi-3.15-beta3-javadoc.jar>
     [echo] Building poi-scratchpad javadocs from <https://builds.apache.org/job/POI/ws/src/scratchpad/src>
   [delete] Deleting directory <https://builds.apache.org/job/POI/ws/build/tmp/maven-javadocs>
    [mkdir] Created dir: <https://builds.apache.org/job/POI/ws/build/tmp/maven-javadocs>
  [javadoc] Generating Javadoc
  [javadoc] Javadoc execution
  [javadoc] Patched 1 link injection vulnerable javadocs
      [jar] Building jar: <https://builds.apache.org/job/POI/ws/build/dist/maven/poi-scratchpad/poi-scratchpad-3.15-beta3-javadoc.jar>
     [echo] Building poi-ooxml javadocs from <https://builds.apache.org/job/POI/ws/src/ooxml/java>
   [delete] Deleting directory <https://builds.apache.org/job/POI/ws/build/tmp/maven-javadocs>
    [mkdir] Created dir: <https://builds.apache.org/job/POI/ws/build/tmp/maven-javadocs>
  [javadoc] Generating Javadoc
  [javadoc] Javadoc execution
  [javadoc] Patched 1 link injection vulnerable javadocs
      [jar] Building jar: <https://builds.apache.org/job/POI/ws/build/dist/maven/poi-ooxml/poi-ooxml-3.15-beta3-javadoc.jar>

assemble:
      [zip] Building zip: <https://builds.apache.org/job/POI/ws/build/dist/poi-bin-3.15-beta3-20160718.zip>
      [tar] Building tar: <https://builds.apache.org/job/POI/1467/artifact/build/dist/poi-bin-3.15-beta3-20160718.tar.gz>
      [zip] Building zip: <https://builds.apache.org/job/POI/ws/build/dist/poi-src-3.15-beta3-20160718.zip>
      [tar] Building tar: <https://builds.apache.org/job/POI/1467/artifact/build/dist/poi-src-3.15-beta3-20160718.tar.gz>
     [echo] Creating Maven POMs

maven-poms:
     [copy] Copying 6 files to <https://builds.apache.org/job/POI/ws/build/dist/maven>
     [echo] Maven POMs are located in <https://builds.apache.org/job/POI/ws/build/dist>
     [echo] Use ant dist-nexus to deploy the artifacts in the remote repository
     [echo] Distribution located in <https://builds.apache.org/job/POI/ws/build/dist>
     [echo] Use "ant dist-checksum" to create md5/sha1 checksums and GPG signatures

findbugs:
    [unzip] Expanding: <https://builds.apache.org/job/POI/ws/lib/findbugs-noUpdateChecks-2.0.3.zip>
into <https://builds.apache.org/job/POI/ws/build/findbugs>
 [findbugs] Executing findbugs FindBugsTask from ant task
 [findbugs] Running FindBugs...
 [findbugs] Java Result: 137
 [findbugs] Output saved to build/findbugs.xml
     [xslt] Transforming into <https://builds.apache.org/job/POI/ws/build>
     [xslt] Processing <https://builds.apache.org/job/POI/ws/build/findbugs.xml> to
<https://builds.apache.org/job/POI/1467/artifact/build/findbugs.html>
     [xslt] Loading stylesheet jar:<https://builds.apache.org/job/POI/ws/build/findbugs/lib/findbugs.jar!/fancy-hist.xsl>
     [xslt] : Error! Premature end of file.
     [xslt] : Error! com.sun.org.apache.xml.internal.utils.WrappedRuntimeException: Premature
end of file.
     [xslt] Failed to process null

BUILD FAILED
<https://builds.apache.org/job/POI/ws/build.xml>:2132: javax.xml.transform.TransformerException:
javax.xml.transform.TransformerException: com.sun.org.apache.xml.internal.utils.WrappedRuntimeException:
Premature end of file.
	at com.sun.org.apache.xalan.internal.xsltc.trax.TransformerImpl.transform(TransformerImpl.java:735)
	at com.sun.org.apache.xalan.internal.xsltc.trax.TransformerImpl.transform(TransformerImpl.java:336)
	at org.apache.tools.ant.taskdefs.optional.TraXLiaison.transform(TraXLiaison.java:195)
	at org.apache.tools.ant.taskdefs.XSLTProcess.process(XSLTProcess.java:842)
	at org.apache.tools.ant.taskdefs.XSLTProcess.execute(XSLTProcess.java:432)
	at org.apache.tools.ant.UnknownElement.execute(UnknownElement.java:292)
	at sun.reflect.GeneratedMethodAccessor4.invoke(Unknown Source)
	at sun.reflect.DelegatingMethodAccessorImpl.invoke(DelegatingMethodAccessorImpl.java:25)
	at java.lang.reflect.Method.invoke(Method.java:597)
	at org.apache.tools.ant.dispatch.DispatchUtils.execute(DispatchUtils.java:106)
	at org.apache.tools.ant.Task.perform(Task.java:348)
	at org.apache.tools.ant.Target.execute(Target.java:435)
	at org.apache.tools.ant.Target.performTasks(Target.java:456)
	at org.apache.tools.ant.Project.executeSortedTargets(Project.java:1393)
	at org.apache.tools.ant.Project.executeTarget(Project.java:1364)
	at org.apache.tools.ant.helper.DefaultExecutor.executeTargets(DefaultExecutor.java:41)
	at org.apache.tools.ant.Project.executeTargets(Project.java:1248)
	at org.apache.tools.ant.Main.runBuild(Main.java:851)
	at org.apache.tools.ant.Main.startAnt(Main.java:235)
	at org.apache.tools.ant.launch.Launcher.run(Launcher.java:280)
	at org.apache.tools.ant.launch.Launcher.main(Launcher.java:109)
Caused by: javax.xml.transform.TransformerException: com.sun.org.apache.xml.internal.utils.WrappedRuntimeException:
Premature end of file.
	at com.sun.org.apache.xalan.internal.xsltc.trax.TransformerImpl.getDOM(TransformerImpl.java:564)
	at com.sun.org.apache.xalan.internal.xsltc.trax.TransformerImpl.transform(TransformerImpl.java:725)
	... 20 more
Caused by: com.sun.org.apache.xml.internal.utils.WrappedRuntimeException: Premature end of
file.
	at com.sun.org.apache.xalan.internal.xsltc.dom.XSLTCDTMManager.getDTM(XSLTCDTMManager.java:460)
	at com.sun.org.apache.xalan.internal.xsltc.dom.XSLTCDTMManager.getDTM(XSLTCDTMManager.java:248)
	at com.sun.org.apache.xalan.internal.xsltc.trax.TransformerImpl.getDOM(TransformerImpl.java:542)
	... 21 more
---------
javax.xml.transform.TransformerException: com.sun.org.apache.xml.internal.utils.WrappedRuntimeException:
Premature end of file.
	at com.sun.org.apache.xalan.internal.xsltc.trax.TransformerImpl.getDOM(TransformerImpl.java:564)
	at com.sun.org.apache.xalan.internal.xsltc.trax.TransformerImpl.transform(TransformerImpl.java:725)
	at com.sun.org.apache.xalan.internal.xsltc.trax.TransformerImpl.transform(TransformerImpl.java:336)
	at org.apache.tools.ant.taskdefs.optional.TraXLiaison.transform(TraXLiaison.java:195)
	at org.apache.tools.ant.taskdefs.XSLTProcess.process(XSLTProcess.java:842)
	at org.apache.tools.ant.taskdefs.XSLTProcess.execute(XSLTProcess.java:432)
	at org.apache.tools.ant.UnknownElement.execute(UnknownElement.java:292)
	at sun.reflect.GeneratedMethodAccessor4.invoke(Unknown Source)
	at sun.reflect.DelegatingMethodAccessorImpl.invoke(DelegatingMethodAccessorImpl.java:25)
	at java.lang.reflect.Method.invoke(Method.java:597)
	at org.apache.tools.ant.dispatch.DispatchUtils.execute(DispatchUtils.java:106)
	at org.apache.tools.ant.Task.perform(Task.java:348)
	at org.apache.tools.ant.Target.execute(Target.java:435)
	at org.apache.tools.ant.Target.performTasks(Target.java:456)
	at org.apache.tools.ant.Project.executeSortedTargets(Project.java:1393)
	at org.apache.tools.ant.Project.executeTarget(Project.java:1364)
	at org.apache.tools.ant.helper.DefaultExecutor.executeTargets(DefaultExecutor.java:41)
	at org.apache.tools.ant.Project.executeTargets(Project.java:1248)
	at org.apache.tools.ant.Main.runBuild(Main.java:851)
	at org.apache.tools.ant.Main.startAnt(Main.java:235)
	at org.apache.tools.ant.launch.Launcher.run(Launcher.java:280)
	at org.apache.tools.ant.launch.Launcher.main(Launcher.java:109)
Caused by: com.sun.org.apache.xml.internal.utils.WrappedRuntimeException: Premature end of
file.
	at com.sun.org.apache.xalan.internal.xsltc.dom.XSLTCDTMManager.getDTM(XSLTCDTMManager.java:460)
	at com.sun.org.apache.xalan.internal.xsltc.dom.XSLTCDTMManager.getDTM(XSLTCDTMManager.java:248)
	at com.sun.org.apache.xalan.internal.xsltc.trax.TransformerImpl.getDOM(TransformerImpl.java:542)
	... 21 more
---------
com.sun.org.apache.xml.internal.utils.WrappedRuntimeException: Premature end of file.
	at com.sun.org.apache.xalan.internal.xsltc.dom.XSLTCDTMManager.getDTM(XSLTCDTMManager.java:460)
	at com.sun.org.apache.xalan.internal.xsltc.dom.XSLTCDTMManager.getDTM(XSLTCDTMManager.java:248)
	at com.sun.org.apache.xalan.internal.xsltc.trax.TransformerImpl.getDOM(TransformerImpl.java:542)
	at com.sun.org.apache.xalan.internal.xsltc.trax.TransformerImpl.transform(TransformerImpl.java:725)
	at com.sun.org.apache.xalan.internal.xsltc.trax.TransformerImpl.transform(TransformerImpl.java:336)
	at org.apache.tools.ant.taskdefs.optional.TraXLiaison.transform(TraXLiaison.java:195)
	at org.apache.tools.ant.taskdefs.XSLTProcess.process(XSLTProcess.java:842)
	at org.apache.tools.ant.taskdefs.XSLTProcess.execute(XSLTProcess.java:432)
	at org.apache.tools.ant.UnknownElement.execute(UnknownElement.java:292)
	at sun.reflect.GeneratedMethodAccessor4.invoke(Unknown Source)
	at sun.reflect.DelegatingMethodAccessorImpl.invoke(DelegatingMethodAccessorImpl.java:25)
	at java.lang.reflect.Method.invoke(Method.java:597)
	at org.apache.tools.ant.dispatch.DispatchUtils.execute(DispatchUtils.java:106)
	at org.apache.tools.ant.Task.perform(Task.java:348)
	at org.apache.tools.ant.Target.execute(Target.java:435)
	at org.apache.tools.ant.Target.performTasks(Target.java:456)
	at org.apache.tools.ant.Project.executeSortedTargets(Project.java:1393)
	at org.apache.tools.ant.Project.executeTarget(Project.java:1364)
	at org.apache.tools.ant.helper.DefaultExecutor.executeTargets(DefaultExecutor.java:41)
	at org.apache.tools.ant.Project.executeTargets(Project.java:1248)
	at org.apache.tools.ant.Main.runBuild(Main.java:851)
	at org.apache.tools.ant.Main.startAnt(Main.java:235)
	at org.apache.tools.ant.launch.Launcher.run(Launcher.java:280)
	at org.apache.tools.ant.launch.Launcher.main(Launcher.java:109)
---------
org.xml.sax.SAXParseException: Premature end of file.
	at com.sun.org.apache.xerces.internal.util.ErrorHandlerWrapper.createSAXParseException(ErrorHandlerWrapper.java:195)
	at com.sun.org.apache.xerces.internal.util.ErrorHandlerWrapper.fatalError(ErrorHandlerWrapper.java:174)
	at com.sun.org.apache.xerces.internal.impl.XMLErrorReporter.reportError(XMLErrorReporter.java:388)
	at com.sun.org.apache.xerces.internal.impl.XMLScanner.reportFatalError(XMLScanner.java:1427)
	at com.sun.org.apache.xerces.internal.impl.XMLDocumentScannerImpl$PrologDriver.next(XMLDocumentScannerImpl.java:1056)
	at com.sun.org.apache.xerces.internal.impl.XMLDocumentScannerImpl.next(XMLDocumentScannerImpl.java:647)
	at com.sun.org.apache.xerces.internal.impl.XMLNSDocumentScannerImpl.next(XMLNSDocumentScannerImpl.java:140)
	at com.sun.org.apache.xerces.internal.impl.XMLDocumentFragmentScannerImpl.scanDocument(XMLDocumentFragmentScannerImpl.java:511)
	at com.sun.org.apache.xerces.internal.parsers.XML11Configuration.parse(XML11Configuration.java:808)
	at com.sun.org.apache.xerces.internal.parsers.XML11Configuration.parse(XML11Configuration.java:737)
	at com.sun.org.apache.xerces.internal.parsers.XMLParser.parse(XMLParser.java:119)
	at com.sun.org.apache.xerces.internal.parsers.AbstractSAXParser.parse(AbstractSAXParser.java:1205)
	at com.sun.org.apache.xerces.internal.jaxp.SAXParserImpl$JAXPSAXParser.parse(SAXParserImpl.java:522)
	at com.sun.org.apache.xalan.internal.xsltc.dom.XSLTCDTMManager.getDTM(XSLTCDTMManager.java:454)
	at com.sun.org.apache.xalan.internal.xsltc.dom.XSLTCDTMManager.getDTM(XSLTCDTMManager.java:248)
	at com.sun.org.apache.xalan.internal.xsltc.trax.TransformerImpl.getDOM(TransformerImpl.java:542)
	at com.sun.org.apache.xalan.internal.xsltc.trax.TransformerImpl.transform(TransformerImpl.java:725)
	at com.sun.org.apache.xalan.internal.xsltc.trax.TransformerImpl.transform(TransformerImpl.java:336)
	at org.apache.tools.ant.taskdefs.optional.TraXLiaison.transform(TraXLiaison.java:195)
	at org.apache.tools.ant.taskdefs.XSLTProcess.process(XSLTProcess.java:842)
	at org.apache.tools.ant.taskdefs.XSLTProcess.execute(XSLTProcess.java:432)
	at org.apache.tools.ant.UnknownElement.execute(UnknownElement.java:292)
	at sun.reflect.GeneratedMethodAccessor4.invoke(Unknown Source)
	at sun.reflect.DelegatingMethodAccessorImpl.invoke(DelegatingMethodAccessorImpl.java:25)
	at java.lang.reflect.Method.invoke(Method.java:597)
	at org.apache.tools.ant.dispatch.DispatchUtils.execute(DispatchUtils.java:106)
	at org.apache.tools.ant.Task.perform(Task.java:348)
	at org.apache.tools.ant.Target.execute(Target.java:435)
	at org.apache.tools.ant.Target.performTasks(Target.java:456)
	at org.apache.tools.ant.Project.executeSortedTargets(Project.java:1393)
	at org.apache.tools.ant.Project.executeTarget(Project.java:1364)
	at org.apache.tools.ant.helper.DefaultExecutor.executeTargets(DefaultExecutor.java:41)
	at org.apache.tools.ant.Project.executeTargets(Project.java:1248)
	at org.apache.tools.ant.Main.runBuild(Main.java:851)
	at org.apache.tools.ant.Main.startAnt(Main.java:235)
	at org.apache.tools.ant.launch.Launcher.run(Launcher.java:280)
	at org.apache.tools.ant.launch.Launcher.main(Launcher.java:109)
---------
com.sun.org.apache.xml.internal.utils.WrappedRuntimeException: Premature end of file.
	at com.sun.org.apache.xalan.internal.xsltc.dom.XSLTCDTMManager.getDTM(XSLTCDTMManager.java:460)
	at com.sun.org.apache.xalan.internal.xsltc.dom.XSLTCDTMManager.getDTM(XSLTCDTMManager.java:248)
	at com.sun.org.apache.xalan.internal.xsltc.trax.TransformerImpl.getDOM(TransformerImpl.java:542)
	at com.sun.org.apache.xalan.internal.xsltc.trax.TransformerImpl.transform(TransformerImpl.java:725)
	at com.sun.org.apache.xalan.internal.xsltc.trax.TransformerImpl.transform(TransformerImpl.java:336)
	at org.apache.tools.ant.taskdefs.optional.TraXLiaison.transform(TraXLiaison.java:195)
	at org.apache.tools.ant.taskdefs.XSLTProcess.process(XSLTProcess.java:842)
	at org.apache.tools.ant.taskdefs.XSLTProcess.execute(XSLTProcess.java:432)
	at org.apache.tools.ant.UnknownElement.execute(UnknownElement.java:292)
	at sun.reflect.GeneratedMethodAccessor4.invoke(Unknown Source)
	at sun.reflect.DelegatingMethodAccessorImpl.invoke(DelegatingMethodAccessorImpl.java:25)
	at java.lang.reflect.Method.invoke(Method.java:597)
	at org.apache.tools.ant.dispatch.DispatchUtils.execute(DispatchUtils.java:106)
	at org.apache.tools.ant.Task.perform(Task.java:348)
	at org.apache.tools.ant.Target.execute(Target.java:435)
	at org.apache.tools.ant.Target.performTasks(Target.java:456)
	at org.apache.tools.ant.Project.executeSortedTargets(Project.java:1393)
	at org.apache.tools.ant.Project.executeTarget(Project.java:1364)
	at org.apache.tools.ant.helper.DefaultExecutor.executeTargets(DefaultExecutor.java:41)
	at org.apache.tools.ant.Project.executeTargets(Project.java:1248)
	at org.apache.tools.ant.Main.runBuild(Main.java:851)
	at org.apache.tools.ant.Main.startAnt(Main.java:235)
	at org.apache.tools.ant.launch.Launcher.run(Launcher.java:280)
	at org.apache.tools.ant.launch.Launcher.main(Launcher.java:109)
---------
org.xml.sax.SAXParseException: Premature end of file.
	at com.sun.org.apache.xerces.internal.util.ErrorHandlerWrapper.createSAXParseException(ErrorHandlerWrapper.java:195)
	at com.sun.org.apache.xerces.internal.util.ErrorHandlerWrapper.fatalError(ErrorHandlerWrapper.java:174)
	at com.sun.org.apache.xerces.internal.impl.XMLErrorReporter.reportError(XMLErrorReporter.java:388)
	at com.sun.org.apache.xerces.internal.impl.XMLScanner.reportFatalError(XMLScanner.java:1427)
	at com.sun.org.apache.xerces.internal.impl.XMLDocumentScannerImpl$PrologDriver.next(XMLDocumentScannerImpl.java:1056)
	at com.sun.org.apache.xerces.internal.impl.XMLDocumentScannerImpl.next(XMLDocumentScannerImpl.java:647)
	at com.sun.org.apache.xerces.internal.impl.XMLNSDocumentScannerImpl.next(XMLNSDocumentScannerImpl.java:140)
	at com.sun.org.apache.xerces.internal.impl.XMLDocumentFragmentScannerImpl.scanDocument(XMLDocumentFragmentScannerImpl.java:511)
	at com.sun.org.apache.xerces.internal.parsers.XML11Configuration.parse(XML11Configuration.java:808)
	at com.sun.org.apache.xerces.internal.parsers.XML11Configuration.parse(XML11Configuration.java:737)
	at com.sun.org.apache.xerces.internal.parsers.XMLParser.parse(XMLParser.java:119)
	at com.sun.org.apache.xerces.internal.parsers.AbstractSAXParser.parse(AbstractSAXParser.java:1205)
	at com.sun.org.apache.xerces.internal.jaxp.SAXParserImpl$JAXPSAXParser.parse(SAXParserImpl.java:522)
	at com.sun.org.apache.xalan.internal.xsltc.dom.XSLTCDTMManager.getDTM(XSLTCDTMManager.java:454)
	at com.sun.org.apache.xalan.internal.xsltc.dom.XSLTCDTMManager.getDTM(XSLTCDTMManager.java:248)
	at com.sun.org.apache.xalan.internal.xsltc.trax.TransformerImpl.getDOM(TransformerImpl.java:542)
	at com.sun.org.apache.xalan.internal.xsltc.trax.TransformerImpl.transform(TransformerImpl.java:725)
	at com.sun.org.apache.xalan.internal.xsltc.trax.TransformerImpl.transform(TransformerImpl.java:336)
	at org.apache.tools.ant.taskdefs.optional.TraXLiaison.transform(TraXLiaison.java:195)
	at org.apache.tools.ant.taskdefs.XSLTProcess.process(XSLTProcess.java:842)
	at org.apache.tools.ant.taskdefs.XSLTProcess.execute(XSLTProcess.java:432)
	at org.apache.tools.ant.UnknownElement.execute(UnknownElement.java:292)
	at sun.reflect.GeneratedMethodAccessor4.invoke(Unknown Source)
	at sun.reflect.DelegatingMethodAccessorImpl.invoke(DelegatingMethodAccessorImpl.java:25)
	at java.lang.reflect.Method.invoke(Method.java:597)
	at org.apache.tools.ant.dispatch.DispatchUtils.execute(DispatchUtils.java:106)
	at org.apache.tools.ant.Task.perform(Task.java:348)
	at org.apache.tools.ant.Target.execute(Target.java:435)
	at org.apache.tools.ant.Target.performTasks(Target.java:456)
	at org.apache.tools.ant.Project.executeSortedTargets(Project.java:1393)
	at org.apache.tools.ant.Project.executeTarget(Project.java:1364)
	at org.apache.tools.ant.helper.DefaultExecutor.executeTargets(DefaultExecutor.java:41)
	at org.apache.tools.ant.Project.executeTargets(Project.java:1248)
	at org.apache.tools.ant.Main.runBuild(Main.java:851)
	at org.apache.tools.ant.Main.startAnt(Main.java:235)
	at org.apache.tools.ant.launch.Launcher.run(Launcher.java:280)
	at org.apache.tools.ant.launch.Launcher.main(Launcher.java:109)

Total time: 17 minutes 58 seconds
Build step 'Invoke Ant' marked build as failure
[FINDBUGS] Skipping publisher since build result is FAILURE
[WARNINGS] Skipping publisher since build result is FAILURE
Archiving artifacts
Compressed 211.72 MB of artifacts by 46.3% relative to #1466
Recording test results

---------------------------------------------------------------------
To unsubscribe, e-mail: dev-unsubscribe@poi.apache.org
For additional commands, e-mail: dev-help@poi.apache.org


Mime
View raw message