poi-dev mailing list archives

Site index · List index
Message view « Date » · « Thread »
Top « Date » · « Thread »
From Apache Jenkins Server <jenk...@builds.apache.org>
Subject Build failed in Jenkins: POI-JDK8 #958
Date Sun, 17 Apr 2016 08:20:25 GMT
See <https://builds.apache.org/job/POI-JDK8/958/changes>

Changes:

[onealj] add junit test classes for combined testing of XML-specific functionality of (S)XSSF
Workbook, Sheet, and Row

[onealj] bug 59342: add sheet tab color getter and setter

[onealj] bug 59342: add sheet tab color getter and setter

------------------------------------------
[...truncated 5710 lines...]
     [java] Column 136 took 34.0 ms
     [java] Column 137 took 45.0 ms
     [java] Column 138 took 23.0 ms
     [java] Auto sizing columns took a total of 6056.0 ms (43.568345323741006 ms per column)
     [java] Best fit width time per cell: 272302.1582733813 ns
     [java] Total time: 6.067 s
     [java] .......................................................................................................................................................I....................................................Cell:
3E-104
     [java] Cell: 5E-104
     [java] Cell: 5E-106
     [java] Cell: 
     [java] II.........I......................I..............I.org.apache.poi.xssf.usermodel.XSSFWorkbook
column autosizing timing...
     [java] Populate sheet time: 1494.0 ms (67176.25899280576 ns/cell)
     [java] 
     [java] Autosizing...
     [java] Column 0 took 22.0 ms
     [java] Column 1 took 22.0 ms
     [java] Column 2 took 21.0 ms
     [java] Column 3 took 21.0 ms
     [java] Column 4 took 21.0 ms
     [java] Column 5 took 21.0 ms
     [java] Column 6 took 22.0 ms
     [java] Column 7 took 35.0 ms
     [java] Column 8 took 28.0 ms
     [java] Column 9 took 24.0 ms
     [java] Column 10 took 22.0 ms
     [java] Column 11 took 23.0 ms
     [java] Column 12 took 22.0 ms
     [java] Column 13 took 22.0 ms
     [java] Column 14 took 22.0 ms
     [java] Column 15 took 21.0 ms
     [java] Column 16 took 22.0 ms
     [java] Column 17 took 22.0 ms
     [java] Column 18 took 22.0 ms
     [java] Column 19 took 21.0 ms
     [java] Column 20 took 22.0 ms
     [java] Column 21 took 22.0 ms
     [java] Column 22 took 22.0 ms
     [java] Column 23 took 27.0 ms
     [java] Column 24 took 35.0 ms
     [java] Column 25 took 27.0 ms
     [java] Column 26 took 34.0 ms
     [java] Column 27 took 34.0 ms
     [java] Column 28 took 26.0 ms
     [java] Column 29 took 22.0 ms
     [java] Column 30 took 20.0 ms
     [java] Column 31 took 20.0 ms
     [java] Column 32 took 19.0 ms
     [java] Column 33 took 20.0 ms
     [java] Column 34 took 19.0 ms
     [java] Column 35 took 37.0 ms
     [java] Column 36 took 20.0 ms
     [java] Column 37 took 20.0 ms
     [java] Column 38 took 32.0 ms
     [java] Column 39 took 29.0 ms
     [java] Column 40 took 26.0 ms
     [java] Column 41 took 32.0 ms
     [java] Column 42 took 25.0 ms
     [java] Column 43 took 23.0 ms
     [java] Column 44 took 21.0 ms
     [java] Column 45 took 22.0 ms
     [java] Column 46 took 21.0 ms
     [java] Column 47 took 22.0 ms
     [java] Column 48 took 21.0 ms
     [java] Column 49 took 22.0 ms
     [java] Column 50 took 21.0 ms
     [java] Column 51 took 22.0 ms
     [java] Column 52 took 28.0 ms
     [java] Column 53 took 26.0 ms
     [java] Column 54 took 29.0 ms
     [java] Column 55 took 32.0 ms
     [java] Column 56 took 29.0 ms
     [java] Column 57 took 21.0 ms
     [java] Column 58 took 21.0 ms
     [java] Column 59 took 23.0 ms
     [java] Column 60 took 21.0 ms
     [java] Column 61 took 21.0 ms
     [java] Column 62 took 21.0 ms
     [java] Column 63 took 21.0 ms
     [java] Column 64 took 21.0 ms
     [java] Column 65 took 21.0 ms
     [java] Column 66 took 21.0 ms
     [java] Column 67 took 35.0 ms
     [java] Column 68 took 25.0 ms
     [java] Column 69 took 21.0 ms
     [java] Column 70 took 20.0 ms
     [java] Column 71 took 21.0 ms
     [java] Column 72 took 21.0 ms
     [java] Column 73 took 20.0 ms
     [java] Column 74 took 20.0 ms
     [java] Column 75 took 20.0 ms
     [java] Column 76 took 19.0 ms
     [java] Column 77 took 20.0 ms
     [java] Column 78 took 20.0 ms
     [java] Column 79 took 19.0 ms
     [java] Column 80 took 20.0 ms
     [java] Column 81 took 21.0 ms
     [java] Column 82 took 21.0 ms
     [java] Column 83 took 38.0 ms
     [java] Column 84 took 29.0 ms
     [java] Column 85 took 29.0 ms
     [java] Column 86 took 33.0 ms
     [java] Column 87 took 30.0 ms
     [java] Column 88 took 21.0 ms
     [java] Column 89 took 21.0 ms
     [java] Column 90 took 20.0 ms
     [java] Column 91 took 21.0 ms
     [java] Column 92 took 21.0 ms
     [java] Column 93 took 20.0 ms
     [java] Column 94 took 20.0 ms
     [java] Column 95 took 20.0 ms
     [java] Column 96 took 22.0 ms
     [java] Column 97 took 32.0 ms
     [java] Column 98 took 25.0 ms
     [java] Column 99 took 33.0 ms
     [java] Column 100 took 29.0 ms
     [java] Column 101 took 22.0 ms
     [java] Column 102 took 22.0 ms
     [java] Column 103 took 22.0 ms
     [java] Column 104 took 21.0 ms
     [java] Column 105 took 22.0 ms
     [java] Column 106 took 21.0 ms
     [java] Column 107 took 22.0 ms
     [java] Column 108 took 21.0 ms
     [java] Column 109 took 21.0 ms
     [java] Column 110 took 22.0 ms
     [java] Column 111 took 21.0 ms
     [java] Column 112 took 22.0 ms
     [java] Column 113 took 23.0 ms
     [java] Column 114 took 22.0 ms
     [java] Column 115 took 22.0 ms
     [java] Column 116 took 24.0 ms
     [java] Column 117 took 34.0 ms
     [java] Column 118 took 34.0 ms
     [java] Column 119 took 33.0 ms
     [java] Column 120 took 22.0 ms
     [java] Column 121 took 22.0 ms
     [java] Column 122 took 22.0 ms
     [java] Column 123 took 22.0 ms
     [java] Column 124 took 22.0 ms
     [java] Column 125 took 22.0 ms
     [java] Column 126 took 22.0 ms
     [java] Column 127 took 24.0 ms
     [java] Column 128 took 36.0 ms
     [java] Column 129 took 56.0 ms
     [java] Column 130 took 35.0 ms
     [java] Column 131 took 35.0 ms
     [java] Column 132 took 22.0 ms
     [java] Column 133 took 21.0 ms
     [java] Column 134 took 22.0 ms
     [java] Column 135 took 21.0 ms
     [java] Column 136 took 21.0 ms
     [java] Column 137 took 22.0 ms
     [java] Column 138 took 21.0 ms
     [java] Auto sizing columns took a total of 3350.0 ms (24.100719424460433 ms per column)
     [java] Best fit width time per cell: 150629.4964028777 ns
     [java] Total time: 4.844 s
     [java] ............I.........................................Cell formula evaluation
currently unsupported
     [java] Array formulas currently unsupported
     [java] .......................................................................................................................................I.....................................................
     [java] Time: 156.543
     [java] There were 3 failures:
     [java] 1) initializationError(org.apache.poi.ss.usermodel.BaseTestXWorkbook)
     [java] java.lang.Exception: Test class should have exactly one public constructor
     [java] 	at org.junit.runners.BlockJUnit4ClassRunner.validateOnlyOneConstructor(BlockJUnit4ClassRunner.java:158)
     [java] 	at org.junit.runners.BlockJUnit4ClassRunner.validateConstructor(BlockJUnit4ClassRunner.java:147)
     [java] 	at org.junit.runners.BlockJUnit4ClassRunner.collectInitializationErrors(BlockJUnit4ClassRunner.java:127)
     [java] 	at org.junit.runners.ParentRunner.validate(ParentRunner.java:416)
     [java] 	at org.junit.runners.ParentRunner.<init>(ParentRunner.java:84)
     [java] 	at org.junit.runners.BlockJUnit4ClassRunner.<init>(BlockJUnit4ClassRunner.java:65)
     [java] 	at org.junit.internal.builders.JUnit4Builder.runnerForClass(JUnit4Builder.java:10)
     [java] 	at org.junit.runners.model.RunnerBuilder.safeRunnerForClass(RunnerBuilder.java:59)
     [java] 	at org.junit.internal.builders.AllDefaultPossibilitiesBuilder.runnerForClass(AllDefaultPossibilitiesBuilder.java:26)
     [java] 	at org.junit.runner.Computer.getRunner(Computer.java:40)
     [java] 	at org.junit.runner.Computer$1.runnerForClass(Computer.java:31)
     [java] 	at org.junit.runners.model.RunnerBuilder.safeRunnerForClass(RunnerBuilder.java:59)
     [java] 	at org.junit.runners.model.RunnerBuilder.runners(RunnerBuilder.java:101)
     [java] 	at org.junit.runners.model.RunnerBuilder.runners(RunnerBuilder.java:87)
     [java] 	at org.junit.runners.Suite.<init>(Suite.java:81)
     [java] 	at org.junit.runner.Computer.getSuite(Computer.java:28)
     [java] 	at org.junit.runner.Request.classes(Request.java:75)
     [java] 	at org.junit.runner.JUnitCore.run(JUnitCore.java:105)
     [java] 	at org.junit.runner.JUnitCore.run(JUnitCore.java:94)
     [java] 	at org.apache.poi.util.OOXMLLite.build(OOXMLLite.java:104)
     [java] 	at org.apache.poi.util.OOXMLLite.main(OOXMLLite.java:87)
     [java] 2) initializationError(org.apache.poi.ss.usermodel.BaseTestXSheet)
     [java] java.lang.Exception: Test class should have exactly one public constructor
     [java] 	at org.junit.runners.BlockJUnit4ClassRunner.validateOnlyOneConstructor(BlockJUnit4ClassRunner.java:158)
     [java] 	at org.junit.runners.BlockJUnit4ClassRunner.validateConstructor(BlockJUnit4ClassRunner.java:147)
     [java] 	at org.junit.runners.BlockJUnit4ClassRunner.collectInitializationErrors(BlockJUnit4ClassRunner.java:127)
     [java] 	at org.junit.runners.ParentRunner.validate(ParentRunner.java:416)
     [java] 	at org.junit.runners.ParentRunner.<init>(ParentRunner.java:84)
     [java] 	at org.junit.runners.BlockJUnit4ClassRunner.<init>(BlockJUnit4ClassRunner.java:65)
     [java] 	at org.junit.internal.builders.JUnit4Builder.runnerForClass(JUnit4Builder.java:10)
     [java] 	at org.junit.runners.model.RunnerBuilder.safeRunnerForClass(RunnerBuilder.java:59)
     [java] 	at org.junit.internal.builders.AllDefaultPossibilitiesBuilder.runnerForClass(AllDefaultPossibilitiesBuilder.java:26)
     [java] 	at org.junit.runner.Computer.getRunner(Computer.java:40)
     [java] 	at org.junit.runner.Computer$1.runnerForClass(Computer.java:31)
     [java] 	at org.junit.runners.model.RunnerBuilder.safeRunnerForClass(RunnerBuilder.java:59)
     [java] 	at org.junit.runners.model.RunnerBuilder.runners(RunnerBuilder.java:101)
     [java] 	at org.junit.runners.model.RunnerBuilder.runners(RunnerBuilder.java:87)
     [java] 	at org.junit.runners.Suite.<init>(Suite.java:81)
     [java] 	at org.junit.runner.Computer.getSuite(Computer.java:28)
     [java] 	at org.junit.runner.Request.classes(Request.java:75)
     [java] 	at org.junit.runner.JUnitCore.run(JUnitCore.java:105)
     [java] 	at org.junit.runner.JUnitCore.run(JUnitCore.java:94)
     [java] 	at org.apache.poi.util.OOXMLLite.build(OOXMLLite.java:104)
     [java] 	at org.apache.poi.util.OOXMLLite.main(OOXMLLite.java:87)
     [java] 3) initializationError(org.apache.poi.ss.usermodel.BaseTestXRow)
     [java] java.lang.Exception: Test class should have exactly one public constructor
     [java] 	at org.junit.runners.BlockJUnit4ClassRunner.validateOnlyOneConstructor(BlockJUnit4ClassRunner.java:158)
     [java] 	at org.junit.runners.BlockJUnit4ClassRunner.validateConstructor(BlockJUnit4ClassRunner.java:147)
     [java] 	at org.junit.runners.BlockJUnit4ClassRunner.collectInitializationErrors(BlockJUnit4ClassRunner.java:127)
     [java] 	at org.junit.runners.ParentRunner.validate(ParentRunner.java:416)
     [java] 	at org.junit.runners.ParentRunner.<init>(ParentRunner.java:84)
     [java] 	at org.junit.runners.BlockJUnit4ClassRunner.<init>(BlockJUnit4ClassRunner.java:65)
     [java] 	at org.junit.internal.builders.JUnit4Builder.runnerForClass(JUnit4Builder.java:10)
     [java] 	at org.junit.runners.model.RunnerBuilder.safeRunnerForClass(RunnerBuilder.java:59)
     [java] 	at org.junit.internal.builders.AllDefaultPossibilitiesBuilder.runnerForClass(AllDefaultPossibilitiesBuilder.java:26)
     [java] 	at org.junit.runner.Computer.getRunner(Computer.java:40)
     [java] 	at org.junit.runner.Computer$1.runnerForClass(Computer.java:31)
     [java] 	at org.junit.runners.model.RunnerBuilder.safeRunnerForClass(RunnerBuilder.java:59)
     [java] 	at org.junit.runners.model.RunnerBuilder.runners(RunnerBuilder.java:101)
     [java] 	at org.junit.runners.model.RunnerBuilder.runners(RunnerBuilder.java:87)
     [java] 	at org.junit.runners.Suite.<init>(Suite.java:81)
     [java] 	at org.junit.runner.Computer.getSuite(Computer.java:28)
     [java] 	at org.junit.runner.Request.classes(Request.java:75)
     [java] 	at org.junit.runner.JUnitCore.run(JUnitCore.java:105)
     [java] 	at org.junit.runner.JUnitCore.run(JUnitCore.java:94)
     [java] 	at org.apache.poi.util.OOXMLLite.build(OOXMLLite.java:104)
     [java] 	at org.apache.poi.util.OOXMLLite.main(OOXMLLite.java:87)
     [java] 
     [java] FAILURES!!!
     [java] Tests run: 1908,  Failures: 3
     [java] 
     [java] Exception in thread "main" java.lang.RuntimeException: Tests did not succeed,
cannot build ooxml-lite jar
     [java] 	at org.apache.poi.util.OOXMLLite.build(OOXMLLite.java:106)
     [java] 	at org.apache.poi.util.OOXMLLite.main(OOXMLLite.java:87)

BUILD FAILED
<https://builds.apache.org/job/POI-JDK8/ws/build.xml>:1338: Java returned: 1

Total time: 6 minutes 58 seconds
Build step 'Invoke Ant' marked build as failure
[FINDBUGS] Skipping publisher since build result is FAILURE
[WARNINGS] Skipping publisher since build result is FAILURE
Archiving artifacts
Recording test results
ERROR: Step ?Publish JUnit test result report? failed: No test report files were found. Configuration
error?


---------------------------------------------------------------------
To unsubscribe, e-mail: dev-unsubscribe@poi.apache.org
For additional commands, e-mail: dev-help@poi.apache.org


Mime
View raw message