poi-dev mailing list archives

Site index · List index
Message view « Date » · « Thread »
Top « Date » · « Thread »
From Apache Jenkins Server <jenk...@builds.apache.org>
Subject Build failed in Jenkins: POI #1251
Date Fri, 15 Apr 2016 08:39:25 GMT
See <https://builds.apache.org/job/POI/1251/changes>

Changes:

[nick] Update the FAQ for the tested scratchpad class having moved

------------------------------------------
[...truncated 318 lines...]
     [java] Column 112 took 10.0 ms
     [java] Column 113 took 12.0 ms
     [java] Column 114 took 13.0 ms
     [java] Column 115 took 10.0 ms
     [java] Column 116 took 10.0 ms
     [java] Column 117 took 11.0 ms
     [java] Column 118 took 10.0 ms
     [java] Column 119 took 10.0 ms
     [java] Column 120 took 12.0 ms
     [java] Column 121 took 15.0 ms
     [java] Column 122 took 14.0 ms
     [java] Column 123 took 14.0 ms
     [java] Column 124 took 13.0 ms
     [java] Column 125 took 11.0 ms
     [java] Column 126 took 10.0 ms
     [java] Column 127 took 58.0 ms
     [java] Column 128 took 10.0 ms
     [java] Column 129 took 10.0 ms
     [java] Column 130 took 10.0 ms
     [java] Column 131 took 10.0 ms
     [java] Column 132 took 10.0 ms
     [java] Column 133 took 10.0 ms
     [java] Column 134 took 11.0 ms
     [java] Column 135 took 10.0 ms
     [java] Column 136 took 11.0 ms
     [java] Column 137 took 11.0 ms
     [java] Column 138 took 10.0 ms
     [java] Auto sizing columns took a total of 1967.0 ms (14.151079136690647 ms per column)
     [java] Best fit width time per cell: 88444.24460431654 ns
     [java] Total time: 1.986 s
     [java] .......................................................................................................................................................I....................................................Cell:
3E-104
     [java] Cell: 5E-104
     [java] Cell: 5E-106
     [java] Cell: 
     [java] II.........I......................I..............I.org.apache.poi.xssf.usermodel.XSSFWorkbook
column autosizing timing...
     [java] Populate sheet time: 1498.0 ms (67356.11510791368 ns/cell)
     [java] 
     [java] Autosizing...
     [java] Column 0 took 11.0 ms
     [java] Column 1 took 14.0 ms
     [java] Column 2 took 13.0 ms
     [java] Column 3 took 11.0 ms
     [java] Column 4 took 15.0 ms
     [java] Column 5 took 13.0 ms
     [java] Column 6 took 16.0 ms
     [java] Column 7 took 13.0 ms
     [java] Column 8 took 26.0 ms
     [java] Column 9 took 16.0 ms
     [java] Column 10 took 14.0 ms
     [java] Column 11 took 18.0 ms
     [java] Column 12 took 16.0 ms
     [java] Column 13 took 15.0 ms
     [java] Column 14 took 44.0 ms
     [java] Column 15 took 34.0 ms
     [java] Column 16 took 32.0 ms
     [java] Column 17 took 15.0 ms
     [java] Column 18 took 12.0 ms
     [java] Column 19 took 14.0 ms
     [java] Column 20 took 12.0 ms
     [java] Column 21 took 12.0 ms
     [java] Column 22 took 13.0 ms
     [java] Column 23 took 11.0 ms
     [java] Column 24 took 11.0 ms
     [java] Column 25 took 11.0 ms
     [java] Column 26 took 12.0 ms
     [java] Column 27 took 11.0 ms
     [java] Column 28 took 12.0 ms
     [java] Column 29 took 12.0 ms
     [java] Column 30 took 11.0 ms
     [java] Column 31 took 11.0 ms
     [java] Column 32 took 10.0 ms
     [java] Column 33 took 8.0 ms
     [java] Column 34 took 9.0 ms
     [java] Column 35 took 8.0 ms
     [java] Column 36 took 9.0 ms
     [java] Column 37 took 8.0 ms
     [java] Column 38 took 14.0 ms
     [java] Column 39 took 14.0 ms
     [java] Column 40 took 14.0 ms
     [java] Column 41 took 13.0 ms
     [java] Column 42 took 14.0 ms
     [java] Column 43 took 11.0 ms
     [java] Column 44 took 13.0 ms
     [java] Column 45 took 13.0 ms
     [java] Column 46 took 55.0 ms
     [java] Column 47 took 12.0 ms
     [java] Column 48 took 13.0 ms
     [java] Column 49 took 10.0 ms
     [java] Column 50 took 8.0 ms
     [java] Column 51 took 9.0 ms
     [java] Column 52 took 10.0 ms
     [java] Column 53 took 9.0 ms
     [java] Column 54 took 8.0 ms
     [java] Column 55 took 10.0 ms
     [java] Column 56 took 10.0 ms
     [java] Column 57 took 8.0 ms
     [java] Column 58 took 11.0 ms
     [java] Column 59 took 8.0 ms
     [java] Column 60 took 8.0 ms
     [java] Column 61 took 9.0 ms
     [java] Column 62 took 10.0 ms
     [java] Column 63 took 10.0 ms
     [java] Column 64 took 10.0 ms
     [java] Column 65 took 10.0 ms
     [java] Column 66 took 10.0 ms
     [java] Column 67 took 10.0 ms
     [java] Column 68 took 11.0 ms
     [java] Column 69 took 10.0 ms
     [java] Column 70 took 10.0 ms
     [java] Column 71 took 13.0 ms
     [java] Column 72 took 12.0 ms
     [java] Column 73 took 12.0 ms
     [java] Column 74 took 11.0 ms
     [java] Column 75 took 9.0 ms
     [java] Column 76 took 11.0 ms
     [java] Column 77 took 13.0 ms
     [java] Column 78 took 12.0 ms
     [java] Column 79 took 13.0 ms
     [java] Column 80 took 12.0 ms
     [java] Column 81 took 13.0 ms
     [java] Column 82 took 12.0 ms
     [java] Column 83 took 9.0 ms
     [java] Column 84 took 12.0 ms
     [java] Column 85 took 8.0 ms
     [java] Column 86 took 8.0 ms
     [java] Column 87 took 8.0 ms
     [java] Column 88 took 8.0 ms
     [java] Column 89 took 8.0 ms
     [java] Column 90 took 8.0 ms
     [java] Column 91 took 7.0 ms
     [java] Column 92 took 8.0 ms
     [java] Column 93 took 8.0 ms
     [java] Column 94 took 8.0 ms
     [java] Column 95 took 8.0 ms
     [java] Column 96 took 8.0 ms
     [java] Column 97 took 8.0 ms
     [java] Column 98 took 23.0 ms
     [java] Column 99 took 9.0 ms
     [java] Column 100 took 8.0 ms
     [java] Column 101 took 8.0 ms
     [java] Column 102 took 9.0 ms
     [java] Column 103 took 8.0 ms
     [java] Column 104 took 8.0 ms
     [java] Column 105 took 8.0 ms
     [java] Column 106 took 9.0 ms
     [java] Column 107 took 8.0 ms
     [java] Column 108 took 8.0 ms
     [java] Column 109 took 9.0 ms
     [java] Column 110 took 8.0 ms
     [java] Column 111 took 8.0 ms
     [java] Column 112 took 8.0 ms
     [java] Column 113 took 12.0 ms
     [java] Column 114 took 13.0 ms
     [java] Column 115 took 11.0 ms
     [java] Column 116 took 10.0 ms
     [java] Column 117 took 8.0 ms
     [java] Column 118 took 10.0 ms
     [java] Column 119 took 8.0 ms
     [java] Column 120 took 9.0 ms
     [java] Column 121 took 8.0 ms
     [java] Column 122 took 9.0 ms
     [java] Column 123 took 8.0 ms
     [java] Column 124 took 9.0 ms
     [java] Column 125 took 9.0 ms
     [java] Column 126 took 9.0 ms
     [java] Column 127 took 8.0 ms
     [java] Column 128 took 8.0 ms
     [java] Column 129 took 9.0 ms
     [java] Column 130 took 8.0 ms
     [java] Column 131 took 8.0 ms
     [java] Column 132 took 9.0 ms
     [java] Column 133 took 8.0 ms
     [java] Column 134 took 9.0 ms
     [java] Column 135 took 8.0 ms
     [java] Column 136 took 9.0 ms
     [java] Column 137 took 9.0 ms
     [java] Column 138 took 9.0 ms
     [java] Auto sizing columns took a total of 1596.0 ms (11.482014388489208 ms per column)
     [java] Best fit width time per cell: 71762.58992805755 ns
     [java] Total time: 3.094 s
     [java] ............I.........................................Cell formula evaluation
currently unsupported
     [java] Array formulas currently unsupported
     [java] ....................................................................................................................................I.....................................................
     [java] Time: 183.029
     [java] There was 1 failure:
     [java] 1) testSignEnvelopingDocument(org.apache.poi.poifs.crypt.TestSignatureInfo)
     [java] java.lang.RuntimeException: error while creating a time-stamp: Error contacting
TSP server http://timestamp.comodoca.com/rfc3161
     [java] 	at org.apache.poi.poifs.crypt.dsig.facets.XAdESXLSignatureFacet.createXAdESTimeStamp(XAdESXLSignatureFacet.java:366)
     [java] 	at org.apache.poi.poifs.crypt.dsig.facets.XAdESXLSignatureFacet.createXAdESTimeStamp(XAdESXLSignatureFacet.java:357)
     [java] 	at org.apache.poi.poifs.crypt.dsig.facets.XAdESXLSignatureFacet.postSign(XAdESXLSignatureFacet.java:160)
     [java] 	at org.apache.poi.poifs.crypt.dsig.SignatureInfo.postSign(SignatureInfo.java:587)
     [java] 	at org.apache.poi.poifs.crypt.dsig.SignatureInfo.confirmSignature(SignatureInfo.java:321)
     [java] 	at org.apache.poi.poifs.crypt.TestSignatureInfo.testSignEnvelopingDocument(TestSignatureInfo.java:386)
     [java] 	at sun.reflect.NativeMethodAccessorImpl.invoke0(Native Method)
     [java] 	at sun.reflect.NativeMethodAccessorImpl.invoke(NativeMethodAccessorImpl.java:39)
     [java] 	at sun.reflect.DelegatingMethodAccessorImpl.invoke(DelegatingMethodAccessorImpl.java:25)
     [java] 	at java.lang.reflect.Method.invoke(Method.java:597)
     [java] 	at org.junit.runners.model.FrameworkMethod$1.runReflectiveCall(FrameworkMethod.java:50)
     [java] 	at org.junit.internal.runners.model.ReflectiveCallable.run(ReflectiveCallable.java:12)
     [java] 	at org.junit.runners.model.FrameworkMethod.invokeExplosively(FrameworkMethod.java:47)
     [java] 	at org.junit.internal.runners.statements.InvokeMethod.evaluate(InvokeMethod.java:17)
     [java] 	at org.junit.runners.ParentRunner.runLeaf(ParentRunner.java:325)
     [java] 	at org.junit.runners.BlockJUnit4ClassRunner.runChild(BlockJUnit4ClassRunner.java:78)
     [java] 	at org.junit.runners.BlockJUnit4ClassRunner.runChild(BlockJUnit4ClassRunner.java:57)
     [java] 	at org.junit.runners.ParentRunner$3.run(ParentRunner.java:290)
     [java] 	at org.junit.runners.ParentRunner$1.schedule(ParentRunner.java:71)
     [java] 	at org.junit.runners.ParentRunner.runChildren(ParentRunner.java:288)
     [java] 	at org.junit.runners.ParentRunner.access$000(ParentRunner.java:58)
     [java] 	at org.junit.runners.ParentRunner$2.evaluate(ParentRunner.java:268)
     [java] 	at org.junit.internal.runners.statements.RunBefores.evaluate(RunBefores.java:26)
     [java] 	at org.junit.runners.ParentRunner.run(ParentRunner.java:363)
     [java] 	at org.junit.runners.Suite.runChild(Suite.java:128)
     [java] 	at org.junit.runners.Suite.runChild(Suite.java:27)
     [java] 	at org.junit.runners.ParentRunner$3.run(ParentRunner.java:290)
     [java] 	at org.junit.runners.ParentRunner$1.schedule(ParentRunner.java:71)
     [java] 	at org.junit.runners.ParentRunner.runChildren(ParentRunner.java:288)
     [java] 	at org.junit.runners.ParentRunner.access$000(ParentRunner.java:58)
     [java] 	at org.junit.runners.ParentRunner$2.evaluate(ParentRunner.java:268)
     [java] 	at org.junit.runners.ParentRunner.run(ParentRunner.java:363)
     [java] 	at org.junit.runner.JUnitCore.run(JUnitCore.java:137)
     [java] 	at org.junit.runner.JUnitCore.run(JUnitCore.java:115)
     [java] 	at org.junit.runner.JUnitCore.run(JUnitCore.java:105)
     [java] 	at org.junit.runner.JUnitCore.run(JUnitCore.java:94)
     [java] 	at org.apache.poi.util.OOXMLLite.build(OOXMLLite.java:104)
     [java] 	at org.apache.poi.util.OOXMLLite.main(OOXMLLite.java:87)
     [java] Caused by: java.io.IOException: Error contacting TSP server http://timestamp.comodoca.com/rfc3161
     [java] 	at org.apache.poi.poifs.crypt.dsig.services.TSPTimeStampService.timeStamp(TSPTimeStampService.java:154)
     [java] 	at org.apache.poi.poifs.crypt.dsig.facets.XAdESXLSignatureFacet.createXAdESTimeStamp(XAdESXLSignatureFacet.java:364)
     [java] 	... 37 more
     [java] 
     [java] FAILURES!!!
     [java] Tests run: 1903,  Failures: 1
     [java] 
     [java] Exception in thread "main" java.lang.RuntimeException: Tests did not succeed,
cannot build ooxml-lite jar
     [java] 	at org.apache.poi.util.OOXMLLite.build(OOXMLLite.java:106)
     [java] 	at org.apache.poi.util.OOXMLLite.main(OOXMLLite.java:87)

BUILD FAILED
<https://builds.apache.org/job/POI/ws/build.xml>:1338: Java returned: 1

Total time: 3 minutes 52 seconds
Build step 'Invoke Ant' marked build as failure
[FINDBUGS] Skipping publisher since build result is FAILURE
[WARNINGS] Skipping publisher since build result is FAILURE
Archiving artifacts
Compressed 66.84 MB of artifacts by 57.2% relative to #1250
Recording test results
ERROR: Step ?Publish JUnit test result report? failed: No test report files were found. Configuration
error?


---------------------------------------------------------------------
To unsubscribe, e-mail: dev-unsubscribe@poi.apache.org
For additional commands, e-mail: dev-help@poi.apache.org


Mime
View raw message