poi-dev mailing list archives

Site index · List index
Message view « Date » · « Thread »
Top « Date » · « Thread »
From Apache Jenkins Server <jenk...@builds.apache.org>
Subject Build failed in Jenkins: POI-JDK8 #920
Date Tue, 05 Apr 2016 10:41:06 GMT
See <https://builds.apache.org/job/POI-JDK8/920/changes>

Changes:

[centic] Add FAQ about multi-threaded access

------------------------------------------
[...truncated 2418 lines...]
    [junit] Tests run: 15, Failures: 0, Errors: 0, Time elapsed: 0.393 sec
    [junit] Running org.apache.poi.xssf.extractor.TestXSSFImportFromXML
    [junit] Tests run: 5, Failures: 0, Errors: 0, Time elapsed: 0.153 sec
    [junit] Running org.apache.poi.xssf.io.TestLoadSaveXSSF
    [junit] Tests run: 3, Failures: 0, Errors: 0, Time elapsed: 0.045 sec
    [junit] Running org.apache.poi.xssf.model.TestCalculationChain
    [junit] Tests run: 1, Failures: 0, Errors: 0, Time elapsed: 0.458 sec
    [junit] Running org.apache.poi.xssf.model.TestCommentsTable
    [junit] Tests run: 7, Failures: 0, Errors: 0, Time elapsed: 0.153 sec
    [junit] Running org.apache.poi.xssf.model.TestExternalLinksTable
    [junit] Tests run: 4, Failures: 0, Errors: 0, Time elapsed: 0.079 sec
    [junit] Running org.apache.poi.xssf.model.TestMapInfo
    [junit] Tests run: 1, Failures: 0, Errors: 0, Time elapsed: 0.008 sec
    [junit] Running org.apache.poi.xssf.model.TestSharedStringsTable
    [junit] Tests run: 3, Failures: 0, Errors: 0, Time elapsed: 0.073 sec
    [junit] Running org.apache.poi.xssf.model.TestStylesTable
    [junit] Tests run: 11, Failures: 0, Errors: 0, Time elapsed: 0.179 sec
    [junit] Running org.apache.poi.xssf.model.TestThemesTable
    [junit] Tests run: 3, Failures: 0, Errors: 0, Time elapsed: 0.091 sec
    [junit] Running org.apache.poi.xssf.streaming.TestAutoSizeColumnTracker
    [junit] Tests run: 7, Failures: 0, Errors: 0, Time elapsed: 0.064 sec
    [junit] Running org.apache.poi.xssf.streaming.TestOutlining
    [junit] Tests run: 6, Failures: 0, Errors: 0, Time elapsed: 0.074 sec
    [junit] Running org.apache.poi.xssf.streaming.TestSXSSFCell
    [junit] Tests run: 30, Failures: 0, Errors: 0, Time elapsed: 0.365 sec
    [junit] Running org.apache.poi.xssf.streaming.TestSXSSFDataValidation
    [junit] Tests run: 2, Failures: 0, Errors: 0, Time elapsed: 0.184 sec
    [junit] Running org.apache.poi.xssf.streaming.TestSXSSFFormulaEvaluation
    [junit] Tests run: 5, Failures: 0, Errors: 0, Time elapsed: 0.038 sec
    [junit] Running org.apache.poi.xssf.streaming.TestSXSSFHyperlink
    [junit] Tests run: 2, Failures: 0, Errors: 0, Time elapsed: 0.021 sec
    [junit] Running org.apache.poi.xssf.streaming.TestSXSSFRow
    [junit] Tests run: 3, Failures: 0, Errors: 0, Time elapsed: 0.13 sec
    [junit] Running org.apache.poi.xssf.streaming.TestSXSSFSheet
    [junit] Tests run: 45, Failures: 0, Errors: 0, Time elapsed: 1.985 sec
    [junit] Running org.apache.poi.xssf.streaming.TestSXSSFSheetAutoSizeColumn
    [junit] Tests run: 26, Failures: 0, Errors: 0, Time elapsed: 0.575 sec
    [junit] Running org.apache.poi.xssf.streaming.TestSXSSFWorkbook
    [junit] Tests run: 30, Failures: 0, Errors: 0, Time elapsed: 1.035 sec
    [junit] Running org.apache.poi.xssf.usermodel.TestFormulaEvaluatorOnXSSF
    [junit] Tests run: 369, Failures: 0, Errors: 0, Time elapsed: 4.382 sec
    [junit] Running org.apache.poi.xssf.usermodel.TestMissingWorkbookOnXSSF
    [junit] Tests run: 3, Failures: 0, Errors: 0, Time elapsed: 0.049 sec
    [junit] Running org.apache.poi.xssf.usermodel.TestMultiSheetFormulaEvaluatorOnXSSF
    [junit] Tests run: 2, Failures: 0, Errors: 0, Time elapsed: 0.01 sec
    [junit] Running org.apache.poi.xssf.usermodel.TestSXSSFBugs
    [junit] Tests run: 25, Failures: 0, Errors: 0, Time elapsed: 7.479 sec
    [junit] Running org.apache.poi.xssf.usermodel.TestSheetHiding
    [junit] Tests run: 5, Failures: 0, Errors: 0, Time elapsed: 0.137 sec
    [junit] Running org.apache.poi.xssf.usermodel.TestXSSFBugs
    [junit] Tests run: 116, Failures: 0, Errors: 0, Time elapsed: 17.733 sec
    [junit] Running org.apache.poi.xssf.usermodel.TestXSSFCell
    [junit] Tests run: 49, Failures: 0, Errors: 0, Time elapsed: 0.872 sec
    [junit] Running org.apache.poi.xssf.usermodel.TestXSSFCellStyle
    [junit] Tests run: 41, Failures: 0, Errors: 0, Time elapsed: 0.411 sec
    [junit] Running org.apache.poi.xssf.usermodel.TestXSSFChart
    [junit] Tests run: 3, Failures: 0, Errors: 0, Time elapsed: 0.081 sec
    [junit] Running org.apache.poi.xssf.usermodel.TestXSSFChartSheet
    [junit] Tests run: 3, Failures: 0, Errors: 0, Time elapsed: 0.027 sec
    [junit] Running org.apache.poi.xssf.usermodel.TestXSSFColGrouping
    [junit] Tests run: 6, Failures: 0, Errors: 0, Time elapsed: 0.068 sec
    [junit] Running org.apache.poi.xssf.usermodel.TestXSSFColor
    [junit] Tests run: 3, Failures: 0, Errors: 0, Time elapsed: 0.046 sec
    [junit] Running org.apache.poi.xssf.usermodel.TestXSSFComment
    [junit] Tests run: 13, Failures: 0, Errors: 0, Time elapsed: 0.186 sec
    [junit] Running org.apache.poi.xssf.usermodel.TestXSSFConditionalFormatting
    [junit] Tests run: 17, Failures: 0, Errors: 0, Time elapsed: 0.177 sec
    [junit] Running org.apache.poi.xssf.usermodel.TestXSSFDataFormat
    [junit] Tests run: 7, Failures: 0, Errors: 0, Time elapsed: 0.069 sec
    [junit] Running org.apache.poi.xssf.usermodel.TestXSSFDataValidation
    [junit] Tests run: 6, Failures: 0, Errors: 0, Time elapsed: 0.234 sec
    [junit] Running org.apache.poi.xssf.usermodel.TestXSSFDialogSheet
    [junit] Tests run: 14, Failures: 0, Errors: 0, Time elapsed: 0.13 sec
    [junit] Running org.apache.poi.xssf.usermodel.TestXSSFDrawing
    [junit] Tests run: 18, Failures: 0, Errors: 0, Time elapsed: 0.277 sec
    [junit] Running org.apache.poi.xssf.usermodel.TestXSSFExternalFunctions
    [junit] Tests run: 2, Failures: 0, Errors: 0, Time elapsed: 0.018 sec
    [junit] Running org.apache.poi.xssf.usermodel.TestXSSFFont
    [junit] Tests run: 21, Failures: 0, Errors: 0, Time elapsed: 0.193 sec
    [junit] Running org.apache.poi.xssf.usermodel.TestXSSFFormulaEvaluation
    [junit] Tests run: 24, Failures: 0, Errors: 0, Time elapsed: 0.764 sec
    [junit] Running org.apache.poi.xssf.usermodel.TestXSSFFormulaParser
    [junit] Tests run: 6, Failures: 0, Errors: 0, Time elapsed: 0.07 sec
    [junit] Running org.apache.poi.xssf.usermodel.TestXSSFHeaderFooter
    [junit] Tests run: 2, Failures: 0, Errors: 0, Time elapsed: 0.017 sec
    [junit] Running org.apache.poi.xssf.usermodel.TestXSSFHyperlink
    [junit] Tests run: 10, Failures: 0, Errors: 0, Time elapsed: 0.229 sec
    [junit] Running org.apache.poi.xssf.usermodel.TestXSSFName
    [junit] Tests run: 21, Failures: 0, Errors: 0, Time elapsed: 0.173 sec
    [junit] Running org.apache.poi.xssf.usermodel.TestXSSFPicture
    [junit] Tests run: 6, Failures: 0, Errors: 0, Time elapsed: 0.083 sec
    [junit] Running org.apache.poi.xssf.usermodel.TestXSSFPictureData
    [junit] Tests run: 3, Failures: 0, Errors: 0, Time elapsed: 0.057 sec
    [junit] Running org.apache.poi.xssf.usermodel.TestXSSFPivotTable
    [junit] Tests run: 13, Failures: 0, Errors: 0, Time elapsed: 0.144 sec
    [junit] Running org.apache.poi.xssf.usermodel.TestXSSFPrintSetup
    [junit] Tests run: 18, Failures: 0, Errors: 0, Time elapsed: 0.129 sec
    [junit] Running org.apache.poi.xssf.usermodel.TestXSSFRichTextString
    [junit] Tests run: 17, Failures: 0, Errors: 0, Time elapsed: 0.188 sec
    [junit] Running org.apache.poi.xssf.usermodel.TestXSSFRow
    [junit] Tests run: 3, Failures: 0, Errors: 0, Time elapsed: 2.329 sec
    [junit] Running org.apache.poi.xssf.usermodel.TestXSSFSheet
    [junit] Tests run: 84, Failures: 0, Errors: 0, Time elapsed: 3.35 sec
    [junit] Running org.apache.poi.xssf.usermodel.TestXSSFSheetAutosizeColumn
    [junit] Tests run: 7, Failures: 0, Errors: 0, Time elapsed: 0.098 sec
    [junit] Running org.apache.poi.xssf.usermodel.TestXSSFSheetMergeRegions
    [junit] Tests run: 1, Failures: 0, Errors: 0, Time elapsed: 2.18 sec
    [junit] Running org.apache.poi.xssf.usermodel.TestXSSFSheetRowGrouping
    [junit] Tests run: 6, Failures: 0, Errors: 0, Time elapsed: 0.143 sec
    [junit] Running org.apache.poi.xssf.usermodel.TestXSSFSheetShiftRows
    [junit] Tests run: 22, Failures: 0, Errors: 0, Time elapsed: 16.758 sec
    [junit] Running org.apache.poi.xssf.usermodel.TestXSSFSheetUpdateArrayFormulas
    [junit] Tests run: 16, Failures: 0, Errors: 0, Time elapsed: 0.388 sec
    [junit] Running org.apache.poi.xssf.usermodel.TestXSSFSimpleShape
    [junit] Tests run: 1, Failures: 0, Errors: 0, Time elapsed: 0.094 sec
    [junit] Running org.apache.poi.xssf.usermodel.TestXSSFTable
    [junit] Tests run: 2, Failures: 0, Errors: 0, Time elapsed: 0.071 sec
    [junit] Running org.apache.poi.xssf.usermodel.TestXSSFTextParagraph
    [junit] Tests run: 1, Failures: 0, Errors: 0, Time elapsed: 0.013 sec
    [junit] Running org.apache.poi.xssf.usermodel.TestXSSFTextRun
    [junit] Tests run: 1, Failures: 0, Errors: 0, Time elapsed: 0.01 sec
    [junit] Running org.apache.poi.xssf.usermodel.TestXSSFVMLDrawing
    [junit] Tests run: 3, Failures: 0, Errors: 0, Time elapsed: 0.035 sec
    [junit] Running org.apache.poi.xssf.usermodel.TestXSSFWorkbook
    [junit] Tests run: 56, Failures: 0, Errors: 0, Time elapsed: 1.064 sec
    [junit] Running org.apache.poi.xssf.usermodel.charts.TestXSSFCategoryAxis
    [junit] Tests run: 1, Failures: 0, Errors: 0, Time elapsed: 0.057 sec
    [junit] Running org.apache.poi.xssf.usermodel.charts.TestXSSFChartAxis
    [junit] Tests run: 8, Failures: 0, Errors: 0, Time elapsed: 0.057 sec
    [junit] Running org.apache.poi.xssf.usermodel.charts.TestXSSFChartLegend
    [junit] Tests run: 3, Failures: 0, Errors: 0, Time elapsed: 0.043 sec
    [junit] Running org.apache.poi.xssf.usermodel.charts.TestXSSFChartTitle
    [junit] Tests run: 3, Failures: 0, Errors: 0, Time elapsed: 0.054 sec
    [junit] Running org.apache.poi.xssf.usermodel.charts.TestXSSFLineChartData
    [junit] Tests run: 1, Failures: 0, Errors: 0, Time elapsed: 0.01 sec
    [junit] Running org.apache.poi.xssf.usermodel.charts.TestXSSFManualLayout
    [junit] Tests run: 2, Failures: 0, Errors: 0, Time elapsed: 0.046 sec
    [junit] Running org.apache.poi.xssf.usermodel.charts.TestXSSFScatterChartData
    [junit] Tests run: 1, Failures: 0, Errors: 0, Time elapsed: 0.011 sec
    [junit] Running org.apache.poi.xssf.usermodel.charts.TestXSSFValueAxis
    [junit] Tests run: 1, Failures: 0, Errors: 0, Time elapsed: 0.005 sec
    [junit] Running org.apache.poi.xssf.usermodel.extensions.TestXSSFBorder
    [junit] Tests run: 1, Failures: 0, Errors: 0, Time elapsed: 0.02 sec
    [junit] Running org.apache.poi.xssf.usermodel.extensions.TestXSSFCellFill
    [junit] Tests run: 5, Failures: 0, Errors: 0, Time elapsed: 0.057 sec
    [junit] Running org.apache.poi.xssf.usermodel.extensions.TestXSSFSheetComments
    [junit] Tests run: 1, Failures: 0, Errors: 0, Time elapsed: 0.004 sec
    [junit] Running org.apache.poi.xssf.usermodel.helpers.TestColumnHelper
    [junit] Tests run: 15, Failures: 0, Errors: 0, Time elapsed: 0.146 sec
    [junit] Running org.apache.poi.xssf.usermodel.helpers.TestHeaderFooterHelper
    [junit] Tests run: 2, Failures: 0, Errors: 0, Time elapsed: 0.024 sec
    [junit] Running org.apache.poi.xssf.util.TestCTColComparator
    [junit] Tests run: 2, Failures: 0, Errors: 0, Time elapsed: 0.022 sec
    [junit] Running org.apache.poi.xssf.util.TestEvilUnclosedBRFixingInputStream
    [junit] Tests run: 3, Failures: 0, Errors: 0, Time elapsed: 0.071 sec
    [junit] Running org.apache.poi.xssf.util.TestNumericRanges
    [junit] Tests run: 2, Failures: 0, Errors: 0, Time elapsed: 0.017 sec
    [junit] Running org.apache.poi.xwpf.TestAllExtendedProperties
    [junit] Tests run: 1, Failures: 0, Errors: 0, Time elapsed: 0.045 sec
    [junit] Running org.apache.poi.xwpf.TestDocumentProtection
    [junit] Tests run: 10, Failures: 0, Errors: 0, Time elapsed: 0.4 sec
    [junit] Running org.apache.poi.xwpf.TestPackageCorePropertiesGetKeywords
    [junit] Tests run: 1, Failures: 0, Errors: 0, Time elapsed: 0.012 sec
    [junit] Running org.apache.poi.xwpf.TestXWPFBugs
    [junit] Tests run: 3, Failures: 0, Errors: 0, Time elapsed: 0.197 sec
    [junit] Running org.apache.poi.xwpf.extractor.TestExternalEntities
    [junit] Tests run: 1, Failures: 0, Errors: 0, Time elapsed: 0.009 sec
    [junit] Running org.apache.poi.xwpf.extractor.TestXWPFWordExtractor
    [junit] Tests run: 18, Failures: 0, Errors: 0, Time elapsed: 0.411 sec
    [junit] Running org.apache.poi.xwpf.model.TestXWPFDecorators
    [junit] Tests run: 2, Failures: 0, Errors: 0, Time elapsed: 0.053 sec
    [junit] Running org.apache.poi.xwpf.model.TestXWPFHeaderFooterPolicy
    [junit] Tests run: 3, Failures: 0, Errors: 0, Time elapsed: 0.099 sec
    [junit] Running org.apache.poi.xwpf.usermodel.TestChangeTracking
    [junit] Tests run: 3, Failures: 0, Errors: 0, Time elapsed: 0.027 sec
    [junit] Running org.apache.poi.xwpf.usermodel.TestXWPFBugs
    [junit] Tests run: 8, Failures: 0, Errors: 0, Time elapsed: 0.079 sec
    [junit] Running org.apache.poi.xwpf.usermodel.TestXWPFDocument
    [junit] Tests run: 19, Failures: 0, Errors: 0, Time elapsed: 0.303 sec
    [junit] Running org.apache.poi.xwpf.usermodel.TestXWPFFootnotes
    [junit] Tests run: 2, Failures: 0, Errors: 0, Time elapsed: 0.027 sec
    [junit] Running org.apache.poi.xwpf.usermodel.TestXWPFHeader
    [junit] Tests run: 8, Failures: 0, Errors: 0, Time elapsed: 0.171 sec
    [junit] Running org.apache.poi.xwpf.usermodel.TestXWPFHeadings
    [junit] Tests run: 1, Failures: 0, Errors: 0, Time elapsed: 0.057 sec
    [junit] Running org.apache.poi.xwpf.usermodel.TestXWPFNumbering
    [junit] Tests run: 6, Failures: 0, Errors: 0, Time elapsed: 0.091 sec
    [junit] Running org.apache.poi.xwpf.usermodel.TestXWPFParagraph
    [junit] Tests run: 21, Failures: 0, Errors: 0, Time elapsed: 0.142 sec
    [junit] Running org.apache.poi.xwpf.usermodel.TestXWPFPictureData
    [junit] Tests run: 5, Failures: 0, Errors: 0, Time elapsed: 0.104 sec
    [junit] Running org.apache.poi.xwpf.usermodel.TestXWPFRun
    [junit] Tests run: 21, Failures: 0, Errors: 0, Time elapsed: 0.194 sec
    [junit] Running org.apache.poi.xwpf.usermodel.TestXWPFSDT
    [junit] Tests run: 4, Failures: 0, Errors: 0, Time elapsed: 0.098 sec
    [junit] Running org.apache.poi.xwpf.usermodel.TestXWPFSmartTag
    [junit] Tests run: 1, Failures: 0, Errors: 0, Time elapsed: 0.007 sec
    [junit] Running org.apache.poi.xwpf.usermodel.TestXWPFStyles
    [junit] Tests run: 8, Failures: 0, Errors: 0, Time elapsed: 0.185 sec
    [junit] Running org.apache.poi.xwpf.usermodel.TestXWPFTable
    [junit] Tests run: 12, Failures: 0, Errors: 0, Time elapsed: 0.197 sec
    [junit] Running org.apache.poi.xwpf.usermodel.TestXWPFTableCell
    [junit] Tests run: 4, Failures: 0, Errors: 0, Time elapsed: 0.039 sec
    [junit] Running org.apache.poi.xwpf.usermodel.TestXWPFTableRow
    [junit] Tests run: 3, Failures: 0, Errors: 0, Time elapsed: 0.043 sec
[jacoco:coverage] Enhancing junit with coverage
    [junit] Running org.apache.poi.poifs.crypt.TestSignatureInfo
    [junit] Tests run: 11, Failures: 0, Errors: 0, Time elapsed: 8.063 sec

testcoveragereport:
    [mkdir] Created dir: /x1/jenkins/jenkins-slave/workspace/POI-JDK8/build/coverage
[jacoco:report] Loading execution data file /x1/jenkins/jenkins-slave/workspace/POI-JDK8/build/jacoco-excelant.exec
[jacoco:report] Loading execution data file /x1/jenkins/jenkins-slave/workspace/POI-JDK8/build/jacoco-main.exec
[jacoco:report] Loading execution data file /x1/jenkins/jenkins-slave/workspace/POI-JDK8/build/jacoco-ooxml-lite-xmlsec.exec
[jacoco:report] Loading execution data file /x1/jenkins/jenkins-slave/workspace/POI-JDK8/build/jacoco-ooxml-lite.exec
[jacoco:report] Loading execution data file /x1/jenkins/jenkins-slave/workspace/POI-JDK8/build/jacoco-ooxml-xmlsec.exec
[jacoco:report] Loading execution data file /x1/jenkins/jenkins-slave/workspace/POI-JDK8/build/jacoco-ooxml.exec
[jacoco:report] Loading execution data file /x1/jenkins/jenkins-slave/workspace/POI-JDK8/build/jacoco-scratchpad.exec
[jacoco:report] Writing bundle 'Main' with 1469 classes
[jacoco:report] Writing bundle 'Scratchpad' with 607 classes
[jacoco:report] Writing bundle 'OOXML' with 555 classes
[jacoco:report] Writing bundle 'Excelant' with 13 classes
     [echo] Coverage results are available at build/coverage/index.html, build/coverage/coverage.xml

test-all:

compile-integration:
    [javac] Compiling 21 source files to /x1/jenkins/jenkins-slave/workspace/POI-JDK8/build/integration-test-classes
    [javac] warning: [options] bootstrap class path not set in conjunction with -source 1.6
    [javac] 1 warning

-test-integration-check:

test-integration:
[jacoco:coverage] Enhancing junit with coverage
    [junit] Handling 1114 files
    [junit] Running org.apache.poi.TestAllFiles
    [junit] Tests run: 1488, Failures: 2, Errors: 0, Time elapsed: 954.078 sec

BUILD FAILED
/x1/jenkins/jenkins-slave/workspace/POI-JDK8/build.xml:1305: Test org.apache.poi.TestAllFiles
failed

Total time: 28 minutes 17 seconds
Build step 'Invoke Ant' marked build as failure
[FINDBUGS] Skipping publisher since build result is FAILURE
[WARNINGS] Skipping publisher since build result is FAILURE
Archiving artifacts
Compressed 54.98 MB of artifacts by 97.7% relative to #919
Recording test results

---------------------------------------------------------------------
To unsubscribe, e-mail: dev-unsubscribe@poi.apache.org
For additional commands, e-mail: dev-help@poi.apache.org


Mime
View raw message