poi-dev mailing list archives

Site index · List index
Message view « Date » · « Thread »
Top « Date » · « Thread »
From Apache Jenkins Server <jenk...@builds.apache.org>
Subject Build failed in Jenkins: POI-JDK8 #959
Date Sun, 17 Apr 2016 10:16:45 GMT
See <https://builds.apache.org/job/POI-JDK8/959/changes>

Changes:

[onealj] add comments

[onealj] consolidate duplicates between TestXSSF* and TestSXSSF*

------------------------------------------
[...truncated 300 lines...]
     [java] Column 136 took 24.0 ms
     [java] Column 137 took 23.0 ms
     [java] Column 138 took 22.0 ms
     [java] Auto sizing columns took a total of 3732.0 ms (26.848920863309353 ms per column)
     [java] Best fit width time per cell: 167805.75539568346 ns
     [java] Total time: 3.742 s
     [java] .......................................................................................................................................................I....................................................Cell:
3E-104
     [java] Cell: 5E-104
     [java] Cell: 5E-106
     [java] Cell: 
     [java] II.........I......................I..............I.org.apache.poi.xssf.usermodel.XSSFWorkbook
column autosizing timing...
     [java] Populate sheet time: 1474.0 ms (66276.97841726619 ns/cell)
     [java] 
     [java] Autosizing...
     [java] Column 0 took 24.0 ms
     [java] Column 1 took 21.0 ms
     [java] Column 2 took 22.0 ms
     [java] Column 3 took 21.0 ms
     [java] Column 4 took 22.0 ms
     [java] Column 5 took 21.0 ms
     [java] Column 6 took 27.0 ms
     [java] Column 7 took 31.0 ms
     [java] Column 8 took 22.0 ms
     [java] Column 9 took 21.0 ms
     [java] Column 10 took 21.0 ms
     [java] Column 11 took 21.0 ms
     [java] Column 12 took 21.0 ms
     [java] Column 13 took 21.0 ms
     [java] Column 14 took 21.0 ms
     [java] Column 15 took 21.0 ms
     [java] Column 16 took 21.0 ms
     [java] Column 17 took 21.0 ms
     [java] Column 18 took 21.0 ms
     [java] Column 19 took 21.0 ms
     [java] Column 20 took 22.0 ms
     [java] Column 21 took 21.0 ms
     [java] Column 22 took 21.0 ms
     [java] Column 23 took 21.0 ms
     [java] Column 24 took 21.0 ms
     [java] Column 25 took 21.0 ms
     [java] Column 26 took 70.0 ms
     [java] Column 27 took 21.0 ms
     [java] Column 28 took 20.0 ms
     [java] Column 29 took 21.0 ms
     [java] Column 30 took 19.0 ms
     [java] Column 31 took 20.0 ms
     [java] Column 32 took 20.0 ms
     [java] Column 33 took 20.0 ms
     [java] Column 34 took 20.0 ms
     [java] Column 35 took 20.0 ms
     [java] Column 36 took 33.0 ms
     [java] Column 37 took 27.0 ms
     [java] Column 38 took 26.0 ms
     [java] Column 39 took 33.0 ms
     [java] Column 40 took 27.0 ms
     [java] Column 41 took 21.0 ms
     [java] Column 42 took 22.0 ms
     [java] Column 43 took 21.0 ms
     [java] Column 44 took 21.0 ms
     [java] Column 45 took 22.0 ms
     [java] Column 46 took 21.0 ms
     [java] Column 47 took 21.0 ms
     [java] Column 48 took 25.0 ms
     [java] Column 49 took 31.0 ms
     [java] Column 50 took 24.0 ms
     [java] Column 51 took 33.0 ms
     [java] Column 52 took 32.0 ms
     [java] Column 53 took 21.0 ms
     [java] Column 54 took 21.0 ms
     [java] Column 55 took 21.0 ms
     [java] Column 56 took 21.0 ms
     [java] Column 57 took 22.0 ms
     [java] Column 58 took 21.0 ms
     [java] Column 59 took 21.0 ms
     [java] Column 60 took 21.0 ms
     [java] Column 61 took 31.0 ms
     [java] Column 62 took 29.0 ms
     [java] Column 63 took 28.0 ms
     [java] Column 64 took 32.0 ms
     [java] Column 65 took 32.0 ms
     [java] Column 66 took 21.0 ms
     [java] Column 67 took 21.0 ms
     [java] Column 68 took 21.0 ms
     [java] Column 69 took 21.0 ms
     [java] Column 70 took 21.0 ms
     [java] Column 71 took 21.0 ms
     [java] Column 72 took 21.0 ms
     [java] Column 73 took 49.0 ms
     [java] Column 74 took 33.0 ms
     [java] Column 75 took 24.0 ms
     [java] Column 76 took 32.0 ms
     [java] Column 77 took 32.0 ms
     [java] Column 78 took 26.0 ms
     [java] Column 79 took 21.0 ms
     [java] Column 80 took 22.0 ms
     [java] Column 81 took 22.0 ms
     [java] Column 82 took 23.0 ms
     [java] Column 83 took 25.0 ms
     [java] Column 84 took 21.0 ms
     [java] Column 85 took 23.0 ms
     [java] Column 86 took 24.0 ms
     [java] Column 87 took 21.0 ms
     [java] Column 88 took 33.0 ms
     [java] Column 89 took 26.0 ms
     [java] Column 90 took 21.0 ms
     [java] Column 91 took 33.0 ms
     [java] Column 92 took 27.0 ms
     [java] Column 93 took 21.0 ms
     [java] Column 94 took 21.0 ms
     [java] Column 95 took 21.0 ms
     [java] Column 96 took 21.0 ms
     [java] Column 97 took 21.0 ms
     [java] Column 98 took 21.0 ms
     [java] Column 99 took 21.0 ms
     [java] Column 100 took 22.0 ms
     [java] Column 101 took 23.0 ms
     [java] Column 102 took 22.0 ms
     [java] Column 103 took 22.0 ms
     [java] Column 104 took 28.0 ms
     [java] Column 105 took 26.0 ms
     [java] Column 106 took 22.0 ms
     [java] Column 107 took 22.0 ms
     [java] Column 108 took 22.0 ms
     [java] Column 109 took 21.0 ms
     [java] Column 110 took 22.0 ms
     [java] Column 111 took 22.0 ms
     [java] Column 112 took 21.0 ms
     [java] Column 113 took 22.0 ms
     [java] Column 114 took 22.0 ms
     [java] Column 115 took 22.0 ms
     [java] Column 116 took 32.0 ms
     [java] Column 117 took 22.0 ms
     [java] Column 118 took 23.0 ms
     [java] Column 119 took 23.0 ms
     [java] Column 120 took 45.0 ms
     [java] Column 121 took 28.0 ms
     [java] Column 122 took 29.0 ms
     [java] Column 123 took 25.0 ms
     [java] Column 124 took 24.0 ms
     [java] Column 125 took 23.0 ms
     [java] Column 126 took 22.0 ms
     [java] Column 127 took 23.0 ms
     [java] Column 128 took 23.0 ms
     [java] Column 129 took 36.0 ms
     [java] Column 130 took 22.0 ms
     [java] Column 131 took 34.0 ms
     [java] Column 132 took 33.0 ms
     [java] Column 133 took 23.0 ms
     [java] Column 134 took 22.0 ms
     [java] Column 135 took 23.0 ms
     [java] Column 136 took 22.0 ms
     [java] Column 137 took 22.0 ms
     [java] Column 138 took 24.0 ms
     [java] Auto sizing columns took a total of 3383.0 ms (24.33812949640288 ms per column)
     [java] Best fit width time per cell: 152113.30935251797 ns
     [java] Total time: 4.857 s
     [java] ............I.........................................Cell formula evaluation
currently unsupported
     [java] Array formulas currently unsupported
     [java] Exception in thread "main" java.lang.RuntimeException: Tests did not succeed,
cannot build ooxml-lite jar
     [java] 	at org.apache.poi.util.OOXMLLite.build(OOXMLLite.java:106)
     [java] 	at org.apache.poi.util.OOXMLLite.main(OOXMLLite.java:87)
     [java] .......................................................................................................................................I.....................................................
     [java] Time: 148.844
     [java] There were 3 failures:
     [java] 1) initializationError(org.apache.poi.ss.usermodel.BaseTestXWorkbook)
     [java] java.lang.Exception: Test class should have exactly one public constructor
     [java] 	at org.junit.runners.BlockJUnit4ClassRunner.validateOnlyOneConstructor(BlockJUnit4ClassRunner.java:158)
     [java] 	at org.junit.runners.BlockJUnit4ClassRunner.validateConstructor(BlockJUnit4ClassRunner.java:147)
     [java] 	at org.junit.runners.BlockJUnit4ClassRunner.collectInitializationErrors(BlockJUnit4ClassRunner.java:127)
     [java] 	at org.junit.runners.ParentRunner.validate(ParentRunner.java:416)
     [java] 	at org.junit.runners.ParentRunner.<init>(ParentRunner.java:84)
     [java] 	at org.junit.runners.BlockJUnit4ClassRunner.<init>(BlockJUnit4ClassRunner.java:65)
     [java] 	at org.junit.internal.builders.JUnit4Builder.runnerForClass(JUnit4Builder.java:10)
     [java] 	at org.junit.runners.model.RunnerBuilder.safeRunnerForClass(RunnerBuilder.java:59)
     [java] 	at org.junit.internal.builders.AllDefaultPossibilitiesBuilder.runnerForClass(AllDefaultPossibilitiesBuilder.java:26)
     [java] 	at org.junit.runner.Computer.getRunner(Computer.java:40)
     [java] 	at org.junit.runner.Computer$1.runnerForClass(Computer.java:31)
     [java] 	at org.junit.runners.model.RunnerBuilder.safeRunnerForClass(RunnerBuilder.java:59)
     [java] 	at org.junit.runners.model.RunnerBuilder.runners(RunnerBuilder.java:101)
     [java] 	at org.junit.runners.model.RunnerBuilder.runners(RunnerBuilder.java:87)
     [java] 	at org.junit.runners.Suite.<init>(Suite.java:81)
     [java] 	at org.junit.runner.Computer.getSuite(Computer.java:28)
     [java] 	at org.junit.runner.Request.classes(Request.java:75)
     [java] 	at org.junit.runner.JUnitCore.run(JUnitCore.java:105)
     [java] 	at org.junit.runner.JUnitCore.run(JUnitCore.java:94)
     [java] 	at org.apache.poi.util.OOXMLLite.build(OOXMLLite.java:104)
     [java] 	at org.apache.poi.util.OOXMLLite.main(OOXMLLite.java:87)
     [java] 2) initializationError(org.apache.poi.ss.usermodel.BaseTestXSheet)
     [java] java.lang.Exception: Test class should have exactly one public constructor
     [java] 	at org.junit.runners.BlockJUnit4ClassRunner.validateOnlyOneConstructor(BlockJUnit4ClassRunner.java:158)
     [java] 	at org.junit.runners.BlockJUnit4ClassRunner.validateConstructor(BlockJUnit4ClassRunner.java:147)
     [java] 	at org.junit.runners.BlockJUnit4ClassRunner.collectInitializationErrors(BlockJUnit4ClassRunner.java:127)
     [java] 	at org.junit.runners.ParentRunner.validate(ParentRunner.java:416)
     [java] 	at org.junit.runners.ParentRunner.<init>(ParentRunner.java:84)
     [java] 	at org.junit.runners.BlockJUnit4ClassRunner.<init>(BlockJUnit4ClassRunner.java:65)
     [java] 	at org.junit.internal.builders.JUnit4Builder.runnerForClass(JUnit4Builder.java:10)
     [java] 	at org.junit.runners.model.RunnerBuilder.safeRunnerForClass(RunnerBuilder.java:59)
     [java] 	at org.junit.internal.builders.AllDefaultPossibilitiesBuilder.runnerForClass(AllDefaultPossibilitiesBuilder.java:26)
     [java] 	at org.junit.runner.Computer.getRunner(Computer.java:40)
     [java] 	at org.junit.runner.Computer$1.runnerForClass(Computer.java:31)
     [java] 	at org.junit.runners.model.RunnerBuilder.safeRunnerForClass(RunnerBuilder.java:59)
     [java] 	at org.junit.runners.model.RunnerBuilder.runners(RunnerBuilder.java:101)
     [java] 	at org.junit.runners.model.RunnerBuilder.runners(RunnerBuilder.java:87)
     [java] 	at org.junit.runners.Suite.<init>(Suite.java:81)
     [java] 	at org.junit.runner.Computer.getSuite(Computer.java:28)
     [java] 	at org.junit.runner.Request.classes(Request.java:75)
     [java] 	at org.junit.runner.JUnitCore.run(JUnitCore.java:105)
     [java] 	at org.junit.runner.JUnitCore.run(JUnitCore.java:94)
     [java] 	at org.apache.poi.util.OOXMLLite.build(OOXMLLite.java:104)
     [java] 	at org.apache.poi.util.OOXMLLite.main(OOXMLLite.java:87)
     [java] 3) initializationError(org.apache.poi.ss.usermodel.BaseTestXRow)
     [java] java.lang.Exception: Test class should have exactly one public constructor
     [java] 	at org.junit.runners.BlockJUnit4ClassRunner.validateOnlyOneConstructor(BlockJUnit4ClassRunner.java:158)
     [java] 	at org.junit.runners.BlockJUnit4ClassRunner.validateConstructor(BlockJUnit4ClassRunner.java:147)
     [java] 	at org.junit.runners.BlockJUnit4ClassRunner.collectInitializationErrors(BlockJUnit4ClassRunner.java:127)
     [java] 	at org.junit.runners.ParentRunner.validate(ParentRunner.java:416)
     [java] 	at org.junit.runners.ParentRunner.<init>(ParentRunner.java:84)
     [java] 	at org.junit.runners.BlockJUnit4ClassRunner.<init>(BlockJUnit4ClassRunner.java:65)
     [java] 	at org.junit.internal.builders.JUnit4Builder.runnerForClass(JUnit4Builder.java:10)
     [java] 	at org.junit.runners.model.RunnerBuilder.safeRunnerForClass(RunnerBuilder.java:59)
     [java] 	at org.junit.internal.builders.AllDefaultPossibilitiesBuilder.runnerForClass(AllDefaultPossibilitiesBuilder.java:26)
     [java] 	at org.junit.runner.Computer.getRunner(Computer.java:40)
     [java] 	at org.junit.runner.Computer$1.runnerForClass(Computer.java:31)
     [java] 	at org.junit.runners.model.RunnerBuilder.safeRunnerForClass(RunnerBuilder.java:59)
     [java] 	at org.junit.runners.model.RunnerBuilder.runners(RunnerBuilder.java:101)
     [java] 	at org.junit.runners.model.RunnerBuilder.runners(RunnerBuilder.java:87)
     [java] 	at org.junit.runners.Suite.<init>(Suite.java:81)
     [java] 	at org.junit.runner.Computer.getSuite(Computer.java:28)
     [java] 	at org.junit.runner.Request.classes(Request.java:75)
     [java] 	at org.junit.runner.JUnitCore.run(JUnitCore.java:105)
     [java] 	at org.junit.runner.JUnitCore.run(JUnitCore.java:94)
     [java] 	at org.apache.poi.util.OOXMLLite.build(OOXMLLite.java:104)
     [java] 	at org.apache.poi.util.OOXMLLite.main(OOXMLLite.java:87)
     [java] 
     [java] FAILURES!!!
     [java] Tests run: 1925,  Failures: 3
     [java] 

BUILD FAILED
<https://builds.apache.org/job/POI-JDK8/ws/build.xml>:1338: Java returned: 1

Total time: 3 minutes 56 seconds
Build step 'Invoke Ant' marked build as failure
[FINDBUGS] Skipping publisher since build result is FAILURE
[WARNINGS] Skipping publisher since build result is FAILURE
Archiving artifacts
Recording test results
ERROR: Step ?Publish JUnit test result report? failed: No test report files were found. Configuration
error?


---------------------------------------------------------------------
To unsubscribe, e-mail: dev-unsubscribe@poi.apache.org
For additional commands, e-mail: dev-help@poi.apache.org


Mime
View raw message