poi-dev mailing list archives

Site index · List index
Message view « Date » · « Thread »
Top « Date » · « Thread »
From Dominik Stadler <dominik.stad...@gmx.at>
Subject Re: Build failed in Jenkins: POI #1128
Date Fri, 19 Feb 2016 09:28:57 GMT
Hi,

I tried to do timing-based tests in various project but never could get it
stable.

If you try to set the allowed time long enough, there will always be a
slower machine somewhere out there. If you set it very long, the check on
runtime becomes useless at some point.

If you try to measure performance of the machine before doing the actual
test, there will always run another process in parallel taking away CPU
power at the wrong time.

What I saw working is to do separate performance testing which runs on
dedicated hardware and ensures similar run-conditions for every run, then
you see how performance changes over time, see e.g.
http://benchmarks.elasticsearch.org/ where Elasticsearch verifies
performance of various fixed scenarios nightly.

Dominik.



On Thu, Feb 18, 2016 at 6:46 PM, Javen O'Neal <javenoneal@gmail.com> wrote:

> This failed [1] because of crude timing I added for bug 58896 in r1730997
> [2].
>
> Is there a way to normalize timing so that I can compare performance
> independent of processor speed or CPU load due to other processes/VM?
>
> For now I'll comment out the timing check to get back our green builds.
>
> [1]
>
> https://builds.apache.org/job/POI/1128/testReport/junit/org.apache.poi.xssf.usermodel/TestXSSFBugs/test58896/
>
> [2]
>
> https://svn.apache.org/viewvc/poi/trunk/src/testcases/org/apache/poi/ss/usermodel/BaseTestBugzillaIssues.java?r1=1730997&r2=1730996&pathrev=1730997
> On Feb 18, 2016 7:01 AM, "Apache Jenkins Server" <
> jenkins@builds.apache.org>
> wrote:
>
> > See <https://builds.apache.org/job/POI/1128/changes>
> >
> > Changes:
> >
> > [tallison] 59021 -- update status.xml
> >
> > ------------------------------------------
> > [...truncated 1890 lines...]
> >     [junit] Running org.apache.poi.hwpf.usermodel.TestBug47563
> >     [junit] Tests run: 1, Failures: 0, Errors: 0, Skipped: 0, Time
> > elapsed: 0.093 sec
> >     [junit] Running org.apache.poi.hwpf.usermodel.TestBug49820
> >     [junit] Tests run: 1, Failures: 0, Errors: 0, Skipped: 0, Time
> > elapsed: 0.01 sec
> >     [junit] Running org.apache.poi.hwpf.usermodel.TestBug50075
> >     [junit] Tests run: 1, Failures: 0, Errors: 0, Skipped: 0, Time
> > elapsed: 0.006 sec
> >     [junit] Running org.apache.poi.hwpf.usermodel.TestBugs
> >     [junit] Tests run: 35, Failures: 0, Errors: 0, Skipped: 0, Time
> > elapsed: 1.156 sec
> >     [junit] Running org.apache.poi.hwpf.usermodel.TestHWPFOldDocument
> >     [junit] Tests run: 4, Failures: 0, Errors: 0, Skipped: 0, Time
> > elapsed: 0.063 sec
> >     [junit] Running org.apache.poi.hwpf.usermodel.TestHeaderStories
> >     [junit] Tests run: 8, Failures: 0, Errors: 0, Skipped: 0, Time
> > elapsed: 0.194 sec
> >     [junit] Running org.apache.poi.hwpf.usermodel.TestLists
> >     [junit] Tests run: 7, Failures: 0, Errors: 0, Skipped: 0, Time
> > elapsed: 0.158 sec
> >     [junit] Running org.apache.poi.hwpf.usermodel.TestOfficeDrawings
> >     [junit] Tests run: 1, Failures: 0, Errors: 0, Skipped: 0, Time
> > elapsed: 0.004 sec
> >     [junit] Running org.apache.poi.hwpf.usermodel.TestPictures
> >     [junit] Tests run: 16, Failures: 0, Errors: 0, Skipped: 2, Time
> > elapsed: 0.32 sec
> >     [junit] Running org.apache.poi.hwpf.usermodel.TestProblems
> >     [junit] Tests run: 10, Failures: 0, Errors: 0, Skipped: 0, Time
> > elapsed: 0.244 sec
> >     [junit] Running org.apache.poi.hwpf.usermodel.TestRange
> >     [junit] Tests run: 2, Failures: 0, Errors: 0, Skipped: 0, Time
> > elapsed: 0.021 sec
> >     [junit] Running org.apache.poi.hwpf.usermodel.TestRangeDelete
> >     [junit] Tests run: 4, Failures: 0, Errors: 0, Skipped: 0, Time
> > elapsed: 0.027 sec
> >     [junit] Running org.apache.poi.hwpf.usermodel.TestRangeInsertion
> >     [junit] Tests run: 3, Failures: 0, Errors: 0, Skipped: 0, Time
> > elapsed: 0.019 sec
> >     [junit] Running org.apache.poi.hwpf.usermodel.TestRangeProperties
> >     [junit] Tests run: 5, Failures: 0, Errors: 0, Skipped: 0, Time
> > elapsed: 0.066 sec
> >     [junit] Running org.apache.poi.hwpf.usermodel.TestRangeReplacement
> >     [junit] Tests run: 4, Failures: 0, Errors: 0, Skipped: 0, Time
> > elapsed: 0.065 sec
> >     [junit] Running org.apache.poi.hwpf.usermodel.TestRangeSymbols
> >     [junit] Tests run: 1, Failures: 0, Errors: 0, Skipped: 0, Time
> > elapsed: 0.004 sec
> >     [junit] Running org.apache.poi.hwpf.usermodel.TestShapes
> >     [junit] Tests run: 1, Failures: 0, Errors: 0, Skipped: 0, Time
> > elapsed: 0.013 sec
> >     [junit] Running org.apache.poi.hwpf.usermodel.TestTableRow
> >     [junit] Tests run: 2, Failures: 0, Errors: 0, Skipped: 0, Time
> > elapsed: 0.021 sec
> >
> > -test-scratchpad-write-testfile:
> >
> > -test-ooxml-check:
> >
> > test-ooxml:
> > [jacoco:coverage] Enhancing junit with coverage
> >     [junit] Running org.apache.poi.TestDetectAsOOXML
> >     [junit] Tests run: 3, Failures: 0, Errors: 0, Skipped: 0, Time
> > elapsed: 1.528 sec
> >     [junit] Running org.apache.poi.TestEmbeded
> >     [junit] Tests run: 3, Failures: 0, Errors: 0, Skipped: 0, Time
> > elapsed: 9.557 sec
> >     [junit] Running org.apache.poi.TestPOIXMLDocument
> >     [junit] Tests run: 8, Failures: 0, Errors: 0, Skipped: 0, Time
> > elapsed: 2.2 sec
> >     [junit] Running org.apache.poi.TestPOIXMLProperties
> >     [junit] Tests run: 5, Failures: 0, Errors: 0, Skipped: 0, Time
> > elapsed: 0.724 sec
> >     [junit] Running org.apache.poi.TestXMLPropertiesTextExtractor
> >     [junit] Tests run: 5, Failures: 0, Errors: 0, Skipped: 0, Time
> > elapsed: 1.132 sec
> >     [junit] Running org.apache.poi.extractor.TestExtractorFactory
> >     [junit] Tests run: 6, Failures: 0, Errors: 0, Skipped: 0, Time
> > elapsed: 14.363 sec
> >     [junit] Running org.apache.poi.openxml4j.opc.TestContentType
> >     [junit] Tests run: 7, Failures: 0, Errors: 0, Skipped: 0, Time
> > elapsed: 0.222 sec
> >     [junit] Running org.apache.poi.openxml4j.opc.TestFileHelper
> >     [junit] Tests run: 1, Failures: 0, Errors: 0, Skipped: 0, Time
> > elapsed: 0.056 sec
> >     [junit] Running org.apache.poi.openxml4j.opc.TestListParts
> >     [junit] Tests run: 1, Failures: 0, Errors: 0, Skipped: 0, Time
> > elapsed: 0.015 sec
> >     [junit] Running org.apache.poi.openxml4j.opc.TestPackage
> >     [junit] Tests run: 17, Failures: 0, Errors: 0, Skipped: 1, Time
> > elapsed: 80.3 sec
> >     [junit] Running
> org.apache.poi.openxml4j.opc.TestPackageCoreProperties
> >     [junit] Tests run: 6, Failures: 0, Errors: 0, Skipped: 0, Time
> > elapsed: 0.405 sec
> >     [junit] Running org.apache.poi.openxml4j.opc.TestPackagePartName
> >     [junit] Tests run: 1, Failures: 0, Errors: 0, Skipped: 0, Time
> > elapsed: 0.008 sec
> >     [junit] Running org.apache.poi.openxml4j.opc.TestPackageThumbnail
> >     [junit] Tests run: 1, Failures: 0, Errors: 0, Skipped: 0, Time
> > elapsed: 0.066 sec
> >     [junit] Running org.apache.poi.openxml4j.opc.TestPackagingURIHelper
> >     [junit] Tests run: 5, Failures: 0, Errors: 0, Skipped: 0, Time
> > elapsed: 0.056 sec
> >     [junit] Running org.apache.poi.openxml4j.opc.TestRelationships
> >     [junit] Tests run: 9, Failures: 0, Errors: 0, Skipped: 0, Time
> > elapsed: 0.43 sec
> >     [junit] Running org.apache.poi.openxml4j.opc.TestZipPackage
> >     [junit] Tests run: 5, Failures: 0, Errors: 0, Skipped: 0, Time
> > elapsed: 2.752 sec
> >     [junit] Running
> > org.apache.poi.openxml4j.opc.compliance.TestOPCComplianceCoreProperties
> >     [junit] Tests run: 11, Failures: 0, Errors: 0, Skipped: 0, Time
> > elapsed: 0.582 sec
> >     [junit] Running
> > org.apache.poi.openxml4j.opc.compliance.TestOPCCompliancePackageModel
> >     [junit] Tests run: 5, Failures: 0, Errors: 0, Skipped: 0, Time
> > elapsed: 0.045 sec
> >     [junit] Running
> > org.apache.poi.openxml4j.opc.compliance.TestOPCCompliancePartName
> >     [junit] Tests run: 10, Failures: 0, Errors: 0, Skipped: 0, Time
> > elapsed: 0.081 sec
> >     [junit] Running
> > org.apache.poi.openxml4j.opc.internal.TestContentTypeManager
> >     [junit] Tests run: 3, Failures: 0, Errors: 0, Skipped: 0, Time
> > elapsed: 0.017 sec
> >     [junit] Running
> > org.apache.poi.poifs.crypt.TestAgileEncryptionParameters
> >     [junit] Tests run: 60, Failures: 0, Errors: 0, Skipped: 20, Time
> > elapsed: 77.927 sec
> >     [junit] Running org.apache.poi.poifs.crypt.TestCertificateEncryption
> >     [junit] Tests run: 1, Failures: 0, Errors: 0, Skipped: 0, Time
> > elapsed: 0.529 sec
> >     [junit] Running org.apache.poi.poifs.crypt.TestDecryptor
> >     [junit] Tests run: 6, Failures: 0, Errors: 0, Skipped: 0, Time
> > elapsed: 0.901 sec
> >     [junit] Running org.apache.poi.poifs.crypt.TestEncryptionInfo
> >     [junit] Tests run: 2, Failures: 0, Errors: 0, Skipped: 0, Time
> > elapsed: 0.012 sec
> >     [junit] Running org.apache.poi.poifs.crypt.TestEncryptor
> >     [junit] Tests run: 5, Failures: 0, Errors: 0, Skipped: 2, Time
> > elapsed: 1.076 sec
> >     [junit] Running org.apache.poi.sl.TestTable
> >     [junit] Tests run: 1, Failures: 0, Errors: 0, Skipped: 0, Time
> > elapsed: 0.72 sec
> >     [junit] Running org.apache.poi.sl.draw.TestDrawPictureShape
> >     [junit] Tests run: 1, Failures: 0, Errors: 0, Skipped: 0, Time
> > elapsed: 0.538 sec
> >     [junit] Running org.apache.poi.ss.TestWorkbookFactory
> >     [junit] Tests run: 7, Failures: 0, Errors: 0, Skipped: 0, Time
> > elapsed: 1.231 sec
> >     [junit] Running org.apache.poi.ss.format.TestCellFormatPart
> >     [junit] Tests run: 6, Failures: 0, Errors: 0, Skipped: 0, Time
> > elapsed: 2.889 sec
> >     [junit] Running org.apache.poi.ss.formula.TestFormulaParser
> >     [junit] Tests run: 6, Failures: 0, Errors: 0, Skipped: 0, Time
> > elapsed: 0.25 sec
> >     [junit] Running
> > org.apache.poi.ss.formula.eval.TestXSSFCircularReferences
> >     [junit] Tests run: 4, Failures: 0, Errors: 0, Skipped: 0, Time
> > elapsed: 0.279 sec
> >     [junit] Running org.apache.poi.ss.formula.functions.TestProper
> >     [junit] Tests run: 2, Failures: 0, Errors: 0, Skipped: 0, Time
> > elapsed: 0.039 sec
> >     [junit] Running org.apache.poi.util.TestIdentifierManager
> >     [junit] Tests run: 5, Failures: 0, Errors: 0, Skipped: 0, Time
> > elapsed: 0.04 sec
> >     [junit] Running org.apache.poi.xdgf.extractor.TestXDGFVisioExtractor
> >     [junit] Tests run: 1, Failures: 0, Errors: 0, Skipped: 0, Time
> > elapsed: 0.127 sec
> >     [junit] Running org.apache.poi.xslf.TestXSLFBugs
> >     [junit] Tests run: 8, Failures: 0, Errors: 0, Skipped: 1, Time
> > elapsed: 3.619 sec
> >     [junit] Running org.apache.poi.xslf.TestXSLFSlideShow
> >     [junit] Tests run: 4, Failures: 0, Errors: 0, Skipped: 0, Time
> > elapsed: 0.295 sec
> >     [junit] Running
> > org.apache.poi.xslf.extractor.TestXSLFPowerPointExtractor
> >     [junit] Tests run: 6, Failures: 0, Errors: 0, Skipped: 0, Time
> > elapsed: 2.736 sec
> >     [junit] Running org.apache.poi.xslf.geom.TestFormulaParser
> >     [junit] Tests run: 1, Failures: 0, Errors: 0, Skipped: 0, Time
> > elapsed: 0.039 sec
> >     [junit] Running org.apache.poi.xslf.usermodel.TestPPTX2PNG
> >     [junit] Tests run: 1, Failures: 0, Errors: 0, Skipped: 0, Time
> > elapsed: 73.214 sec
> >     [junit] Running org.apache.poi.xslf.usermodel.TestXMLSlideShow
> >     [junit] Tests run: 5, Failures: 0, Errors: 0, Skipped: 0, Time
> > elapsed: 0.545 sec
> >     [junit] Running org.apache.poi.xslf.usermodel.TestXSLFAutoShape
> >     [junit] Tests run: 4, Failures: 0, Errors: 0, Skipped: 0, Time
> > elapsed: 0.743 sec
> >     [junit] Running org.apache.poi.xslf.usermodel.TestXSLFChart
> >     [junit] Tests run: 1, Failures: 0, Errors: 0, Skipped: 0, Time
> > elapsed: 0.195 sec
> >     [junit] Running org.apache.poi.xslf.usermodel.TestXSLFColor
> >     [junit] Tests run: 6, Failures: 0, Errors: 0, Skipped: 0, Time
> > elapsed: 0.207 sec
> >     [junit] Running org.apache.poi.xslf.usermodel.TestXSLFConnectorShape
> >     [junit] Tests run: 2, Failures: 0, Errors: 0, Skipped: 0, Time
> > elapsed: 0.082 sec
> >     [junit] Running org.apache.poi.xslf.usermodel.TestXSLFFreeformShape
> >     [junit] Tests run: 1, Failures: 0, Errors: 0, Skipped: 0, Time
> > elapsed: 0.073 sec
> >     [junit] Running org.apache.poi.xslf.usermodel.TestXSLFGroupShape
> >     [junit] Tests run: 2, Failures: 0, Errors: 0, Skipped: 0, Time
> > elapsed: 0.167 sec
> >     [junit] Running org.apache.poi.xslf.usermodel.TestXSLFHyperlink
> >     [junit] Tests run: 3, Failures: 0, Errors: 0, Skipped: 0, Time
> > elapsed: 0.701 sec
> >     [junit] Running org.apache.poi.xslf.usermodel.TestXSLFNotes
> >     [junit] Tests run: 3, Failures: 0, Errors: 0, Skipped: 0, Time
> > elapsed: 1.172 sec
> >     [junit] Running org.apache.poi.xslf.usermodel.TestXSLFPictureShape
> >     [junit] Tests run: 5, Failures: 0, Errors: 0, Skipped: 0, Time
> > elapsed: 1.034 sec
> >     [junit] Running org.apache.poi.xslf.usermodel.TestXSLFShape
> >     [junit] Tests run: 2, Failures: 0, Errors: 0, Skipped: 0, Time
> > elapsed: 0.593 sec
> >     [junit] Running org.apache.poi.xslf.usermodel.TestXSLFShapeContainer
> >     [junit] Tests run: 1, Failures: 0, Errors: 0, Skipped: 0, Time
> > elapsed: 0.211 sec
> >     [junit] Running org.apache.poi.xslf.usermodel.TestXSLFSheet
> >     [junit] Tests run: 1, Failures: 0, Errors: 0, Skipped: 0, Time
> > elapsed: 0.127 sec
> >     [junit] Running org.apache.poi.xslf.usermodel.TestXSLFSimpleShape
> >     [junit] Tests run: 7, Failures: 0, Errors: 0, Skipped: 0, Time
> > elapsed: 0.7 sec
> >     [junit] Running org.apache.poi.xslf.usermodel.TestXSLFSlide
> >     [junit] Tests run: 4, Failures: 0, Errors: 0, Skipped: 0, Time
> > elapsed: 4.99 sec
> >     [junit] Running org.apache.poi.xslf.usermodel.TestXSLFSlideShow
> >     [junit] Tests run: 6, Failures: 0, Errors: 0, Skipped: 0, Time
> > elapsed: 1.094 sec
> >     [junit] Running
> org.apache.poi.xslf.usermodel.TestXSLFSlideShowFactory
> >     [junit] Tests run: 6, Failures: 0, Errors: 0, Skipped: 0, Time
> > elapsed: 2.649 sec
> >     [junit] Running org.apache.poi.xslf.usermodel.TestXSLFTable
> >     [junit] Tests run: 3, Failures: 0, Errors: 0, Skipped: 0, Time
> > elapsed: 0.426 sec
> >     [junit] Running org.apache.poi.xslf.usermodel.TestXSLFTableStyles
> >     [junit] Tests run: 2, Failures: 0, Errors: 0, Skipped: 0, Time
> > elapsed: 0.072 sec
> >     [junit] Running org.apache.poi.xslf.usermodel.TestXSLFTextBox
> >     [junit] Tests run: 2, Failures: 0, Errors: 0, Skipped: 0, Time
> > elapsed: 0.498 sec
> >     [junit] Running org.apache.poi.xslf.usermodel.TestXSLFTextParagraph
> >     [junit] Tests run: 5, Failures: 0, Errors: 0, Skipped: 1, Time
> > elapsed: 0.464 sec
> >     [junit] Running org.apache.poi.xslf.usermodel.TestXSLFTextRun
> >     [junit] Tests run: 1, Failures: 0, Errors: 0, Skipped: 0, Time
> > elapsed: 0.061 sec
> >     [junit] Running org.apache.poi.xslf.usermodel.TestXSLFTextShape
> >     [junit] Tests run: 4, Failures: 0, Errors: 0, Skipped: 0, Time
> > elapsed: 0.49 sec
> >     [junit] Running org.apache.poi.xslf.usermodel.TestXSLFTheme
> >     [junit] Tests run: 1, Failures: 0, Errors: 0, Skipped: 0, Time
> > elapsed: 0.294 sec
> >     [junit] Running org.apache.poi.xssf.TestSheetProtection
> >     [junit] Tests run: 17, Failures: 0, Errors: 0, Skipped: 0, Time
> > elapsed: 0.706 sec
> >     [junit] Running org.apache.poi.xssf.TestWorkbookProtection
> >     [junit] Tests run: 7, Failures: 0, Errors: 0, Skipped: 0, Time
> > elapsed: 2.413 sec
> >     [junit] Running
> > org.apache.poi.xssf.eventusermodel.TestReadOnlySharedStringsTable
> >     [junit] Tests run: 3, Failures: 0, Errors: 0, Skipped: 0, Time
> > elapsed: 0.071 sec
> >     [junit] Running org.apache.poi.xssf.eventusermodel.TestXSSFReader
> >     [junit] Tests run: 9, Failures: 0, Errors: 0, Skipped: 0, Time
> > elapsed: 0.186 sec
> >     [junit] Running
> > org.apache.poi.xssf.extractor.TestXSSFEventBasedExcelExtractor
> >     [junit] Tests run: 11, Failures: 0, Errors: 0, Skipped: 0, Time
> > elapsed: 1.87 sec
> >     [junit] Running
> >
> org.apache.poi.xssf.extractor.TestXSSFEventBasedExcelExtractorUsingFactory
> >     [junit] Tests run: 11, Failures: 0, Errors: 0, Skipped: 0, Time
> > elapsed: 1.854 sec
> >     [junit] Running org.apache.poi.xssf.extractor.TestXSSFExcelExtractor
> >     [junit] Tests run: 7, Failures: 0, Errors: 0, Skipped: 0, Time
> > elapsed: 2.906 sec
> >     [junit] Running
> > org.apache.poi.xssf.extractor.TestXSSFExcelExtractorUsingFactory
> >     [junit] Tests run: 7, Failures: 0, Errors: 0, Skipped: 0, Time
> > elapsed: 1.63 sec
> >     [junit] Running org.apache.poi.xssf.extractor.TestXSSFExportToXML
> >     [junit] Tests run: 15, Failures: 0, Errors: 0, Skipped: 0, Time
> > elapsed: 0.913 sec
> >     [junit] Running org.apache.poi.xssf.extractor.TestXSSFImportFromXML
> >     [junit] Tests run: 5, Failures: 0, Errors: 0, Skipped: 0, Time
> > elapsed: 1.101 sec
> >     [junit] Running org.apache.poi.xssf.io.TestLoadSaveXSSF
> >     [junit] Tests run: 3, Failures: 0, Errors: 0, Skipped: 0, Time
> > elapsed: 0.057 sec
> >     [junit] Running org.apache.poi.xssf.model.TestCalculationChain
> >     [junit] Tests run: 1, Failures: 0, Errors: 0, Skipped: 0, Time
> > elapsed: 2.791 sec
> >     [junit] Running org.apache.poi.xssf.model.TestCommentsTable
> >     [junit] Tests run: 7, Failures: 0, Errors: 0, Skipped: 0, Time
> > elapsed: 0.642 sec
> >     [junit] Running org.apache.poi.xssf.model.TestExternalLinksTable
> >     [junit] Tests run: 4, Failures: 0, Errors: 0, Skipped: 0, Time
> > elapsed: 0.319 sec
> >     [junit] Running org.apache.poi.xssf.model.TestMapInfo
> >     [junit] Tests run: 1, Failures: 0, Errors: 0, Skipped: 0, Time
> > elapsed: 0.057 sec
> >     [junit] Running org.apache.poi.xssf.model.TestSharedStringsTable
> >     [junit] Tests run: 3, Failures: 0, Errors: 0, Skipped: 0, Time
> > elapsed: 0.655 sec
> >     [junit] Running org.apache.poi.xssf.model.TestStylesTable
> >     [junit] Tests run: 11, Failures: 0, Errors: 0, Skipped: 0, Time
> > elapsed: 0.971 sec
> >     [junit] Running org.apache.poi.xssf.model.TestThemesTable
> >     [junit] Tests run: 3, Failures: 0, Errors: 0, Skipped: 0, Time
> > elapsed: 0.739 sec
> >     [junit] Running
> org.apache.poi.xssf.streaming.TestAutoSizeColumnTracker
> >     [junit] Tests run: 7, Failures: 0, Errors: 0, Skipped: 0, Time
> > elapsed: 0.304 sec
> >     [junit] Running org.apache.poi.xssf.streaming.TestOutlining
> >     [junit] Tests run: 6, Failures: 0, Errors: 0, Skipped: 0, Time
> > elapsed: 0.212 sec
> >     [junit] Running org.apache.poi.xssf.streaming.TestSXSSFCell
> >     [junit] Tests run: 29, Failures: 0, Errors: 0, Skipped: 0, Time
> > elapsed: 2.435 sec
> >     [junit] Running org.apache.poi.xssf.streaming.TestSXSSFDataValidation
> >     [junit] Tests run: 2, Failures: 0, Errors: 0, Skipped: 0, Time
> > elapsed: 1.164 sec
> >     [junit] Running
> > org.apache.poi.xssf.streaming.TestSXSSFFormulaEvaluation
> >     [junit] Tests run: 5, Failures: 0, Errors: 0, Skipped: 0, Time
> > elapsed: 0.143 sec
> >     [junit] Running org.apache.poi.xssf.streaming.TestSXSSFHyperlink
> >     [junit] Tests run: 2, Failures: 0, Errors: 0, Skipped: 0, Time
> > elapsed: 0.121 sec
> >     [junit] Running org.apache.poi.xssf.streaming.TestSXSSFRow
> >     [junit] Tests run: 3, Failures: 0, Errors: 0, Skipped: 0, Time
> > elapsed: 0.719 sec
> >     [junit] Running org.apache.poi.xssf.streaming.TestSXSSFSheet
> >     [junit] Tests run: 44, Failures: 0, Errors: 0, Skipped: 0, Time
> > elapsed: 3.298 sec
> >     [junit] Running
> > org.apache.poi.xssf.streaming.TestSXSSFSheetAutoSizeColumn
> >     [junit] Tests run: 26, Failures: 0, Errors: 0, Skipped: 0, Time
> > elapsed: 0.563 sec
> >     [junit] Running org.apache.poi.xssf.streaming.TestSXSSFWorkbook
> >     [junit] Tests run: 29, Failures: 0, Errors: 0, Skipped: 4, Time
> > elapsed: 3.345 sec
> >     [junit] Running
> > org.apache.poi.xssf.usermodel.TestFormulaEvaluatorOnXSSF
> >     [junit] Tests run: 369, Failures: 0, Errors: 0, Skipped: 90, Time
> > elapsed: 3.864 sec
> >     [junit] Running
> org.apache.poi.xssf.usermodel.TestMissingWorkbookOnXSSF
> >     [junit] Tests run: 3, Failures: 0, Errors: 0, Skipped: 0, Time
> > elapsed: 0.192 sec
> >     [junit] Running
> > org.apache.poi.xssf.usermodel.TestMultiSheetFormulaEvaluatorOnXSSF
> >     [junit] Tests run: 2, Failures: 0, Errors: 0, Skipped: 0, Time
> > elapsed: 0.019 sec
> >     [junit] Running org.apache.poi.xssf.usermodel.TestSXSSFBugs
> >     [junit] Tests run: 32, Failures: 0, Errors: 0, Skipped: 7, Time
> > elapsed: 21.915 sec
> >     [junit] Running org.apache.poi.xssf.usermodel.TestSheetHiding
> >     [junit] Tests run: 5, Failures: 0, Errors: 0, Skipped: 0, Time
> > elapsed: 0.574 sec
> >     [junit] Running org.apache.poi.xssf.usermodel.TestXSSFBugs
> >     [junit] Tests run: 120, Failures: 1, Errors: 0, Skipped: 5, Time
> > elapsed: 42.712 sec
> >
> > BUILD FAILED
> > <https://builds.apache.org/job/POI/ws/build.xml>:1220: The following
> > error occurred while executing this line:
> > <https://builds.apache.org/job/POI/ws/build.xml>:1179: Tests failed
> >
> > Total time: 24 minutes 38 seconds
> > Build step 'Invoke Ant' marked build as failure
> > [FINDBUGS] Skipping publisher since build result is FAILURE
> > [WARNINGS] Skipping publisher since build result is FAILURE
> > Archiving artifacts
> > Compressed 61.85 MB of artifacts by 62.0% relative to #1127
> > Recording test results
> >
> > ---------------------------------------------------------------------
> > To unsubscribe, e-mail: dev-unsubscribe@poi.apache.org
> > For additional commands, e-mail: dev-help@poi.apache.org
> >
> >
>

Mime
  • Unnamed multipart/alternative (inline, None, 0 bytes)
View raw message