poi-dev mailing list archives

Site index · List index
Message view « Date » · « Thread »
Top « Date » · « Thread »
From Apache Jenkins Server <jenk...@builds.apache.org>
Subject Build failed in Jenkins: POI-JDK8 #815
Date Mon, 18 Jan 2016 20:20:27 GMT
See <https://builds.apache.org/job/POI-JDK8/815/changes>

Changes:

[centic] Fix possible NullPointerException with invalid/unsupported image types

------------------------------------------
[...truncated 1678 lines...]
    [junit] Tests run: 7, Failures: 0, Errors: 0, Skipped: 0, Time elapsed: 0.047 sec
    [junit] Running org.apache.poi.xssf.streaming.TestOutlining
    [junit] Tests run: 6, Failures: 0, Errors: 0, Skipped: 0, Time elapsed: 0.047 sec
    [junit] Running org.apache.poi.xssf.streaming.TestSXSSFCell
    [junit] Tests run: 29, Failures: 0, Errors: 0, Skipped: 0, Time elapsed: 0.253 sec
    [junit] Running org.apache.poi.xssf.streaming.TestSXSSFDataValidation
    [junit] Tests run: 2, Failures: 0, Errors: 0, Skipped: 0, Time elapsed: 0.117 sec
    [junit] Running org.apache.poi.xssf.streaming.TestSXSSFFormulaEvaluation
    [junit] Tests run: 5, Failures: 0, Errors: 0, Skipped: 0, Time elapsed: 0.019 sec
    [junit] Running org.apache.poi.xssf.streaming.TestSXSSFHyperlink
    [junit] Tests run: 2, Failures: 0, Errors: 0, Skipped: 0, Time elapsed: 0.018 sec
    [junit] Running org.apache.poi.xssf.streaming.TestSXSSFRow
    [junit] Tests run: 3, Failures: 0, Errors: 0, Skipped: 0, Time elapsed: 0.139 sec
    [junit] Running org.apache.poi.xssf.streaming.TestSXSSFSheet
    [junit] Tests run: 43, Failures: 0, Errors: 0, Skipped: 0, Time elapsed: 0.494 sec
    [junit] Running org.apache.poi.xssf.streaming.TestSXSSFSheetAutoSizeColumn
    [junit] Tests run: 26, Failures: 0, Errors: 0, Skipped: 0, Time elapsed: 0.084 sec
    [junit] Running org.apache.poi.xssf.streaming.TestSXSSFWorkbook
    [junit] Tests run: 29, Failures: 0, Errors: 0, Skipped: 4, Time elapsed: 0.669 sec
    [junit] Running org.apache.poi.xssf.usermodel.TestFormulaEvaluatorOnXSSF
    [junit] Tests run: 369, Failures: 0, Errors: 0, Skipped: 90, Time elapsed: 0.399 sec
    [junit] Running org.apache.poi.xssf.usermodel.TestMissingWorkbookOnXSSF
    [junit] Tests run: 3, Failures: 0, Errors: 0, Skipped: 0, Time elapsed: 0.026 sec
    [junit] Running org.apache.poi.xssf.usermodel.TestMultiSheetFormulaEvaluatorOnXSSF
    [junit] Tests run: 2, Failures: 0, Errors: 0, Skipped: 0, Time elapsed: 0.002 sec
    [junit] Running org.apache.poi.xssf.usermodel.TestSXSSFBugs
    [junit] Tests run: 29, Failures: 0, Errors: 0, Skipped: 7, Time elapsed: 2.031 sec
    [junit] Running org.apache.poi.xssf.usermodel.TestSheetHiding
    [junit] Tests run: 5, Failures: 0, Errors: 0, Skipped: 0, Time elapsed: 0.056 sec
    [junit] Running org.apache.poi.xssf.usermodel.TestXSSFBugs
    [junit] Tests run: 117, Failures: 0, Errors: 0, Skipped: 5, Time elapsed: 7.212 sec
    [junit] Running org.apache.poi.xssf.usermodel.TestXSSFCell
    [junit] Tests run: 48, Failures: 0, Errors: 0, Skipped: 0, Time elapsed: 0.992 sec
    [junit] Running org.apache.poi.xssf.usermodel.TestXSSFCellStyle
    [junit] Tests run: 40, Failures: 0, Errors: 0, Skipped: 0, Time elapsed: 0.15 sec
    [junit] Running org.apache.poi.xssf.usermodel.TestXSSFChart
    [junit] Tests run: 3, Failures: 0, Errors: 0, Skipped: 0, Time elapsed: 0.076 sec
    [junit] Running org.apache.poi.xssf.usermodel.TestXSSFChartSheet
    [junit] Tests run: 3, Failures: 0, Errors: 0, Skipped: 0, Time elapsed: 0.017 sec
    [junit] Running org.apache.poi.xssf.usermodel.TestXSSFColGrouping
    [junit] Tests run: 6, Failures: 0, Errors: 0, Skipped: 0, Time elapsed: 0.045 sec
    [junit] Running org.apache.poi.xssf.usermodel.TestXSSFColor
    [junit] Tests run: 3, Failures: 0, Errors: 0, Skipped: 0, Time elapsed: 0.039 sec
    [junit] Running org.apache.poi.xssf.usermodel.TestXSSFComment
    [junit] Tests run: 14, Failures: 0, Errors: 0, Skipped: 1, Time elapsed: 0.111 sec
    [junit] Running org.apache.poi.xssf.usermodel.TestXSSFConditionalFormatting
    [junit] Tests run: 17, Failures: 0, Errors: 0, Skipped: 0, Time elapsed: 0.09 sec
    [junit] Running org.apache.poi.xssf.usermodel.TestXSSFDataFormat
    [junit] Tests run: 7, Failures: 0, Errors: 0, Skipped: 0, Time elapsed: 0.036 sec
    [junit] Running org.apache.poi.xssf.usermodel.TestXSSFDataValidation
    [junit] Tests run: 6, Failures: 0, Errors: 0, Skipped: 0, Time elapsed: 0.166 sec
    [junit] Running org.apache.poi.xssf.usermodel.TestXSSFDialogSheet
    [junit] Tests run: 14, Failures: 0, Errors: 0, Skipped: 0, Time elapsed: 0.024 sec
    [junit] Running org.apache.poi.xssf.usermodel.TestXSSFDrawing
    [junit] Tests run: 18, Failures: 0, Errors: 0, Skipped: 0, Time elapsed: 0.289 sec
    [junit] Running org.apache.poi.xssf.usermodel.TestXSSFExternalFunctions
    [junit] Tests run: 2, Failures: 0, Errors: 0, Skipped: 0, Time elapsed: 0.007 sec
    [junit] Running org.apache.poi.xssf.usermodel.TestXSSFFont
    [junit] Tests run: 21, Failures: 0, Errors: 0, Skipped: 0, Time elapsed: 0.039 sec
    [junit] Running org.apache.poi.xssf.usermodel.TestXSSFFormulaEvaluation
    [junit] Tests run: 25, Failures: 0, Errors: 0, Skipped: 1, Time elapsed: 0.598 sec
    [junit] Running org.apache.poi.xssf.usermodel.TestXSSFFormulaParser
    [junit] Tests run: 6, Failures: 0, Errors: 0, Skipped: 0, Time elapsed: 0.024 sec
    [junit] Running org.apache.poi.xssf.usermodel.TestXSSFHeaderFooter
    [junit] Tests run: 2, Failures: 0, Errors: 0, Skipped: 0, Time elapsed: 0.002 sec
    [junit] Running org.apache.poi.xssf.usermodel.TestXSSFHyperlink
    [junit] Tests run: 10, Failures: 0, Errors: 0, Skipped: 0, Time elapsed: 0.117 sec
    [junit] Running org.apache.poi.xssf.usermodel.TestXSSFName
    [junit] Tests run: 20, Failures: 0, Errors: 0, Skipped: 0, Time elapsed: 0.064 sec
    [junit] Running org.apache.poi.xssf.usermodel.TestXSSFPicture
    [junit] Tests run: 6, Failures: 0, Errors: 0, Skipped: 0, Time elapsed: 0.058 sec
    [junit] Running org.apache.poi.xssf.usermodel.TestXSSFPictureData
    [junit] Tests run: 3, Failures: 0, Errors: 0, Skipped: 0, Time elapsed: 0.072 sec
    [junit] Running org.apache.poi.xssf.usermodel.TestXSSFPivotTable
    [junit] Tests run: 13, Failures: 0, Errors: 0, Skipped: 0, Time elapsed: 0.093 sec
    [junit] Running org.apache.poi.xssf.usermodel.TestXSSFPrintSetup
    [junit] Tests run: 18, Failures: 0, Errors: 0, Skipped: 0, Time elapsed: 0.016 sec
    [junit] Running org.apache.poi.xssf.usermodel.TestXSSFRichTextString
    [junit] Tests run: 16, Failures: 0, Errors: 0, Skipped: 0, Time elapsed: 0.021 sec
    [junit] Running org.apache.poi.xssf.usermodel.TestXSSFRow
    [junit] Tests run: 3, Failures: 0, Errors: 0, Skipped: 0, Time elapsed: 1.525 sec
    [junit] Running org.apache.poi.xssf.usermodel.TestXSSFSheet
    [junit] Tests run: 82, Failures: 0, Errors: 0, Skipped: 0, Time elapsed: 3.353 sec
    [junit] Running org.apache.poi.xssf.usermodel.TestXSSFSheetAutosizeColumn
    [junit] Tests run: 7, Failures: 0, Errors: 0, Skipped: 0, Time elapsed: 0.043 sec
    [junit] Running org.apache.poi.xssf.usermodel.TestXSSFSheetMergeRegions
    [junit] Tests run: 1, Failures: 0, Errors: 0, Skipped: 0, Time elapsed: 1.64 sec
    [junit] Running org.apache.poi.xssf.usermodel.TestXSSFSheetRowGrouping
    [junit] Tests run: 6, Failures: 0, Errors: 0, Skipped: 0, Time elapsed: 0.134 sec
    [junit] Running org.apache.poi.xssf.usermodel.TestXSSFSheetShiftRows
    [junit] Tests run: 23, Failures: 0, Errors: 0, Skipped: 1, Time elapsed: 15.213 sec
    [junit] Running org.apache.poi.xssf.usermodel.TestXSSFSheetUpdateArrayFormulas
    [junit] Tests run: 16, Failures: 0, Errors: 0, Skipped: 0, Time elapsed: 0.036 sec
    [junit] Running org.apache.poi.xssf.usermodel.TestXSSFSimpleShape
    [junit] Tests run: 1, Failures: 0, Errors: 0, Skipped: 0, Time elapsed: 0.014 sec
    [junit] Running org.apache.poi.xssf.usermodel.TestXSSFTable
    [junit] Tests run: 2, Failures: 0, Errors: 0, Skipped: 0, Time elapsed: 0.044 sec
    [junit] Running org.apache.poi.xssf.usermodel.TestXSSFTextParagraph
    [junit] Tests run: 1, Failures: 0, Errors: 0, Skipped: 0, Time elapsed: 0.011 sec
    [junit] Running org.apache.poi.xssf.usermodel.TestXSSFTextRun
    [junit] Tests run: 1, Failures: 0, Errors: 0, Skipped: 0, Time elapsed: 0.005 sec
    [junit] Running org.apache.poi.xssf.usermodel.TestXSSFVMLDrawing
    [junit] Tests run: 3, Failures: 0, Errors: 0, Skipped: 0, Time elapsed: 0.006 sec
    [junit] Running org.apache.poi.xssf.usermodel.TestXSSFWorkbook
    [junit] Tests run: 52, Failures: 0, Errors: 0, Skipped: 0, Time elapsed: 0.577 sec
    [junit] Running org.apache.poi.xssf.usermodel.charts.TestXSSFCategoryAxis
    [junit] Tests run: 1, Failures: 0, Errors: 0, Skipped: 0, Time elapsed: 0.025 sec
    [junit] Running org.apache.poi.xssf.usermodel.charts.TestXSSFChartAxis
    [junit] Tests run: 8, Failures: 0, Errors: 0, Skipped: 0, Time elapsed: 0.016 sec
    [junit] Running org.apache.poi.xssf.usermodel.charts.TestXSSFChartLegend
    [junit] Tests run: 3, Failures: 0, Errors: 0, Skipped: 0, Time elapsed: 0.01 sec
    [junit] Running org.apache.poi.xssf.usermodel.charts.TestXSSFLineChartData
    [junit] Tests run: 1, Failures: 0, Errors: 0, Skipped: 0, Time elapsed: 0.021 sec
    [junit] Running org.apache.poi.xssf.usermodel.charts.TestXSSFManualLayout
    [junit] Tests run: 2, Failures: 0, Errors: 0, Skipped: 0, Time elapsed: 0.015 sec
    [junit] Running org.apache.poi.xssf.usermodel.charts.TestXSSFScatterChartData
    [junit] Tests run: 1, Failures: 0, Errors: 0, Skipped: 0, Time elapsed: 0.014 sec
    [junit] Running org.apache.poi.xssf.usermodel.charts.TestXSSFValueAxis
    [junit] Tests run: 1, Failures: 0, Errors: 0, Skipped: 0, Time elapsed: 0.003 sec
    [junit] Running org.apache.poi.xssf.usermodel.extensions.TestXSSFBorder
    [junit] Tests run: 1, Failures: 0, Errors: 0, Skipped: 0, Time elapsed: 0.002 sec
    [junit] Running org.apache.poi.xssf.usermodel.extensions.TestXSSFCellFill
    [junit] Tests run: 5, Failures: 0, Errors: 0, Skipped: 0, Time elapsed: 0.007 sec
    [junit] Running org.apache.poi.xssf.usermodel.extensions.TestXSSFSheetComments
    [junit] Tests run: 1, Failures: 0, Errors: 0, Skipped: 0, Time elapsed: 0.001 sec
    [junit] Running org.apache.poi.xssf.usermodel.helpers.TestColumnHelper
    [junit] Tests run: 15, Failures: 0, Errors: 0, Skipped: 0, Time elapsed: 0.027 sec
    [junit] Running org.apache.poi.xssf.usermodel.helpers.TestHeaderFooterHelper
    [junit] Tests run: 2, Failures: 0, Errors: 0, Skipped: 0, Time elapsed: 0.001 sec
    [junit] Running org.apache.poi.xssf.util.TestCTColComparator
    [junit] Tests run: 2, Failures: 0, Errors: 0, Skipped: 0, Time elapsed: 0.001 sec
    [junit] Running org.apache.poi.xssf.util.TestEvilUnclosedBRFixingInputStream
    [junit] Tests run: 3, Failures: 0, Errors: 0, Skipped: 0, Time elapsed: 0.004 sec
    [junit] Running org.apache.poi.xssf.util.TestNumericRanges
    [junit] Tests run: 2, Failures: 0, Errors: 0, Skipped: 0, Time elapsed: 0.001 sec
    [junit] Running org.apache.poi.xwpf.TestAllExtendedProperties
    [junit] Tests run: 1, Failures: 0, Errors: 0, Skipped: 0, Time elapsed: 0.026 sec
    [junit] Running org.apache.poi.xwpf.TestDocumentProtection
    [junit] Tests run: 10, Failures: 0, Errors: 0, Skipped: 0, Time elapsed: 0.369 sec
    [junit] Running org.apache.poi.xwpf.TestPackageCorePropertiesGetKeywords
    [junit] Tests run: 1, Failures: 0, Errors: 0, Skipped: 0, Time elapsed: 0.012 sec
    [junit] Running org.apache.poi.xwpf.TestXWPFBugs
    [junit] Tests run: 2, Failures: 0, Errors: 0, Skipped: 1, Time elapsed: 0.033 sec
    [junit] Running org.apache.poi.xwpf.extractor.TestExternalEntities
    [junit] Tests run: 1, Failures: 0, Errors: 0, Skipped: 0, Time elapsed: 0.005 sec
    [junit] Running org.apache.poi.xwpf.extractor.TestXWPFWordExtractor
    [junit] Tests run: 18, Failures: 0, Errors: 0, Skipped: 0, Time elapsed: 0.443 sec
    [junit] Running org.apache.poi.xwpf.model.TestXWPFDecorators
    [junit] Tests run: 2, Failures: 0, Errors: 0, Skipped: 0, Time elapsed: 0.046 sec
    [junit] Running org.apache.poi.xwpf.model.TestXWPFHeaderFooterPolicy
    [junit] Tests run: 3, Failures: 0, Errors: 0, Skipped: 0, Time elapsed: 0.107 sec
    [junit] Running org.apache.poi.xwpf.usermodel.TestChangeTracking
    [junit] Tests run: 3, Failures: 0, Errors: 0, Skipped: 0, Time elapsed: 0.014 sec
    [junit] Running org.apache.poi.xwpf.usermodel.TestXWPFBugs
    [junit] Tests run: 5, Failures: 0, Errors: 0, Skipped: 0, Time elapsed: 0.037 sec
    [junit] Running org.apache.poi.xwpf.usermodel.TestXWPFDocument
    [junit] Tests run: 18, Failures: 0, Errors: 0, Skipped: 0, Time elapsed: 0.183 sec
    [junit] Running org.apache.poi.xwpf.usermodel.TestXWPFFootnotes
    [junit] Tests run: 2, Failures: 0, Errors: 0, Skipped: 0, Time elapsed: 0.018 sec
    [junit] Running org.apache.poi.xwpf.usermodel.TestXWPFHeader
    [junit] Tests run: 8, Failures: 0, Errors: 0, Skipped: 0, Time elapsed: 0.064 sec
    [junit] Running org.apache.poi.xwpf.usermodel.TestXWPFHeadings
    [junit] Tests run: 1, Failures: 0, Errors: 0, Skipped: 0, Time elapsed: 0.034 sec
    [junit] Running org.apache.poi.xwpf.usermodel.TestXWPFNumbering
    [junit] Tests run: 6, Failures: 0, Errors: 0, Skipped: 0, Time elapsed: 0.06 sec
    [junit] Running org.apache.poi.xwpf.usermodel.TestXWPFParagraph
    [junit] Tests run: 21, Failures: 0, Errors: 0, Skipped: 2, Time elapsed: 0.101 sec
    [junit] Running org.apache.poi.xwpf.usermodel.TestXWPFPictureData
    [junit] Tests run: 5, Failures: 0, Errors: 0, Skipped: 0, Time elapsed: 0.093 sec
    [junit] Running org.apache.poi.xwpf.usermodel.TestXWPFRun
    [junit] Tests run: 18, Failures: 0, Errors: 0, Skipped: 0, Time elapsed: 0.062 sec
    [junit] Running org.apache.poi.xwpf.usermodel.TestXWPFSDT
    [junit] Tests run: 4, Failures: 0, Errors: 0, Skipped: 0, Time elapsed: 0.066 sec
    [junit] Running org.apache.poi.xwpf.usermodel.TestXWPFSmartTag
    [junit] Tests run: 1, Failures: 0, Errors: 0, Skipped: 0, Time elapsed: 0.008 sec
    [junit] Running org.apache.poi.xwpf.usermodel.TestXWPFStyles
    [junit] Tests run: 8, Failures: 0, Errors: 0, Skipped: 0, Time elapsed: 0.077 sec
    [junit] Running org.apache.poi.xwpf.usermodel.TestXWPFTable
    [junit] Tests run: 12, Failures: 0, Errors: 0, Skipped: 0, Time elapsed: 0.052 sec
    [junit] Running org.apache.poi.xwpf.usermodel.TestXWPFTableCell
    [junit] Tests run: 3, Failures: 0, Errors: 0, Skipped: 0, Time elapsed: 0.016 sec
    [junit] Running org.apache.poi.xwpf.usermodel.TestXWPFTableRow
    [junit] Tests run: 3, Failures: 0, Errors: 0, Skipped: 0, Time elapsed: 0.003 sec
[jacoco:coverage] Enhancing junit with coverage
    [junit] Running org.apache.poi.poifs.crypt.TestSignatureInfo
    [junit] Tests run: 12, Failures: 0, Errors: 0, Skipped: 1, Time elapsed: 7.642 sec

-test-ooxml-write-testfile:

-test-excelant-check:

test-excelant:
[jacoco:coverage] Enhancing junit with coverage
    [junit] Running org.apache.poi.ss.examples.formula.TestExcelAntUserDefinedFunction
    [junit] Tests run: 2, Failures: 0, Errors: 0, Skipped: 0, Time elapsed: 0.073 sec
    [junit] Running org.apache.poi.ss.excelant.TestBuildFile
    [junit] Tests run: 14, Failures: 0, Errors: 0, Skipped: 0, Time elapsed: 1.924 sec
    [junit] Running org.apache.poi.ss.excelant.TestExcelAntPrecision
    [junit] Tests run: 1, Failures: 0, Errors: 0, Skipped: 0, Time elapsed: 0.002 sec
    [junit] Running org.apache.poi.ss.excelant.TestExcelAntSet
    [junit] Tests run: 2, Failures: 0, Errors: 0, Skipped: 0, Time elapsed: 0.01 sec
    [junit] Running org.apache.poi.ss.excelant.TestExcelAntSetDoubleCell
    [junit] Tests run: 1, Failures: 0, Errors: 0, Skipped: 0, Time elapsed: 0.002 sec
    [junit] Running org.apache.poi.ss.excelant.util.TestExcelAntEvaluationResult
    [junit] Tests run: 4, Failures: 0, Errors: 0, Skipped: 0, Time elapsed: 0.014 sec
    [junit] Running org.apache.poi.ss.excelant.util.TestExcelAntWorkbookUtil
    [junit] Tests run: 23, Failures: 0, Errors: 0, Skipped: 0, Time elapsed: 0.964 sec
    [junit] Running org.apache.poi.ss.excelant.util.TestExcelAntWorkbookUtilFactory
    [junit] Tests run: 2, Failures: 0, Errors: 0, Skipped: 0, Time elapsed: 0.006 sec

-test-excelant-write-testfile:

test:

test-ooxml-lite:
   [delete] Deleting: <https://builds.apache.org/job/POI-JDK8/ws/build/ooxml-testokfile.txt>
     [echo] Running ooxml tests against 'poi-ooxml-schemas'
[jacoco:coverage] Enhancing junit with coverage
    [junit] Running org.apache.poi.TestDetectAsOOXML
    [junit] Tests run: 3, Failures: 0, Errors: 0, Skipped: 0, Time elapsed: 0.263 sec
    [junit] Running org.apache.poi.TestEmbeded
    [junit] Tests run: 3, Failures: 0, Errors: 0, Skipped: 0, Time elapsed: 1.622 sec
    [junit] Running org.apache.poi.TestPOIXMLDocument
    [junit] Tests run: 8, Failures: 0, Errors: 0, Skipped: 0, Time elapsed: 0.449 sec
    [junit] Running org.apache.poi.TestPOIXMLProperties
    [junit] Tests run: 5, Failures: 0, Errors: 0, Skipped: 0, Time elapsed: 0.199 sec
    [junit] Running org.apache.poi.TestXMLPropertiesTextExtractor
    [junit] Tests run: 5, Failures: 0, Errors: 0, Skipped: 0, Time elapsed: 0.292 sec
    [junit] Running org.apache.poi.extractor.TestExtractorFactory
    [junit] Tests run: 6, Failures: 0, Errors: 0, Skipped: 0, Time elapsed: 2.452 sec
    [junit] Running org.apache.poi.openxml4j.opc.TestContentType
    [junit] Tests run: 7, Failures: 0, Errors: 0, Skipped: 0, Time elapsed: 0.02 sec
    [junit] Running org.apache.poi.openxml4j.opc.TestFileHelper
    [junit] Tests run: 1, Failures: 0, Errors: 0, Skipped: 0, Time elapsed: 0.002 sec
    [junit] Running org.apache.poi.openxml4j.opc.TestListParts
    [junit] Tests run: 1, Failures: 0, Errors: 0, Skipped: 0, Time elapsed: 0.005 sec
    [junit] Running org.apache.poi.openxml4j.opc.TestPackage
    [junit] Tests run: 17, Failures: 0, Errors: 3, Skipped: 1, Time elapsed: 31.934 sec

BUILD FAILED
<https://builds.apache.org/job/POI-JDK8/ws/build.xml>:1296: The following error occurred
while executing this line:
<https://builds.apache.org/job/POI-JDK8/ws/build.xml>:1178: Tests failed

Total time: 7 minutes 38 seconds
Build step 'Invoke Ant' marked build as failure
[FINDBUGS] Skipping publisher since build result is FAILURE
[WARNINGS] Skipping publisher since build result is FAILURE
Archiving artifacts
Recording test results

---------------------------------------------------------------------
To unsubscribe, e-mail: dev-unsubscribe@poi.apache.org
For additional commands, e-mail: dev-help@poi.apache.org


Mime
View raw message