poi-dev mailing list archives

Site index · List index
Message view « Date » · « Thread »
Top « Date » · « Thread »
From Apache Jenkins Server <jenk...@builds.apache.org>
Subject Build failed in Jenkins: POI-JDK8 #736
Date Fri, 04 Dec 2015 16:15:54 GMT
See <https://builds.apache.org/job/POI-JDK8/736/changes>

Changes:

[centic] Bug 58084: Fix cloning Cell Styles with Borders

[centic] Eclipse warnings, code formatting, javadoc, ...

------------------------------------------
Started by an SCM change
[EnvInject] - Loading node environment variables.
Building remotely on ubuntu-2 (docker Ubuntu ubuntu) in workspace <https://builds.apache.org/job/POI-JDK8/ws/>
Updating http://svn.apache.org/repos/asf/poi/trunk at revision '2015-12-04T16:12:55.524 +0000'
U         src/scratchpad/src/org/apache/poi/hwpf/model/PropertyNode.java
U         src/scratchpad/testcases/org/apache/poi/hslf/TestReWriteSanity.java
U         src/examples/src/org/apache/poi/hssf/usermodel/examples/AddDimensionedImage.java
U         src/ooxml/java/org/apache/poi/xssf/usermodel/XSSFCellStyle.java
U         src/ooxml/testcases/org/apache/poi/xssf/usermodel/TestXSSFCellStyle.java
U         src/ooxml/testcases/org/apache/poi/xssf/usermodel/TestXSSFBugs.java
U         src/ooxml/testcases/org/apache/poi/xssf/streaming/TestSXSSFWorkbook.java
Fetching 'https://svn.apache.org/repos/asf/poi/site/forrest.properties' at -1 into '<https://builds.apache.org/job/POI-JDK8/ws/forrest.properties'>
Fetching 'https://svn.apache.org/repos/asf/poi/site/src/documentation' at -1 into '<https://builds.apache.org/job/POI-JDK8/ws/src/documentation'>
U         src/documentation/content/xdocs/status.xml
At revision 1717990
At revision 1717990
WARNING: clock of the subversion server appears to be out of sync. This can result in inconsistent
check out behavior.
no change for http://svn.apache.org/repos/asf/poi/trunk/forrest.properties since the previous
build
[EnvInject] - Executing scripts and injecting environment variables after the SCM step.
[EnvInject] - Injecting as environment variables the properties content 
LANG=en_US.UTF-8

[EnvInject] - Variables injected successfully.
[POI-JDK8] $ /home/jenkins/tools/ant/latest/bin/ant -Dcoverage.enabled=true clean jenkins
Buildfile: <https://builds.apache.org/job/POI-JDK8/ws/build.xml>

clean:
   [delete] Deleting directory <https://builds.apache.org/job/POI-JDK8/ws/build>

check-jars:

fetch-jars:

check-ooxml-jars:

fetch-ooxml-jars:

init:
    [mkdir] Created dir: <https://builds.apache.org/job/POI-JDK8/ws/build>
    [mkdir] Created dir: <https://builds.apache.org/job/POI-JDK8/ws/build/classes>
    [mkdir] Created dir: <https://builds.apache.org/job/POI-JDK8/ws/build/test-classes>
    [mkdir] Created dir: <https://builds.apache.org/job/POI-JDK8/ws/build/test-results>
    [mkdir] Created dir: <https://builds.apache.org/job/POI-JDK8/ws/build/scratchpad-classes>
    [mkdir] Created dir: <https://builds.apache.org/job/POI-JDK8/ws/build/scratchpad-test-classes>
    [mkdir] Created dir: <https://builds.apache.org/job/POI-JDK8/ws/build/scratchpad-test-results>
    [mkdir] Created dir: <https://builds.apache.org/job/POI-JDK8/ws/build/geometry-java>
    [mkdir] Created dir: <https://builds.apache.org/job/POI-JDK8/ws/build/ooxml-classes>
    [mkdir] Created dir: <https://builds.apache.org/job/POI-JDK8/ws/build/ooxml-test-classes>
    [mkdir] Created dir: <https://builds.apache.org/job/POI-JDK8/ws/build/ooxml-test-results>
    [mkdir] Created dir: <https://builds.apache.org/job/POI-JDK8/ws/build/excelant-classes>
    [mkdir] Created dir: <https://builds.apache.org/job/POI-JDK8/ws/build/excelant-test-classes>
    [mkdir] Created dir: <https://builds.apache.org/job/POI-JDK8/ws/build/excelant-test-results>
    [mkdir] Created dir: <https://builds.apache.org/job/POI-JDK8/ws/build/examples-classes>
    [mkdir] Created dir: <https://builds.apache.org/job/POI-JDK8/ws/build/integration-test-classes>
    [mkdir] Created dir: <https://builds.apache.org/job/POI-JDK8/736/artifact/build/integration-test-results>
    [mkdir] Created dir: <https://builds.apache.org/job/POI-JDK8/ws/build/dist>
    [mkdir] Created dir: <https://builds.apache.org/job/POI-JDK8/ws/build/tmp/site/build/site>
     [echo] Using Java: 1.8.0_20/1.8.0_20-b26/25.20-b23/Java HotSpot(TM) 64-Bit Server VM
from Oracle Corporation on Linux: 3.13.0-36-lowlatency

compile-main:
    [javac] Compiling 1184 source files to <https://builds.apache.org/job/POI-JDK8/ws/build/classes>
    [javac] warning: [options] bootstrap class path not set in conjunction with -source 1.6
    [javac] Note: Some input files use or override a deprecated API.
    [javac] Note: Recompile with -Xlint:deprecation for details.
    [javac] Note: <https://builds.apache.org/job/POI-JDK8/ws/src/java/org/apache/poi/hpsf/CustomProperties.java>
uses unchecked or unsafe operations.
    [javac] Note: Recompile with -Xlint:unchecked for details.
    [javac] 1 warning
    [javac] Compiling 516 source files to <https://builds.apache.org/job/POI-JDK8/ws/build/test-classes>
    [javac] warning: [options] bootstrap class path not set in conjunction with -source 1.6
    [javac] Note: Some input files use or override a deprecated API.
    [javac] Note: Recompile with -Xlint:deprecation for details.
    [javac] Note: Some input files use unchecked or unsafe operations.
    [javac] Note: Recompile with -Xlint:unchecked for details.
    [javac] 1 warning
     [copy] Copying 4 files to <https://builds.apache.org/job/POI-JDK8/ws/build/classes>

check-ooxml-xsds:

fetch-ooxml-xsds:

generate-geometry:

compile-scratchpad:
    [javac] Compiling 439 source files to <https://builds.apache.org/job/POI-JDK8/ws/build/scratchpad-classes>
    [javac] warning: [options] bootstrap class path not set in conjunction with -source 1.6
    [javac] Note: Some input files use or override a deprecated API.
    [javac] Note: Recompile with -Xlint:deprecation for details.
    [javac] 1 warning
    [javac] Compiling 181 source files to <https://builds.apache.org/job/POI-JDK8/ws/build/scratchpad-test-classes>
    [javac] warning: [options] bootstrap class path not set in conjunction with -source 1.6
    [javac] Note: Some input files use or override a deprecated API.
    [javac] Note: Recompile with -Xlint:deprecation for details.
    [javac] 1 warning
     [copy] Copying 2 files to <https://builds.apache.org/job/POI-JDK8/ws/build/scratchpad-classes>

check-compiled-ooxml-xsds:

compile-ooxml-xsds:

compile-ooxml:
    [javac] Compiling 406 source files to <https://builds.apache.org/job/POI-JDK8/ws/build/ooxml-classes>
    [javac] warning: [options] bootstrap class path not set in conjunction with -source 1.6
    [javac] Note: Some input files use or override a deprecated API.
    [javac] Note: Recompile with -Xlint:deprecation for details.
    [javac] 1 warning
    [javac] Compiling 193 source files to <https://builds.apache.org/job/POI-JDK8/ws/build/ooxml-test-classes>
    [javac] warning: [options] bootstrap class path not set in conjunction with -source 1.6
    [javac] Note: Some input files use or override a deprecated API.
    [javac] Note: Recompile with -Xlint:deprecation for details.
    [javac] 1 warning
     [copy] Copying 2 files to <https://builds.apache.org/job/POI-JDK8/ws/build/ooxml-classes>

compile-examples:
    [javac] Compiling 137 source files to <https://builds.apache.org/job/POI-JDK8/ws/build/examples-classes>
    [javac] warning: [options] bootstrap class path not set in conjunction with -source 1.6
    [javac] Note: Some input files use or override a deprecated API.
    [javac] Note: Recompile with -Xlint:deprecation for details.
    [javac] Note: Some input files use unchecked or unsafe operations.
    [javac] Note: Recompile with -Xlint:unchecked for details.
    [javac] 1 warning
     [copy] Copying 1 file to <https://builds.apache.org/job/POI-JDK8/ws/build/examples-classes>

compile-excelant:
    [javac] Compiling 14 source files to <https://builds.apache.org/job/POI-JDK8/ws/build/excelant-classes>
    [javac] warning: [options] bootstrap class path not set in conjunction with -source 1.6
    [javac] 1 warning
    [javac] Compiling 13 source files to <https://builds.apache.org/job/POI-JDK8/ws/build/excelant-test-classes>
    [javac] warning: [options] bootstrap class path not set in conjunction with -source 1.6
    [javac] 1 warning
     [copy] Copying 1 file to <https://builds.apache.org/job/POI-JDK8/ws/build/excelant-classes>

compile:

compile-ooxml-lite:
    [mkdir] Created dir: <https://builds.apache.org/job/POI-JDK8/ws/build/ooxml-lite-merged>
      [jar] Building jar: <https://builds.apache.org/job/POI-JDK8/ws/build/ooxml-lite-merged/ooxml-lite-merged.jar>
     [java] Java HotSpot(TM) 64-Bit Server VM warning: ignoring option MaxPermSize=256m; support
was removed in 8.0
     [java] Collecting unit tests from <https://builds.apache.org/job/POI-JDK8/ws/build/ooxml-test-classes>
     [java] Found 175 classes
     [java] SLF4J: Failed to load class "org.slf4j.impl.StaticLoggerBinder".
     [java] SLF4J: Defaulting to no-operation (NOP) logger implementation
     [java] SLF4J: See http://www.slf4j.org/codes.html#StaticLoggerBinder for further details.
     [java] .............................................................................I.........................................................................................................................................................Name:
/word/document.xml - Content Type: application/vnd.openxmlformats-officedocument.wordprocessingml.document.main+xml
     [java] .........................................................................................................................II............................................Cell
formula evaluation currently unsupported
     [java] Array formulas currently unsupported
     [java] .Array formulas currently unsupported
     [java] [Fatal Error] :1:1: JAXP00010001: The parser has encountered more than "4096"
entity expansions in this document; this is the limit imposed by the JDK.
     [java] [Fatal Error] :1:1: JAXP00010001: The parser has encountered more than "4096"
entity expansions in this document; this is the limit imposed by the JDK.
     [java] ..........................................................................................................................................................................I......I......................I............I...........................................................................................................................................................................................................................................................................................................................................................................................................................................................................................................................................................................................................................................................................................................................III.II.......I..........I..........I....................................I.......................E.........................................................................................................Setting
col: 0 and row 0
     [java] Setting col: 1 and row 1
     [java] ........................I.I.I.....................................................................................................................................11
     [java] Calibri
     [java] Exception in thread "main" java.lang.RuntimeException: Tests did not succeed,
cannot build ooxml-lite jar
     [java] 	at org.apache.poi.util.OOXMLLite.build(OOXMLLite.java:106)
     [java] 	at org.apache.poi.util.OOXMLLite.main(OOXMLLite.java:87)
     [java] .....................................................I.................................................................................................
     [java] Time: 106.523
     [java] There was 1 failure:
     [java] 1) test58084(org.apache.poi.xssf.usermodel.TestXSSFCellStyle)
     [java] java.lang.RuntimeException: Sample file 'template.xlsx' not found in data dir
'<https://builds.apache.org/job/POI-JDK8/ws/test-data/spreadsheet'>
     [java] 	at org.apache.poi.POIDataSamples.getFile(POIDataSamples.java:166)
     [java] 	at org.apache.poi.POIDataSamples.openResourceAsStream(POIDataSamples.java:148)
     [java] 	at org.apache.poi.hssf.HSSFTestDataSamples.openSampleFileStream(HSSFTestDataSamples.java:39)
     [java] 	at org.apache.poi.xssf.XSSFTestDataSamples.openSampleWorkbook(XSSFTestDataSamples.java:58)
     [java] 	at org.apache.poi.xssf.usermodel.TestXSSFCellStyle.test58084(TestXSSFCellStyle.java:1037)
     [java] 	at sun.reflect.NativeMethodAccessorImpl.invoke0(Native Method)
     [java] 	at sun.reflect.NativeMethodAccessorImpl.invoke(NativeMethodAccessorImpl.java:62)
     [java] 	at sun.reflect.DelegatingMethodAccessorImpl.invoke(DelegatingMethodAccessorImpl.java:43)
     [java] 	at java.lang.reflect.Method.invoke(Method.java:483)
     [java] 	at org.junit.runners.model.FrameworkMethod$1.runReflectiveCall(FrameworkMethod.java:50)
     [java] 	at org.junit.internal.runners.model.ReflectiveCallable.run(ReflectiveCallable.java:12)
     [java] 	at org.junit.runners.model.FrameworkMethod.invokeExplosively(FrameworkMethod.java:47)
     [java] 	at org.junit.internal.runners.statements.InvokeMethod.evaluate(InvokeMethod.java:17)
     [java] 	at org.junit.internal.runners.statements.RunBefores.evaluate(RunBefores.java:26)
     [java] 	at org.junit.runners.ParentRunner.runLeaf(ParentRunner.java:325)
     [java] 	at org.junit.runners.BlockJUnit4ClassRunner.runChild(BlockJUnit4ClassRunner.java:78)
     [java] 	at org.junit.runners.BlockJUnit4ClassRunner.runChild(BlockJUnit4ClassRunner.java:57)
     [java] 	at org.junit.runners.ParentRunner$3.run(ParentRunner.java:290)
     [java] 	at org.junit.runners.ParentRunner$1.schedule(ParentRunner.java:71)
     [java] 	at org.junit.runners.ParentRunner.runChildren(ParentRunner.java:288)
     [java] 	at org.junit.runners.ParentRunner.access$000(ParentRunner.java:58)
     [java] 	at org.junit.runners.ParentRunner$2.evaluate(ParentRunner.java:268)
     [java] 	at org.junit.runners.ParentRunner.run(ParentRunner.java:363)
     [java] 	at org.junit.runners.Suite.runChild(Suite.java:128)
     [java] 	at org.junit.runners.Suite.runChild(Suite.java:27)
     [java] 	at org.junit.runners.ParentRunner$3.run(ParentRunner.java:290)
     [java] 	at org.junit.runners.ParentRunner$1.schedule(ParentRunner.java:71)
     [java] 	at org.junit.runners.ParentRunner.runChildren(ParentRunner.java:288)
     [java] 	at org.junit.runners.ParentRunner.access$000(ParentRunner.java:58)
     [java] 	at org.junit.runners.ParentRunner$2.evaluate(ParentRunner.java:268)
     [java] 	at org.junit.runners.ParentRunner.run(ParentRunner.java:363)
     [java] 	at org.junit.runner.JUnitCore.run(JUnitCore.java:137)
     [java] 	at org.junit.runner.JUnitCore.run(JUnitCore.java:115)
     [java] 	at org.junit.runner.JUnitCore.run(JUnitCore.java:105)
     [java] 	at org.junit.runner.JUnitCore.run(JUnitCore.java:94)
     [java] 	at org.apache.poi.util.OOXMLLite.build(OOXMLLite.java:104)
     [java] 	at org.apache.poi.util.OOXMLLite.main(OOXMLLite.java:87)
     [java] 
     [java] FAILURES!!!
     [java] Tests run: 1806,  Failures: 1
     [java] 

BUILD FAILED
<https://builds.apache.org/job/POI-JDK8/ws/build.xml>:1280: Java returned: 1

Total time: 2 minutes 43 seconds
Build step 'Invoke Ant' marked build as failure
[FINDBUGS] Skipping publisher since build result is FAILURE
[WARNINGS] Skipping publisher since build result is FAILURE
Archiving artifacts
Recording test results
ERROR: Publisher 'Publish JUnit test result report' failed: No test report files were found.
Configuration error?


---------------------------------------------------------------------
To unsubscribe, e-mail: dev-unsubscribe@poi.apache.org
For additional commands, e-mail: dev-help@poi.apache.org


Mime
View raw message