poi-dev mailing list archives

Site index · List index
Message view « Date » · « Thread »
Top « Date » · « Thread »
From Apache Jenkins Server <jenk...@builds.apache.org>
Subject Build failed in Jenkins: POI-JDK8 #678
Date Fri, 06 Nov 2015 07:10:07 GMT
See <https://builds.apache.org/job/POI-JDK8/678/changes>

Changes:

[onealj] remove deprecated ErrorConstants usage in TestWorkbookEvaluator

[onealj] whitespace

[onealj] convert TestWorkbookEvaluator from junit3 to junit4

------------------------------------------
[...truncated 6825 lines...]
AU        src/documentation/resources/images/PropertySet.jpg
AU        src/documentation/resources/images/logoKarmokar1s.png
AU        src/documentation/resources/images/vba-example.jpg
AU        src/documentation/resources/images/POIFSPropertyTablePreWrite.gif
AU        src/documentation/resources/images/logoKarmokar5s.png
AU        src/documentation/resources/images/project-logo.png
AU        src/documentation/resources/images/logoGlenStampoutlzis.png
AU        src/documentation/resources/images/logoDanielFernandez.png
AU        src/documentation/resources/images/POIFSClassDiagram.gif
AU        src/documentation/resources/images/logoAndrewClements2.png
AU        src/documentation/resources/images/POIFSWriteArchive.gif
AU        src/documentation/resources/images/hslf_shapes.gif
AU        src/documentation/resources/images/timesheet.jpg
AU        src/documentation/resources/images/built-with-forrest-button.png
AU        src/documentation/resources/images/calculatePayment.jpg
AU        src/documentation/resources/images/POIFSRootPropertyPreWrite.gif
AU        src/documentation/resources/images/logoKarmokar2s.png
AU        src/documentation/resources/images/logoWendyWise.png
AU        src/documentation/resources/images/old-project-logo.gif
AU        src/documentation/resources/images/logoKarmokar6s.png
AU        src/documentation/resources/images/logoLoicLefevre2.png
AU        src/documentation/resources/images/POIFSAddDocument.gif
AU        src/documentation/resources/images/POIFSInitialization.gif
AU        src/documentation/resources/images/usermodel.gif
AU        src/documentation/resources/images/logoWendyWise2.png
AU        src/documentation/resources/images/POIFSLifeCycle.gif
AU        src/documentation/resources/images/POIFSWriteFilesystem.gif
AU        src/documentation/resources/images/logoAdria1.png
AU        src/documentation/resources/images/logoAdria2.png
AU        src/documentation/resources/images/logoAdria3.png
AU        src/documentation/resources/images/poi-logo.png
AU        src/documentation/resources/images/logoRussellBeattie1.png
AU        src/documentation/resources/images/remove.jpg
AU        src/documentation/resources/images/group-logo.png
AU        src/documentation/resources/images/logoRussellBeattie2.png
AU        src/documentation/resources/images/logoRaPiGmbH1.png
AU        src/documentation/resources/images/logoRussellBeattie3.png
AU        src/documentation/resources/images/logoRaPiGmbH2.png
AU        src/documentation/resources/images/logoRussellBeattie4.png
AU        src/documentation/resources/images/logoRussellBeattie5.png
AU        src/documentation/resources/images/logoKarmokar3s.png
AU        src/documentation/resources/images/logoGustafsson1.png
AU        src/documentation/resources/images/logoRaPiGmbH5.png
AU        src/documentation/resources/images/logoGustafsson2.png
AU        src/documentation/resources/images/logoRaPiGmbH6.png
AU        src/documentation/resources/images/project-logo.jpg
AU        src/documentation/resources/images/logoRaPiGmbH7.png
AU        src/documentation/resources/images/logoRaPiGmbH8.png
AU        src/documentation/resources/images/businessplan.jpg
AU        src/documentation/resources/images/logoRaPiGmbH9.png
AU        src/documentation/resources/images/logoJanssen1.png
AU        src/documentation/resources/images/logoJanssen2.png
AU        src/documentation/resources/images/calendar.jpg
AU        src/documentation/resources/images/loancalc.jpg
AU        src/documentation/resources/images/logoRaPiGmbH10.png
AU        src/documentation/resources/images/utilClasses.gif
AU        src/documentation/resources/images/logoMichaelMosmann.png
AU        src/documentation/resources/images/logoRaPiGmbH11.png
AU        src/documentation/resources/images/logoRaPiGmbH12.png
AU        src/documentation/resources/images/fix.jpg
AU        src/documentation/resources/images/add.jpg
A         src/documentation/README.txt
A         src/documentation/RELEASE-NOTES.txt
A         src/documentation/RN-Changes-3.12.txt
At revision 1712911
At revision 1712911
no change for http://svn.apache.org/repos/asf/poi/trunk/forrest.properties since the previous
build
no change for https://svn.apache.org/repos/asf/poi/site/src/documentation since the previous
build
[EnvInject] - Executing scripts and injecting environment variables after the SCM step.
[EnvInject] - Injecting as environment variables the properties content 
LANG=en_US.UTF-8

[EnvInject] - Variables injected successfully.
[POI-JDK8] $ /home/jenkins/tools/ant/latest/bin/ant -Dcoverage.enabled=true clean jenkins
Buildfile: <https://builds.apache.org/job/POI-JDK8/ws/build.xml>

clean:

check-jars:

fetch-jars:

testexist:

downloadfile:
      [get] Getting: http://repo1.maven.org/maven2/commons-logging/commons-logging/1.2/commons-logging-1.2.jar
      [get] To: <https://builds.apache.org/job/POI-JDK8/ws/lib/commons-logging-1.2.jar>

testexist:

downloadfile:
      [get] Getting: http://repo1.maven.org/maven2/commons-codec/commons-codec/1.10/commons-codec-1.10.jar
      [get] To: <https://builds.apache.org/job/POI-JDK8/ws/lib/commons-codec-1.10.jar>

testexist:

downloadfile:
      [get] Getting: http://repo1.maven.org/maven2/log4j/log4j/1.2.17/log4j-1.2.17.jar
      [get] To: <https://builds.apache.org/job/POI-JDK8/ws/lib/log4j-1.2.17.jar>

testexist:

downloadfile:
      [get] Getting: http://repo1.maven.org/maven2/junit/junit/4.12/junit-4.12.jar
      [get] To: <https://builds.apache.org/job/POI-JDK8/ws/lib/junit-4.12.jar>

testexist:

downloadfile:
      [get] Getting: http://repo1.maven.org/maven2/org/hamcrest/hamcrest-core/1.3/hamcrest-core-1.3.jar
      [get] To: <https://builds.apache.org/job/POI-JDK8/ws/lib/hamcrest-core-1.3.jar>

testexist:

downloadfile:
      [get] Getting: http://repo1.maven.org/maven2/org/apache/ant/ant/1.9.4/ant-1.9.4.jar
      [get] To: <https://builds.apache.org/job/POI-JDK8/ws/lib/ant-1.9.4.jar>

testexist:

downloadfile:
      [get] Getting: http://repo1.maven.org/maven2/org/apache/ant/ant-launcher/1.9.4/ant-launcher-1.9.4.jar
      [get] To: <https://builds.apache.org/job/POI-JDK8/ws/lib/ant-launcher-1.9.4.jar>

testexist:

downloadfile:
      [get] Getting: http://repo1.maven.org/maven2/org/ow2/asm/asm-all/5.0.3/asm-all-5.0.3.jar
      [get] To: <https://builds.apache.org/job/POI-JDK8/ws/lib/asm-all-5.0.3.jar>

testexist:

downloadfile:
      [get] Getting: http://repo1.maven.org/maven2/org/jacoco/jacoco/0.7.4.201502262128/jacoco-0.7.4.201502262128.zip
      [get] To: <https://builds.apache.org/job/POI-JDK8/ws/lib/jacoco-0.7.4.201502262128.zip>
    [unzip] Expanding: <https://builds.apache.org/job/POI-JDK8/ws/lib/jacoco-0.7.4.201502262128.zip>
into <https://builds.apache.org/job/POI-JDK8/ws/>

testexist:

downloadfile:
      [get] Getting: http://repo1.maven.org/maven2/org/apache/rat/apache-rat/0.11/apache-rat-0.11.jar
      [get] To: <https://builds.apache.org/job/POI-JDK8/ws/lib/apache-rat-0.11.jar>

testexist:

downloadfile:
      [get] Getting: http://repo1.maven.org/maven2/de/thetaphi/forbiddenapis/2.0/forbiddenapis-2.0.jar
      [get] To: <https://builds.apache.org/job/POI-JDK8/ws/lib/forbiddenapis-2.0.jar>

testexist:

downloadfile:
      [get] Getting: http://repo1.maven.org/maven2/org/bouncycastle/bcprov-ext-jdk15on/1.53/bcprov-ext-jdk15on-1.53.jar
      [get] To: <https://builds.apache.org/job/POI-JDK8/ws/compile-lib/bcprov-ext-jdk15on-1.53.jar>

testexist:

downloadfile:
      [get] Getting: http://repo1.maven.org/maven2/org/bouncycastle/bcpkix-jdk15on/1.53/bcpkix-jdk15on-1.53.jar
      [get] To: <https://builds.apache.org/job/POI-JDK8/ws/compile-lib/bcpkix-jdk15on-1.53.jar>

testexist:

downloadfile:
      [get] Getting: http://repo1.maven.org/maven2/org/apache/santuario/xmlsec/2.0.5/xmlsec-2.0.5.jar
      [get] To: <https://builds.apache.org/job/POI-JDK8/ws/compile-lib/xmlsec-2.0.5.jar>

testexist:

downloadfile:
      [get] Getting: http://repo1.maven.org/maven2/org/slf4j/slf4j-api/1.7.12/slf4j-api-1.7.12.jar
      [get] To: <https://builds.apache.org/job/POI-JDK8/ws/compile-lib/slf4j-api-1.7.12.jar>

check-ooxml-jars:

fetch-ooxml-jars:

testexist:

downloadfile:
      [get] Getting: http://repo1.maven.org/maven2/com/github/virtuald/curvesapi/1.03/curvesapi-1.03.jar
      [get] To: <https://builds.apache.org/job/POI-JDK8/ws/ooxml-lib/curvesapi-1.03.jar>

testexist:

downloadfile:
      [get] Getting: http://repo1.maven.org/maven2/org/apache/xmlbeans/xmlbeans/2.3.0/xmlbeans-2.3.0.jar
      [get] To: <https://builds.apache.org/job/POI-JDK8/ws/ooxml-lib/xmlbeans-2.3.0.jar>

testexist:

downloadfile:
      [get] Getting: http://repo1.maven.org/maven2/org/apache/xmlbeans/xmlbeans/2.6.0/xmlbeans-2.6.0.jar
      [get] To: <https://builds.apache.org/job/POI-JDK8/ws/ooxml-lib/xmlbeans-2.6.0.jar>

init:
    [mkdir] Created dir: <https://builds.apache.org/job/POI-JDK8/ws/build>
    [mkdir] Created dir: <https://builds.apache.org/job/POI-JDK8/ws/build/classes>
    [mkdir] Created dir: <https://builds.apache.org/job/POI-JDK8/ws/build/test-classes>
    [mkdir] Created dir: <https://builds.apache.org/job/POI-JDK8/ws/build/test-results>
    [mkdir] Created dir: <https://builds.apache.org/job/POI-JDK8/ws/build/scratchpad-classes>
    [mkdir] Created dir: <https://builds.apache.org/job/POI-JDK8/ws/build/scratchpad-test-classes>
    [mkdir] Created dir: <https://builds.apache.org/job/POI-JDK8/ws/build/scratchpad-test-results>
    [mkdir] Created dir: <https://builds.apache.org/job/POI-JDK8/ws/build/geometry-java>
    [mkdir] Created dir: <https://builds.apache.org/job/POI-JDK8/ws/build/ooxml-classes>
    [mkdir] Created dir: <https://builds.apache.org/job/POI-JDK8/ws/build/ooxml-test-classes>
    [mkdir] Created dir: <https://builds.apache.org/job/POI-JDK8/ws/build/ooxml-test-results>
    [mkdir] Created dir: <https://builds.apache.org/job/POI-JDK8/ws/build/excelant-classes>
    [mkdir] Created dir: <https://builds.apache.org/job/POI-JDK8/ws/build/excelant-test-classes>
    [mkdir] Created dir: <https://builds.apache.org/job/POI-JDK8/ws/build/excelant-test-results>
    [mkdir] Created dir: <https://builds.apache.org/job/POI-JDK8/ws/build/examples-classes>
    [mkdir] Created dir: <https://builds.apache.org/job/POI-JDK8/ws/build/integration-test-classes>
    [mkdir] Created dir: <https://builds.apache.org/job/POI-JDK8/678/artifact/build/integration-test-results>
    [mkdir] Created dir: <https://builds.apache.org/job/POI-JDK8/ws/build/dist>
    [mkdir] Created dir: <https://builds.apache.org/job/POI-JDK8/ws/build/tmp/site/build/site>
     [echo] Using Java: 1.8.0_20/1.8.0_20-b26/25.20-b23/Java HotSpot(TM) 64-Bit Server VM
from Oracle Corporation on Linux: 3.13.0-30-generic

compile-main:
    [javac] Compiling 1182 source files to <https://builds.apache.org/job/POI-JDK8/ws/build/classes>
    [javac] warning: [options] bootstrap class path not set in conjunction with -source 1.6
    [javac] Note: Some input files use or override a deprecated API.
    [javac] Note: Recompile with -Xlint:deprecation for details.
    [javac] Note: <https://builds.apache.org/job/POI-JDK8/ws/src/java/org/apache/poi/hpsf/CustomProperties.java>
uses unchecked or unsafe operations.
    [javac] Note: Recompile with -Xlint:unchecked for details.
    [javac] 1 warning
    [javac] Compiling 515 source files to <https://builds.apache.org/job/POI-JDK8/ws/build/test-classes>
    [javac] warning: [options] bootstrap class path not set in conjunction with -source 1.6
    [javac] <https://builds.apache.org/job/POI-JDK8/ws/src/testcases/org/apache/poi/ss/formula/AllSSFormulaTests.java>:34:
error: incompatible types: Class<TestWorkbookEvaluator> cannot be converted to Class<?
extends TestCase>
    [javac] 		result.addTestSuite(TestWorkbookEvaluator.class);
    [javac] 		                                         ^
    [javac] Note: Some input files use or override a deprecated API.
    [javac] Note: Recompile with -Xlint:deprecation for details.
    [javac] Note: Some input files use unchecked or unsafe operations.
    [javac] Note: Recompile with -Xlint:unchecked for details.
    [javac] Note: Some messages have been simplified; recompile with -Xdiags:verbose to get
full output
    [javac] 1 error
    [javac] 1 warning

BUILD FAILED
<https://builds.apache.org/job/POI-JDK8/ws/build.xml>:748: Compile failed; see the compiler
error output for details.

Total time: 24 seconds
Build step 'Invoke Ant' marked build as failure
[FINDBUGS] Skipping publisher since build result is FAILURE
[WARNINGS] Skipping publisher since build result is FAILURE
Archiving artifacts
Recording test results
ERROR: Publisher 'Publish JUnit test result report' failed: No test report files were found.
Configuration error?


---------------------------------------------------------------------
To unsubscribe, e-mail: dev-unsubscribe@poi.apache.org
For additional commands, e-mail: dev-help@poi.apache.org


Mime
View raw message