poi-dev mailing list archives

Site index · List index
Message view « Date » · « Thread »
Top « Date » · « Thread »
From Apache Jenkins Server <jenk...@builds.apache.org>
Subject Build failed in Jenkins: POI-JDK8 #703
Date Mon, 23 Nov 2015 14:13:45 GMT
See <https://builds.apache.org/job/POI-JDK8/703/changes>

Changes:

[onealj] revert accidental change to .project

[onealj] prevent slideshow test-data files shapes.pptx and tables_test.pptx from being modified
when running "ant test"; close open resources

[onealj] bug 58365: patch from Hannes Erven. Update XSSFSheetXMLHandler.java to use CellAddress
instead of CellReference/String

[onealj] whitespace

[onealj] bug 58365: patch from Hannes Erven. Update CommentsTable to use CellAddress instead
of String

------------------------------------------
Started by an SCM change
[EnvInject] - Loading node environment variables.
Building remotely on ubuntu-2 (docker Ubuntu ubuntu) in workspace <https://builds.apache.org/job/POI-JDK8/ws/>
Updating http://svn.apache.org/repos/asf/poi/trunk at revision '2015-11-23T14:12:49.243 +0000'
U         src/java/org/apache/poi/ss/util/CellReference.java
AU        src/java/org/apache/poi/ss/util/CellAddress.java
U         src/ooxml/testcases/org/apache/poi/sl/TestTable.java
U         src/ooxml/testcases/org/apache/poi/sl/draw/TestDrawPictureShape.java
U         src/ooxml/testcases/org/apache/poi/xssf/AllXSSFTests.java
U         src/ooxml/testcases/org/apache/poi/xssf/usermodel/TestXSSFComment.java
U         src/ooxml/testcases/org/apache/poi/xssf/model/TestCommentsTable.java
U         src/ooxml/testcases/org/apache/poi/xslf/usermodel/TestXSLFSlide.java
U         src/ooxml/testcases/org/apache/poi/xslf/usermodel/TestXSLFShape.java
U         src/ooxml/testcases/org/apache/poi/xslf/usermodel/TestXSLFHyperlink.java
U         src/ooxml/testcases/org/apache/poi/xslf/XSLFTestDataSamples.java
U         src/ooxml/java/org/apache/poi/xssf/eventusermodel/XSSFSheetXMLHandler.java
U         src/ooxml/java/org/apache/poi/xssf/model/CommentsTable.java
U         src/testcases/org/apache/poi/hssf/util/AllHSSFUtilTests.java
U         src/testcases/org/apache/poi/hssf/util/TestCellReference.java
A         src/testcases/org/apache/poi/ss/util/TestCellAddress.java
U         src/testcases/org/apache/poi/ss/util/TestCellReference.java
U         src/testcases/org/apache/poi/ss/util/AllSSUtilTests.java
Fetching 'https://svn.apache.org/repos/asf/poi/site/forrest.properties' at -1 into '<https://builds.apache.org/job/POI-JDK8/ws/forrest.properties'>
Fetching 'https://svn.apache.org/repos/asf/poi/site/src/documentation' at -1 into '<https://builds.apache.org/job/POI-JDK8/ws/src/documentation'>
U         src/documentation/content/xdocs/status.xml
At revision 1715830
At revision 1715830
no change for http://svn.apache.org/repos/asf/poi/trunk/forrest.properties since the previous
build
no change for https://svn.apache.org/repos/asf/poi/site/src/documentation since the previous
build
[EnvInject] - Executing scripts and injecting environment variables after the SCM step.
[EnvInject] - Injecting as environment variables the properties content 
LANG=en_US.UTF-8

[EnvInject] - Variables injected successfully.
[POI-JDK8] $ /home/jenkins/tools/ant/latest/bin/ant -Dcoverage.enabled=true clean jenkins
Buildfile: <https://builds.apache.org/job/POI-JDK8/ws/build.xml>

clean:
   [delete] Deleting directory <https://builds.apache.org/job/POI-JDK8/ws/build>

check-jars:

fetch-jars:

check-ooxml-jars:

fetch-ooxml-jars:

init:
    [mkdir] Created dir: <https://builds.apache.org/job/POI-JDK8/ws/build>
    [mkdir] Created dir: <https://builds.apache.org/job/POI-JDK8/ws/build/classes>
    [mkdir] Created dir: <https://builds.apache.org/job/POI-JDK8/ws/build/test-classes>
    [mkdir] Created dir: <https://builds.apache.org/job/POI-JDK8/ws/build/test-results>
    [mkdir] Created dir: <https://builds.apache.org/job/POI-JDK8/ws/build/scratchpad-classes>
    [mkdir] Created dir: <https://builds.apache.org/job/POI-JDK8/ws/build/scratchpad-test-classes>
    [mkdir] Created dir: <https://builds.apache.org/job/POI-JDK8/ws/build/scratchpad-test-results>
    [mkdir] Created dir: <https://builds.apache.org/job/POI-JDK8/ws/build/geometry-java>
    [mkdir] Created dir: <https://builds.apache.org/job/POI-JDK8/ws/build/ooxml-classes>
    [mkdir] Created dir: <https://builds.apache.org/job/POI-JDK8/ws/build/ooxml-test-classes>
    [mkdir] Created dir: <https://builds.apache.org/job/POI-JDK8/ws/build/ooxml-test-results>
    [mkdir] Created dir: <https://builds.apache.org/job/POI-JDK8/ws/build/excelant-classes>
    [mkdir] Created dir: <https://builds.apache.org/job/POI-JDK8/ws/build/excelant-test-classes>
    [mkdir] Created dir: <https://builds.apache.org/job/POI-JDK8/ws/build/excelant-test-results>
    [mkdir] Created dir: <https://builds.apache.org/job/POI-JDK8/ws/build/examples-classes>
    [mkdir] Created dir: <https://builds.apache.org/job/POI-JDK8/ws/build/integration-test-classes>
    [mkdir] Created dir: <https://builds.apache.org/job/POI-JDK8/703/artifact/build/integration-test-results>
    [mkdir] Created dir: <https://builds.apache.org/job/POI-JDK8/ws/build/dist>
    [mkdir] Created dir: <https://builds.apache.org/job/POI-JDK8/ws/build/tmp/site/build/site>
     [echo] Using Java: 1.8.0_20/1.8.0_20-b26/25.20-b23/Java HotSpot(TM) 64-Bit Server VM
from Oracle Corporation on Linux: 3.13.0-36-lowlatency

compile-main:
    [javac] Compiling 1183 source files to <https://builds.apache.org/job/POI-JDK8/ws/build/classes>
    [javac] warning: [options] bootstrap class path not set in conjunction with -source 1.6
    [javac] Note: Some input files use or override a deprecated API.
    [javac] Note: Recompile with -Xlint:deprecation for details.
    [javac] Note: <https://builds.apache.org/job/POI-JDK8/ws/src/java/org/apache/poi/hpsf/CustomProperties.java>
uses unchecked or unsafe operations.
    [javac] Note: Recompile with -Xlint:unchecked for details.
    [javac] 1 warning
    [javac] Compiling 516 source files to <https://builds.apache.org/job/POI-JDK8/ws/build/test-classes>
    [javac] warning: [options] bootstrap class path not set in conjunction with -source 1.6
    [javac] Note: Some input files use or override a deprecated API.
    [javac] Note: Recompile with -Xlint:deprecation for details.
    [javac] Note: Some input files use unchecked or unsafe operations.
    [javac] Note: Recompile with -Xlint:unchecked for details.
    [javac] 1 warning
     [copy] Copying 4 files to <https://builds.apache.org/job/POI-JDK8/ws/build/classes>

check-ooxml-xsds:

fetch-ooxml-xsds:

generate-geometry:

compile-scratchpad:
    [javac] Compiling 439 source files to <https://builds.apache.org/job/POI-JDK8/ws/build/scratchpad-classes>
    [javac] warning: [options] bootstrap class path not set in conjunction with -source 1.6
    [javac] Note: Some input files use or override a deprecated API.
    [javac] Note: Recompile with -Xlint:deprecation for details.
    [javac] Note: <https://builds.apache.org/job/POI-JDK8/ws/src/scratchpad/src/org/apache/poi/hwpf/model/PropertyNode.java>
uses unchecked or unsafe operations.
    [javac] Note: Recompile with -Xlint:unchecked for details.
    [javac] 1 warning
    [javac] Compiling 181 source files to <https://builds.apache.org/job/POI-JDK8/ws/build/scratchpad-test-classes>
    [javac] warning: [options] bootstrap class path not set in conjunction with -source 1.6
    [javac] Note: Some input files use or override a deprecated API.
    [javac] Note: Recompile with -Xlint:deprecation for details.
    [javac] Note: <https://builds.apache.org/job/POI-JDK8/ws/src/scratchpad/testcases/org/apache/poi/hslf/TestReWriteSanity.java>
uses unchecked or unsafe operations.
    [javac] Note: Recompile with -Xlint:unchecked for details.
    [javac] 1 warning
     [copy] Copying 2 files to <https://builds.apache.org/job/POI-JDK8/ws/build/scratchpad-classes>

check-compiled-ooxml-xsds:

compile-ooxml-xsds:

compile-ooxml:
    [javac] Compiling 405 source files to <https://builds.apache.org/job/POI-JDK8/ws/build/ooxml-classes>
    [javac] warning: [options] bootstrap class path not set in conjunction with -source 1.6
    [javac] Note: Some input files use or override a deprecated API.
    [javac] Note: Recompile with -Xlint:deprecation for details.
    [javac] 1 warning
    [javac] Compiling 191 source files to <https://builds.apache.org/job/POI-JDK8/ws/build/ooxml-test-classes>
    [javac] warning: [options] bootstrap class path not set in conjunction with -source 1.6
    [javac] <https://builds.apache.org/job/POI-JDK8/ws/src/ooxml/testcases/org/apache/poi/xslf/usermodel/TestXSLFSheet.java>:61:
error: unreported exception IOException; must be caught or declared to be thrown
    [javac]         ppt = XSLFTestDataSamples.writeOutAndReadBack(ppt);
    [javac]                                                      ^
    [javac] Note: Some input files use or override a deprecated API.
    [javac] Note: Recompile with -Xlint:deprecation for details.
    [javac] 1 error
    [javac] 1 warning

BUILD FAILED
<https://builds.apache.org/job/POI-JDK8/ws/build.xml>:909: Compile failed; see the compiler
error output for details.

Total time: 45 seconds
Build step 'Invoke Ant' marked build as failure
[FINDBUGS] Skipping publisher since build result is FAILURE
[WARNINGS] Skipping publisher since build result is FAILURE
Archiving artifacts
Recording test results
ERROR: Publisher 'Publish JUnit test result report' failed: No test report files were found.
Configuration error?


---------------------------------------------------------------------
To unsubscribe, e-mail: dev-unsubscribe@poi.apache.org
For additional commands, e-mail: dev-help@poi.apache.org


Mime
View raw message