poi-dev mailing list archives

Site index · List index
Message view « Date » · « Thread »
Top « Date » · « Thread »
From Apache Jenkins Server <jenk...@builds.apache.org>
Subject Build failed in Jenkins: POI-JDK8 #555
Date Tue, 01 Sep 2015 22:18:49 GMT
See <https://builds.apache.org/job/POI-JDK8/555/changes>

Changes:

[nick] Fix some Forbidden APIs errors

[nick] Fix some Forbidden APIs errors

[nick] Fix some Forbidden APIs errors

[nick] Fix some Forbidden APIs errors

[nick] Fix some Forbidden APIs errors

------------------------------------------
[...truncated 404 lines...]
    [junit] Tests run: 2, Failures: 0, Errors: 0, Time elapsed: 0.002 sec
    [junit] Running org.apache.poi.hssf.record.TestDConRefRecord
    [junit] Tests run: 8, Failures: 0, Errors: 0, Time elapsed: 0.002 sec
    [junit] Running org.apache.poi.hssf.record.TestDVALRecord
    [junit] Tests run: 1, Failures: 0, Errors: 0, Time elapsed: 0.001 sec
    [junit] Running org.apache.poi.hssf.record.TestDrawingGroupRecord
    [junit] Tests run: 3, Failures: 0, Errors: 0, Time elapsed: 0.002 sec
    [junit] Running org.apache.poi.hssf.record.TestDrawingRecord
    [junit] Tests run: 1, Failures: 0, Errors: 0, Time elapsed: 0.001 sec
    [junit] Running org.apache.poi.hssf.record.TestEmbeddedObjectRefSubRecord
    [junit] Tests run: 5, Failures: 0, Errors: 0, Time elapsed: 0.003 sec
    [junit] Running org.apache.poi.hssf.record.TestEndSubRecord
    [junit] Tests run: 2, Failures: 0, Errors: 0, Time elapsed: 0.002 sec
    [junit] Running org.apache.poi.hssf.record.TestEscherAggregate
    [junit] Tests run: 2, Failures: 0, Errors: 0, Time elapsed: 0.002 sec
    [junit] Running org.apache.poi.hssf.record.TestExtSSTRecord
    [junit] Tests run: 1, Failures: 0, Errors: 0, Time elapsed: 0.003 sec
    [junit] Running org.apache.poi.hssf.record.TestExtendedFormatRecord
    [junit] Tests run: 3, Failures: 0, Errors: 0, Time elapsed: 0.002 sec
    [junit] Running org.apache.poi.hssf.record.TestExternalNameRecord
    [junit] Tests run: 8, Failures: 0, Errors: 0, Time elapsed: 0.002 sec
    [junit] Running org.apache.poi.hssf.record.TestFeatRecord
    [junit] Tests run: 3, Failures: 0, Errors: 0, Time elapsed: 0.003 sec
    [junit] Running org.apache.poi.hssf.record.TestFontRecord
    [junit] Tests run: 5, Failures: 0, Errors: 0, Time elapsed: 0.002 sec
    [junit] Running org.apache.poi.hssf.record.TestFormulaRecord
    [junit] Tests run: 6, Failures: 0, Errors: 0, Time elapsed: 0.001 sec
    [junit] Running org.apache.poi.hssf.record.TestFtCblsSubRecord
    [junit] Tests run: 3, Failures: 0, Errors: 0, Time elapsed: 0.001 sec
    [junit] Running org.apache.poi.hssf.record.TestHyperlinkRecord
    [junit] Tests run: 15, Failures: 0, Errors: 0, Time elapsed: 0.005 sec
    [junit] Running org.apache.poi.hssf.record.TestInterfaceEndRecord
    [junit] Tests run: 2, Failures: 0, Errors: 0, Time elapsed: 0.001 sec
    [junit] Running org.apache.poi.hssf.record.TestLabelRecord
    [junit] Tests run: 1, Failures: 0, Errors: 0, Time elapsed: 0.057 sec
    [junit] Running org.apache.poi.hssf.record.TestLbsDataSubRecord
    [junit] Tests run: 4, Failures: 0, Errors: 0, Time elapsed: 0.002 sec
    [junit] Running org.apache.poi.hssf.record.TestMergeCellsRecord
    [junit] Tests run: 2, Failures: 0, Errors: 0, Time elapsed: 0.001 sec
    [junit] Running org.apache.poi.hssf.record.TestNameCommentRecord
    [junit] Tests run: 1, Failures: 0, Errors: 0, Time elapsed: 0.001 sec
    [junit] Running org.apache.poi.hssf.record.TestNameRecord
    [junit] Tests run: 6, Failures: 0, Errors: 0, Time elapsed: 0.005 sec
    [junit] Running org.apache.poi.hssf.record.TestNoteRecord
    [junit] Tests run: 4, Failures: 0, Errors: 0, Time elapsed: 0.001 sec
    [junit] Running org.apache.poi.hssf.record.TestNoteStructureSubRecord
    [junit] Tests run: 3, Failures: 0, Errors: 0, Time elapsed: 0.002 sec
    [junit] Running org.apache.poi.hssf.record.TestObjRecord
    [junit] Tests run: 5, Failures: 0, Errors: 0, Time elapsed: 0.002 sec
    [junit] Running org.apache.poi.hssf.record.TestPLVRecord
    [junit] Tests run: 1, Failures: 0, Errors: 0, Time elapsed: 0.007 sec
    [junit] Running org.apache.poi.hssf.record.TestPaletteRecord
    [junit] Tests run: 1, Failures: 0, Errors: 0, Time elapsed: 0.026 sec
    [junit] Running org.apache.poi.hssf.record.TestPaneRecord
    [junit] Tests run: 2, Failures: 0, Errors: 0, Time elapsed: 0.001 sec
    [junit] Running org.apache.poi.hssf.record.TestRecalcIdRecord
    [junit] Tests run: 2, Failures: 0, Errors: 0, Time elapsed: 0.001 sec
    [junit] Running org.apache.poi.hssf.record.TestRecordFactory
    [junit] Tests run: 5, Failures: 0, Errors: 0, Time elapsed: 0.003 sec
    [junit] Running org.apache.poi.hssf.record.TestRecordFactoryInputStream
    [junit] Tests run: 4, Failures: 0, Errors: 0, Time elapsed: 0.016 sec
    [junit] Running org.apache.poi.hssf.record.TestRecordInputStream
    [junit] Tests run: 4, Failures: 0, Errors: 0, Time elapsed: 0.001 sec
    [junit] Running org.apache.poi.hssf.record.TestSCLRecord
    [junit] Tests run: 2, Failures: 0, Errors: 0, Time elapsed: 0.001 sec
    [junit] Running org.apache.poi.hssf.record.TestSSTDeserializer
    [junit] Tests run: 4, Failures: 0, Errors: 0, Time elapsed: 0.028 sec
    [junit] Running org.apache.poi.hssf.record.TestSSTRecord
    [junit] Tests run: 9, Failures: 0, Errors: 0, Time elapsed: 0.041 sec
    [junit] Running org.apache.poi.hssf.record.TestSSTRecordSizeCalculator
    [junit] Tests run: 6, Failures: 0, Errors: 0, Time elapsed: 0.002 sec
    [junit] Running org.apache.poi.hssf.record.TestSharedFormulaRecord
    [junit] Tests run: 5, Failures: 0, Errors: 0, Time elapsed: 0.02 sec
    [junit] Running org.apache.poi.hssf.record.TestStringRecord
    [junit] Tests run: 3, Failures: 0, Errors: 0, Time elapsed: 0.002 sec
    [junit] Running org.apache.poi.hssf.record.TestStyleRecord
    [junit] Tests run: 1, Failures: 0, Errors: 0, Time elapsed: 0.001 sec
    [junit] Running org.apache.poi.hssf.record.TestSubRecord
    [junit] Tests run: 3, Failures: 0, Errors: 0, Time elapsed: 0.002 sec
    [junit] Running org.apache.poi.hssf.record.TestSupBookRecord
    [junit] Tests run: 7, Failures: 0, Errors: 0, Time elapsed: 0.002 sec
    [junit] Running org.apache.poi.hssf.record.TestTableRecord
    [junit] Tests run: 2, Failures: 0, Errors: 0, Time elapsed: 0.001 sec
    [junit] Running org.apache.poi.hssf.record.TestTextObjectBaseRecord
    [junit] Tests run: 2, Failures: 0, Errors: 0, Time elapsed: 0.001 sec
    [junit] Running org.apache.poi.hssf.record.TestTextObjectRecord
    [junit] Tests run: 6, Failures: 0, Errors: 0, Time elapsed: 0.006 sec
    [junit] Running org.apache.poi.hssf.record.TestUnicodeNameRecord
    [junit] Tests run: 1, Failures: 0, Errors: 0, Time elapsed: 0.004 sec
    [junit] Running org.apache.poi.hssf.record.TestWriteAccessRecord
    [junit] Tests run: 2, Failures: 0, Errors: 0, Time elapsed: 0.001 sec
    [junit] Running org.apache.poi.hssf.record.aggregates.TestCFRecordsAggregate
    [junit] Tests run: 3, Failures: 0, Errors: 0, Time elapsed: 0.004 sec
    [junit] Running org.apache.poi.hssf.record.aggregates.TestColumnInfoRecordsAggregate
    [junit] Tests run: 3, Failures: 0, Errors: 0, Time elapsed: 0.003 sec
    [junit] Running org.apache.poi.hssf.record.aggregates.TestFormulaRecordAggregate
    [junit] Tests run: 3, Failures: 0, Errors: 0, Time elapsed: 0.001 sec
    [junit] Running org.apache.poi.hssf.record.aggregates.TestPageSettingsBlock
    [junit] Tests run: 9, Failures: 0, Errors: 0, Time elapsed: 0.004 sec
    [junit] Running org.apache.poi.hssf.record.aggregates.TestRowRecordsAggregate
    [junit] Tests run: 3, Failures: 0, Errors: 0, Time elapsed: 0.003 sec
    [junit] Running org.apache.poi.hssf.record.aggregates.TestSharedValueManager
    [junit] Tests run: 4, Failures: 0, Errors: 0, Time elapsed: 0.014 sec
    [junit] Running org.apache.poi.hssf.record.aggregates.TestValueRecordsAggregate
    [junit] Tests run: 10, Failures: 0, Errors: 0, Time elapsed: 0.006 sec
    [junit] Running org.apache.poi.hssf.record.cf.TestCellRange
    [junit] Tests run: 8, Failures: 0, Errors: 0, Time elapsed: 0.003 sec
    [junit] Running org.apache.poi.hssf.record.chart.TestAreaFormatRecord
    [junit] Tests run: 2, Failures: 0, Errors: 0, Time elapsed: 0.001 sec
    [junit] Running org.apache.poi.hssf.record.chart.TestAreaRecord
    [junit] Tests run: 2, Failures: 0, Errors: 0, Time elapsed: 0.001 sec
    [junit] Running org.apache.poi.hssf.record.chart.TestAxisLineFormatRecord
    [junit] Tests run: 2, Failures: 0, Errors: 0, Time elapsed: 0 sec
    [junit] Running org.apache.poi.hssf.record.chart.TestAxisOptionsRecord
    [junit] Tests run: 2, Failures: 0, Errors: 0, Time elapsed: 0.001 sec
    [junit] Running org.apache.poi.hssf.record.chart.TestAxisParentRecord
    [junit] Tests run: 2, Failures: 0, Errors: 0, Time elapsed: 0.001 sec
    [junit] Running org.apache.poi.hssf.record.chart.TestAxisRecord
    [junit] Tests run: 2, Failures: 0, Errors: 0, Time elapsed: 0.001 sec
    [junit] Running org.apache.poi.hssf.record.chart.TestAxisUsedRecord
    [junit] Tests run: 2, Failures: 0, Errors: 0, Time elapsed: 0.001 sec
    [junit] Running org.apache.poi.hssf.record.chart.TestBarRecord
    [junit] Tests run: 2, Failures: 0, Errors: 0, Time elapsed: 0.001 sec
    [junit] Running org.apache.poi.hssf.record.chart.TestCategorySeriesAxisRecord
    [junit] Tests run: 2, Failures: 0, Errors: 0, Time elapsed: 0.001 sec
    [junit] Running org.apache.poi.hssf.record.chart.TestChartFormatRecord
    [junit] Tests run: 1, Failures: 0, Errors: 0, Time elapsed: 0.001 sec
    [junit] Running org.apache.poi.hssf.record.chart.TestChartRecord
    [junit] Tests run: 2, Failures: 0, Errors: 0, Time elapsed: 0.001 sec
    [junit] Running org.apache.poi.hssf.record.chart.TestChartTitleFormatRecord
    [junit] Tests run: 1, Failures: 0, Errors: 0, Time elapsed: 0.003 sec
    [junit] Running org.apache.poi.hssf.record.chart.TestDatRecord
    [junit] Tests run: 2, Failures: 0, Errors: 0, Time elapsed: 0.001 sec
    [junit] Running org.apache.poi.hssf.record.chart.TestDataFormatRecord
    [junit] Tests run: 2, Failures: 0, Errors: 0, Time elapsed: 0.001 sec
    [junit] Running org.apache.poi.hssf.record.chart.TestDefaultDataLabelTextPropertiesRecord
    [junit] Tests run: 2, Failures: 0, Errors: 0, Time elapsed: 0.001 sec
    [junit] Running org.apache.poi.hssf.record.chart.TestFontBasisRecord
    [junit] Tests run: 2, Failures: 0, Errors: 0, Time elapsed: 0.001 sec
    [junit] Running org.apache.poi.hssf.record.chart.TestFontIndexRecord
    [junit] Tests run: 2, Failures: 0, Errors: 0, Time elapsed: 0.001 sec
    [junit] Running org.apache.poi.hssf.record.chart.TestFrameRecord
    [junit] Tests run: 2, Failures: 0, Errors: 0, Time elapsed: 0.001 sec
    [junit] Running org.apache.poi.hssf.record.chart.TestLegendRecord
    [junit] Tests run: 2, Failures: 0, Errors: 0, Time elapsed: 0.001 sec
    [junit] Running org.apache.poi.hssf.record.chart.TestLineFormatRecord
    [junit] Tests run: 2, Failures: 0, Errors: 0, Time elapsed: 0.001 sec
    [junit] Running org.apache.poi.hssf.record.chart.TestLinkedDataRecord
    [junit] Tests run: 2, Failures: 0, Errors: 0, Time elapsed: 0.001 sec
    [junit] Running org.apache.poi.hssf.record.chart.TestNumberFormatIndexRecord
    [junit] Tests run: 2, Failures: 0, Errors: 0, Time elapsed: 0.001 sec
    [junit] Running org.apache.poi.hssf.record.chart.TestObjectLinkRecord
    [junit] Tests run: 2, Failures: 0, Errors: 0, Time elapsed: 0.001 sec
    [junit] Running org.apache.poi.hssf.record.chart.TestPlotAreaRecord
    [junit] Tests run: 2, Failures: 0, Errors: 0, Time elapsed: 0.001 sec
    [junit] Running org.apache.poi.hssf.record.chart.TestPlotGrowthRecord
    [junit] Tests run: 2, Failures: 0, Errors: 0, Time elapsed: 0.001 sec
    [junit] Running org.apache.poi.hssf.record.chart.TestSeriesChartGroupIndexRecord
    [junit] Tests run: 2, Failures: 0, Errors: 0, Time elapsed: 0.002 sec
    [junit] Running org.apache.poi.hssf.record.chart.TestSeriesIndexRecord
    [junit] Tests run: 2, Failures: 0, Errors: 0, Time elapsed: 0.001 sec
    [junit] Running org.apache.poi.hssf.record.chart.TestSeriesLabelsRecord
    [junit] Tests run: 2, Failures: 0, Errors: 0, Time elapsed: 0.002 sec
    [junit] Running org.apache.poi.hssf.record.chart.TestSeriesListRecord
    [junit] Tests run: 2, Failures: 0, Errors: 0, Time elapsed: 0.001 sec
    [junit] Running org.apache.poi.hssf.record.chart.TestSeriesRecord
    [junit] Tests run: 2, Failures: 0, Errors: 0, Time elapsed: 0.001 sec
    [junit] Running org.apache.poi.hssf.record.chart.TestSeriesTextRecord
    [junit] Tests run: 3, Failures: 0, Errors: 0, Time elapsed: 0.001 sec
    [junit] Running org.apache.poi.hssf.record.chart.TestSeriesToChartGroupRecord
    [junit] Tests run: 2, Failures: 0, Errors: 0, Time elapsed: 0.001 sec
    [junit] Running org.apache.poi.hssf.record.chart.TestSheetPropertiesRecord
    [junit] Tests run: 2, Failures: 0, Errors: 0, Time elapsed: 0.002 sec
    [junit] Running org.apache.poi.hssf.record.chart.TestTextRecord
    [junit] Tests run: 2, Failures: 0, Errors: 0, Time elapsed: 0.001 sec
    [junit] Running org.apache.poi.hssf.record.chart.TestTickRecord
    [junit] Tests run: 2, Failures: 0, Errors: 0, Time elapsed: 0.001 sec
    [junit] Running org.apache.poi.hssf.record.chart.TestUnitsRecord
    [junit] Tests run: 2, Failures: 0, Errors: 0, Time elapsed: 0.001 sec
    [junit] Running org.apache.poi.hssf.record.chart.TestValueRangeRecord
    [junit] Tests run: 2, Failures: 0, Errors: 0, Time elapsed: 0.001 sec
    [junit] Running org.apache.poi.hssf.record.common.TestUnicodeString
    [junit] Tests run: 10, Failures: 0, Errors: 0, Time elapsed: 0.007 sec
    [junit] Running org.apache.poi.hssf.record.crypto.TestBiff8DecryptingStream
    [junit] Tests run: 4, Failures: 0, Errors: 0, Time elapsed: 0.049 sec
    [junit] Running org.apache.poi.hssf.record.crypto.TestBiff8EncryptionKey
    [junit] Tests run: 3, Failures: 0, Errors: 0, Time elapsed: 0.003 sec
    [junit] Running org.apache.poi.hssf.record.crypto.TestXorEncryption
    [junit] Tests run: 2, Failures: 0, Errors: 0, Time elapsed: 0.003 sec
    [junit] Running org.apache.poi.hssf.record.pivot.TestExtendedPivotTableViewFieldsRecord
    [junit] Tests run: 2, Failures: 0, Errors: 0, Time elapsed: 0.001 sec
    [junit] Running org.apache.poi.hssf.record.pivot.TestPageItemRecord
    [junit] Tests run: 2, Failures: 0, Errors: 0, Time elapsed: 0.002 sec
    [junit] Running org.apache.poi.hssf.record.pivot.TestViewFieldsRecord
    [junit] Tests run: 2, Failures: 0, Errors: 0, Time elapsed: 0.002 sec
    [junit] Running org.apache.poi.hssf.usermodel.TestBug42464
    [junit] Tests run: 2, Failures: 0, Errors: 0, Time elapsed: 0.199 sec
    [junit] Running org.apache.poi.hssf.usermodel.TestBugs
    [junit] Tests run: 156, Failures: 0, Errors: 0, Time elapsed: 2.884 sec
    [junit] Running org.apache.poi.hssf.usermodel.TestCellStyle
    [junit] Tests run: 10, Failures: 0, Errors: 0, Time elapsed: 5.467 sec
    [junit] Running org.apache.poi.hssf.usermodel.TestCloneSheet
    [junit] Tests run: 5, Failures: 0, Errors: 0, Time elapsed: 0.006 sec
    [junit] Running org.apache.poi.hssf.usermodel.TestComment
    [junit] Tests run: 8, Failures: 0, Errors: 0, Time elapsed: 0.013 sec
    [junit] Running org.apache.poi.hssf.usermodel.TestDataValidation
    [junit] Tests run: 10, Failures: 0, Errors: 0, Time elapsed: 0.022 sec
    [junit] Running org.apache.poi.hssf.usermodel.TestEmbeddedObjects
    [junit] Tests run: 3, Failures: 0, Errors: 0, Time elapsed: 0.012 sec
    [junit] Running org.apache.poi.hssf.usermodel.TestEscherGraphics
    [junit] Tests run: 7, Failures: 0, Errors: 0, Time elapsed: 0.024 sec
    [junit] Running org.apache.poi.hssf.usermodel.TestEscherGraphics2d
    [junit] Tests run: 7, Failures: 0, Errors: 0, Time elapsed: 0.023 sec
    [junit] Running org.apache.poi.hssf.usermodel.TestExternalReferenceChange
    [junit] Tests run: 1, Failures: 0, Errors: 0, Time elapsed: 0.003 sec
    [junit] Running org.apache.poi.hssf.usermodel.TestFontDetails
    [junit] Tests run: 3, Failures: 0, Errors: 0, Time elapsed: 0.002 sec
    [junit] Running org.apache.poi.hssf.usermodel.TestFormulaEvaluatorBugs
    [junit] Tests run: 9, Failures: 0, Errors: 0, Time elapsed: 0.185 sec
    [junit] Running org.apache.poi.hssf.usermodel.TestFormulaEvaluatorDocs
    [junit] Tests run: 1, Failures: 0, Errors: 0, Time elapsed: 0.002 sec
    [junit] Running org.apache.poi.hssf.usermodel.TestFormulas
    [junit] Open /tmp/poifiles/bug27272_1123466415353682855.xls in Excel
    [junit] Open /tmp/poifiles/bug27272_25424886560508454608.xls in Excel
    [junit] Tests run: 33, Failures: 0, Errors: 0, Time elapsed: 1.081 sec
    [junit] Running org.apache.poi.hssf.usermodel.TestHSSFCell
    [junit] Tests run: 35, Failures: 0, Errors: 0, Time elapsed: 0.028 sec
    [junit] Running org.apache.poi.hssf.usermodel.TestHSSFClientAnchor
    [junit] Tests run: 3, Failures: 0, Errors: 0, Time elapsed: 0.002 sec
    [junit] Running org.apache.poi.hssf.usermodel.TestHSSFComment
    [junit] Tests run: 11, Failures: 0, Errors: 0, Time elapsed: 1.434 sec
    [junit] Running org.apache.poi.hssf.usermodel.TestHSSFConditionalFormatting
    [junit] Tests run: 18, Failures: 0, Errors: 0, Time elapsed: 0.043 sec
    [junit] Running org.apache.poi.hssf.usermodel.TestHSSFDataFormat
    [junit] Tests run: 3, Failures: 0, Errors: 0, Time elapsed: 0.007 sec
    [junit] Running org.apache.poi.hssf.usermodel.TestHSSFDataFormatter
    [junit] Tests run: 5, Failures: 0, Errors: 0, Time elapsed: 0.013 sec
    [junit] Running org.apache.poi.hssf.usermodel.TestHSSFDateUtil
    [junit] Tests run: 20, Failures: 8, Errors: 1, Time elapsed: 0.027 sec

BUILD FAILED
<https://builds.apache.org/job/POI-JDK8/ws/build.xml>:1023: Tests failed

Total time: 6 minutes 11 seconds
Build step 'Invoke Ant' marked build as failure
[FINDBUGS] Skipping publisher since build result is FAILURE
[WARNINGS] Skipping publisher since build result is FAILURE
Archiving artifacts
Recording test results

---------------------------------------------------------------------
To unsubscribe, e-mail: dev-unsubscribe@poi.apache.org
For additional commands, e-mail: dev-help@poi.apache.org


Mime
View raw message