poi-dev mailing list archives

Site index · List index
Message view « Date » · « Thread »
Top « Date » · « Thread »
From Apache Jenkins Server <jenk...@builds.apache.org>
Subject Build failed in Jenkins: POI #834
Date Thu, 03 Sep 2015 22:42:33 GMT
See <https://builds.apache.org/job/POI/834/changes>

Changes:

[centic] Eclipse warnings, close resources in CommandLineTextExtractor, add try/finally, formatting,
...

[centic] Bug 56959: Add verification unit test to show that the bug cannot be reproduced

[centic] Fix bug 53275: reset indexed color flag when setting a non-indexed color

[centic] Add unit test which verifies that bug 53105 is actually fixed now

[centic] Add unit tests to verify that bug 51626 and bug 51451 are fixed

Conflicts:
	src/ooxml/testcases/org/apache/poi/xssf/usermodel/TestXSSFBugs.java

[centic] Add unit tests which verify that the issues from bug 48962 and 50755 do not occur
any more on the latest version

------------------------------------------
[...truncated 11 lines...]
U         src\scratchpad\src\org\apache\poi\hdgf\extractor\VisioTextExtractor.java
U         src\ooxml\testcases\org\apache\poi\xssf\usermodel\TestXSSFBugs.java
U         src\ooxml\testcases\org\apache\poi\xssf\usermodel\TestXSSFFont.java
U         src\ooxml\testcases\org\apache\poi\xslf\usermodel\TestXSLFAutoShape.java
U         src\ooxml\java\org\apache\poi\extractor\CommandLineTextExtractor.java
U         src\ooxml\java\org\apache\poi\openxml4j\opc\ZipPackage.java
U         src\ooxml\java\org\apache\poi\xssf\usermodel\XSSFCellStyle.java
U         src\ooxml\java\org\apache\poi\xssf\usermodel\XSSFFont.java
U         src\testcases\org\apache\poi\hssf\usermodel\TestHSSFDataFormatter.java
U         src\testcases\org\apache\poi\hssf\usermodel\TestCellStyle.java
Fetching 'https://svn.apache.org/repos/asf/poi/site/forrest.properties' at -1 into 'F:\hudson\hudson-slave\workspace\POI\forrest.properties'
Fetching 'https://svn.apache.org/repos/asf/poi/site/src/documentation' at -1 into 'F:\hudson\hudson-slave\workspace\POI\src\documentation'
At revision 1701142
At revision 1701142
WARNING: clock of the subversion server appears to be out of sync. This can result in inconsistent
check out behavior.
no change for http://svn.apache.org/repos/asf/poi/trunk/forrest.properties since the previous
build
no change for https://svn.apache.org/repos/asf/poi/site/src/documentation since the previous
build
Deleting old artifacts from #832
[EnvInject] - Executing scripts and injecting environment variables after the SCM step.
[EnvInject] - Injecting as environment variables the properties content 
LANG=en_US.UTF-8

[EnvInject] - Variables injected successfully.
[POI] $ cmd.exe /C '"f:\hudson\tools\ant\latest\bin\ant.bat -Dcoverage.enabled=true clean
jenkins && exit %%ERRORLEVEL%%"'
Buildfile: <https://builds.apache.org/job/POI/ws/build.xml>

clean:
   [delete] Deleting directory <https://builds.apache.org/job/POI/ws/build>

check-jars:

fetch-jars:

check-ooxml-jars:

fetch-ooxml-jars:

init:
    [mkdir] Created dir: <https://builds.apache.org/job/POI/ws/build>
    [mkdir] Created dir: <https://builds.apache.org/job/POI/ws/build\classes>
    [mkdir] Created dir: <https://builds.apache.org/job/POI/ws/build\test-classes>
    [mkdir] Created dir: <https://builds.apache.org/job/POI/ws/build\test-results>
    [mkdir] Created dir: <https://builds.apache.org/job/POI/ws/build\scratchpad-classes>
    [mkdir] Created dir: <https://builds.apache.org/job/POI/ws/build\scratchpad-test-classes>
    [mkdir] Created dir: <https://builds.apache.org/job/POI/ws/build\scratchpad-test-results>
    [mkdir] Created dir: <https://builds.apache.org/job/POI/ws/build\geometry-java>
    [mkdir] Created dir: <https://builds.apache.org/job/POI/ws/build\ooxml-classes>
    [mkdir] Created dir: <https://builds.apache.org/job/POI/ws/build\ooxml-test-classes>
    [mkdir] Created dir: <https://builds.apache.org/job/POI/ws/build\ooxml-test-results>
    [mkdir] Created dir: <https://builds.apache.org/job/POI/ws/build\excelant-classes>
    [mkdir] Created dir: <https://builds.apache.org/job/POI/ws/build\excelant-test-classes>
    [mkdir] Created dir: <https://builds.apache.org/job/POI/ws/build\excelant-test-results>
    [mkdir] Created dir: <https://builds.apache.org/job/POI/ws/build\examples-classes>
    [mkdir] Created dir: <https://builds.apache.org/job/POI/ws/build\integration-test-classes>
    [mkdir] Created dir: <https://builds.apache.org/job/POI/ws/build\integration-test-results>
    [mkdir] Created dir: <https://builds.apache.org/job/POI/ws/build\dist>
    [mkdir] Created dir: <https://builds.apache.org/job/POI/ws/build\tmp\site\build\site>
     [echo] Using Java: 1.6.0_27/1.6.0_27-b07/20.2-b06/Java HotSpot(TM) 64-Bit Server VM from
Sun Microsystems Inc. on Windows Server 2008: 6.0

compile-main:
    [javac] Compiling 1177 source files to <https://builds.apache.org/job/POI/ws/build\classes>
    [javac] Note: Some input files use or override a deprecated API.
    [javac] Note: Recompile with -Xlint:deprecation for details.
    [javac] Note: Some input files use unchecked or unsafe operations.
    [javac] Note: Recompile with -Xlint:unchecked for details.
    [javac] Compiling 515 source files to <https://builds.apache.org/job/POI/ws/build\test-classes>
    [javac] Note: Some input files use or override a deprecated API.
    [javac] Note: Recompile with -Xlint:deprecation for details.
    [javac] Note: Some input files use unchecked or unsafe operations.
    [javac] Note: Recompile with -Xlint:unchecked for details.
     [copy] Copying 4 files to <https://builds.apache.org/job/POI/ws/build\classes>

check-ooxml-xsds:

fetch-ooxml-xsds:

generate-geometry:

compile-scratchpad:
    [javac] Compiling 506 source files to <https://builds.apache.org/job/POI/ws/build\scratchpad-classes>
    [javac] Note: Some input files use or override a deprecated API.
    [javac] Note: Recompile with -Xlint:deprecation for details.
    [javac] Note: Some input files use unchecked or unsafe operations.
    [javac] Note: Recompile with -Xlint:unchecked for details.
    [javac] Compiling 182 source files to <https://builds.apache.org/job/POI/ws/build\scratchpad-test-classes>
    [javac] Note: Some input files use or override a deprecated API.
    [javac] Note: Recompile with -Xlint:deprecation for details.
    [javac] Note: <https://builds.apache.org/job/POI/ws/src\scratchpad\testcases\org\apache\poi\hslf\TestReWriteSanity.java>
uses unchecked or unsafe operations.
    [javac] Note: Recompile with -Xlint:unchecked for details.
     [copy] Copying 2 files to <https://builds.apache.org/job/POI/ws/build\scratchpad-classes>

check-compiled-ooxml-xsds:

compile-ooxml-xsds:

compile-ooxml:
    [javac] Compiling 350 source files to <https://builds.apache.org/job/POI/ws/build\ooxml-classes>
    [javac] Note: Some input files use or override a deprecated API.
    [javac] Note: Recompile with -Xlint:deprecation for details.
    [javac] Compiling 186 source files to <https://builds.apache.org/job/POI/ws/build\ooxml-test-classes>
    [javac] Note: Some input files use or override a deprecated API.
    [javac] Note: Recompile with -Xlint:deprecation for details.
     [copy] Copying 2 files to <https://builds.apache.org/job/POI/ws/build\ooxml-classes>

compile-examples:
    [javac] Compiling 137 source files to <https://builds.apache.org/job/POI/ws/build\examples-classes>
    [javac] Note: Some input files use or override a deprecated API.
    [javac] Note: Recompile with -Xlint:deprecation for details.
    [javac] Note: Some input files use unchecked or unsafe operations.
    [javac] Note: Recompile with -Xlint:unchecked for details.
     [copy] Copying 1 file to <https://builds.apache.org/job/POI/ws/build\examples-classes>

compile-excelant:
    [javac] Compiling 14 source files to <https://builds.apache.org/job/POI/ws/build\excelant-classes>
    [javac] Note: <https://builds.apache.org/job/POI/ws/src\excelant\java\org\apache\poi\ss\excelant\util\ExcelAntWorkbookUtil.java>
uses or overrides a deprecated API.
    [javac] Note: Recompile with -Xlint:deprecation for details.
    [javac] Compiling 13 source files to <https://builds.apache.org/job/POI/ws/build\excelant-test-classes>
     [copy] Copying 1 file to <https://builds.apache.org/job/POI/ws/build\excelant-classes>

compile:

compile-ooxml-lite:
    [mkdir] Created dir: <https://builds.apache.org/job/POI/ws/build\ooxml-lite-merged>
      [jar] Building jar: <https://builds.apache.org/job/POI/ws/build\ooxml-lite-merged\ooxml-lite-merged.jar>
     [java] Collecting unit tests from <https://builds.apache.org/job/POI/ws/build\ooxml-test-classes>
     [java] Found 168 classes
     [java] ......................................................I..................................................................................................I...SLF4J:
Failed to load class "org.slf4j.impl.StaticLoggerBinder".
     [java] SLF4J: Defaulting to no-operation (NOP) logger implementation
     [java] SLF4J: See http://www.slf4j.org/codes.html#StaticLoggerBinder for further details.
     [java] .............E........................................................II..........JAXP:
find factoryId =javax.xml.stream.XMLInputFactory
     [java] JAXP: found system property, value=com.sun.xml.internal.stream.XMLInputFactoryImpl
     [java] JAXP: created new instance of class com.sun.xml.internal.stream.XMLInputFactoryImpl
using ClassLoader: null
     [java] ........................................................................................................................................Setting
col: 0 and row 0
     [java] Setting col: 1 and row 1
     [java] .............................................................................................................................................................................................Warning
- Row 13 has no cell 1, can't figure out test name
     [java] .......III.II.......I....................................................E..[Fatal
Error] :1:1: The parser has encountered more than "4,096" entity expansions in this document;
this is the limit imposed by the application.
     [java] [Fatal Error] :1:1: The parser has encountered more than "4,096" entity expansions
in this document; this is the limit imposed by the application.
     [java] ....................I.....I....................I.............................................................................................................I.............................................................................................org.apache.poi.ss.usermodel.CellValue
[12.0]
     [java] org.apache.poi.ss.usermodel.CellValue [12.0]
     [java] .....org.apache.poi.ss.usermodel.CellValue [1.0]
     [java] org.apache.poi.ss.usermodel.CellValue [1.0]
     [java] .org.apache.poi.ss.usermodel.CellValue [2.0]
     [java] org.apache.poi.ss.usermodel.CellValue [2.0]
     [java] .org.apache.poi.ss.usermodel.CellValue [2.0]
     [java] .org.apache.poi.ss.usermodel.CellValue [2.0]
     [java] .org.apache.poi.ss.usermodel.CellValue [2.0]
     [java] .org.apache.poi.ss.usermodel.CellValue [3.0]
     [java] ......................................................................................................................................................................................................................................................Done
     [java] ...........<?xml version="1.0" encoding="UTF-8"?>
     [java] <worksheet xmlns="http://schemas.openxmlformats.org/spreadsheetml/2006/main"><dimension
ref="A1"/><sheetViews><sheetView workbookViewId="0" tabSelected="true"/></sheetViews><sheetFormatPr
defaultRowHeight="15.0"/><sheetData/><pageMargins bottom="0.75" footer="0.3" header="0.3"
left="0.7" right="0.7" top="0.75"/></worksheet>
     [java] ........................................Name: /word/document.xml - Content Type:
application/vnd.openxmlformats-officedocument.wordprocessingml.document.main+xml
     [java] ................................................................................................................................................
     [java] Time: 260.098
     [java] There were 2 failures:
     [java] 1) testDateFormat(org.apache.poi.ss.format.TestCellFormatPart)
     [java] junit.framework.ComparisonFailure: format "org.apache.poi.ss.format.CellFormatPart@48b89bc5"
expected:<"1[4]:35:27"> but was:<"1[5]:35:27">
     [java] 	at junit.framework.Assert.assertEquals(Assert.java:100)
     [java] 	at junit.framework.TestCase.assertEquals(TestCase.java:261)
     [java] 	at org.apache.poi.ss.format.CellFormatTestBase$CellValue.equivalent(CellFormatTestBase.java:95)
     [java] 	at org.apache.poi.ss.format.CellFormatTestBase.tryColor(CellFormatTestBase.java:247)
     [java] 	at org.apache.poi.ss.format.CellFormatTestBase.tryFormat(CellFormatTestBase.java:221)
     [java] 	at org.apache.poi.ss.format.CellFormatTestBase.runFormatTests(CellFormatTestBase.java:130)
     [java] 	at org.apache.poi.ss.format.TestCellFormatPart.testDateFormat(TestCellFormatPart.java:77)
     [java] 	at sun.reflect.NativeMethodAccessorImpl.invoke0(Native Method)
     [java] 	at sun.reflect.NativeMethodAccessorImpl.invoke(NativeMethodAccessorImpl.java:39)
     [java] 	at sun.reflect.DelegatingMethodAccessorImpl.invoke(DelegatingMethodAccessorImpl.java:25)
     [java] 	at java.lang.reflect.Method.invoke(Method.java:597)
     [java] 	at junit.framework.TestCase.runTest(TestCase.java:176)
     [java] 	at junit.framework.TestCase.runBare(TestCase.java:141)
     [java] 	at junit.framework.TestResult$1.protect(TestResult.java:122)
     [java] 	at junit.framework.TestResult.runProtected(TestResult.java:142)
     [java] 	at junit.framework.TestResult.run(TestResult.java:125)
     [java] 	at junit.framework.TestCase.run(TestCase.java:129)
     [java] 	at junit.framework.TestSuite.runTest(TestSuite.java:252)
     [java] 	at junit.framework.TestSuite.run(TestSuite.java:247)
     [java] 	at org.junit.internal.runners.JUnit38ClassRunner.run(JUnit38ClassRunner.java:86)
     [java] 	at org.junit.runners.Suite.runChild(Suite.java:128)
     [java] 	at org.junit.runners.Suite.runChild(Suite.java:27)
     [java] 	at org.junit.runners.ParentRunner$3.run(ParentRunner.java:290)
     [java] 	at org.junit.runners.ParentRunner$1.schedule(ParentRunner.java:71)
     [java] 	at org.junit.runners.ParentRunner.runChildren(ParentRunner.java:288)
     [java] 	at org.junit.runners.ParentRunner.access$000(ParentRunner.java:58)
     [java] 	at org.junit.runners.ParentRunner$2.evaluate(ParentRunner.java:268)
     [java] 	at org.junit.runners.ParentRunner.run(ParentRunner.java:363)
     [java] 	at org.junit.runner.JUnitCore.run(JUnitCore.java:137)
     [java] 	at org.junit.runner.JUnitCore.run(JUnitCore.java:115)
     [java] 	at org.junit.runner.JUnitCore.run(JUnitCore.java:105)
     [java] 	at org.junit.runner.JUnitCore.run(JUnitCore.java:94)
     [java] 	at org.apache.poi.util.OOXMLLite.build(OOXMLLite.java:103)
     [java] 	at org.apache.poi.util.OOXMLLite.main(OOXMLLite.java:86)
     [java] 2) bug54034(org.apache.poi.xssf.usermodel.TestXSSFBugs)
     [java] org.junit.ComparisonFailure: expected:<2012-08-08T2[2]:59> but was:<2012-08-08T2[3]:59>
     [java] 	at org.junit.Assert.assertEquals(Assert.java:115)
     [java] 	at org.junit.Assert.assertEquals(Assert.java:144)
     [java] 	at org.apache.poi.xssf.usermodel.TestXSSFBugs.bug54034(TestXSSFBugs.java:1516)
     [java] 	at sun.reflect.NativeMethodAccessorImpl.invoke0(Native Method)
     [java] 	at sun.reflect.NativeMethodAccessorImpl.invoke(NativeMethodAccessorImpl.java:39)
     [java] 	at sun.reflect.DelegatingMethodAccessorImpl.invoke(DelegatingMethodAccessorImpl.java:25)
     [java] 	at java.lang.reflect.Method.invoke(Method.java:597)
     [java] 	at org.junit.runners.model.FrameworkMethod$1.runReflectiveCall(FrameworkMethod.java:50)
     [java] 	at org.junit.internal.runners.model.ReflectiveCallable.run(ReflectiveCallable.java:12)
     [java] 	at org.junit.runners.model.FrameworkMethod.invokeExplosively(FrameworkMethod.java:47)
     [java] 	at org.junit.internal.runners.statements.InvokeMethod.evaluate(InvokeMethod.java:17)
     [java] 	at org.junit.runners.ParentRunner.runLeaf(ParentRunner.java:325)
     [java] 	at org.junit.runners.BlockJUnit4ClassRunner.runChild(BlockJUnit4ClassRunner.java:78)
     [java] 	at org.junit.runners.BlockJUnit4ClassRunner.runChild(BlockJUnit4ClassRunner.java:57)
     [java] 	at org.junit.runners.ParentRunner$3.run(ParentRunner.java:290)
     [java] 	at org.junit.runners.ParentRunner$1.schedule(ParentRunner.java:71)
     [java] 	at org.junit.runners.ParentRunner.runChildren(ParentRunner.java:288)
     [java] 	at org.junit.runners.ParentRunner.access$000(ParentRunner.java:58)
     [java] 	at org.junit.runners.ParentRunner$2.evaluate(ParentRunner.java:268)
     [java] 	at org.junit.runners.ParentRunner.run(ParentRunner.java:363)
     [java] 	at org.junit.runners.Suite.runChild(Suite.java:128)
     [java] 	at org.junit.runners.Suite.runChild(Suite.java:27)
     [java] 	at org.junit.runners.ParentRunner$3.run(ParentRunner.java:290)
     [java] 	at org.junit.runners.ParentRunner$1.schedule(ParentRunner.java:71)
     [java] 	at org.junit.runners.ParentRunner.runChildren(ParentRunner.java:288)
     [java] 	at org.junit.runners.ParentRunner.access$000(ParentRunner.java:58)
     [java] 	at org.junit.runners.ParentRunner$2.evaluate(ParentRunner.java:268)
     [java] 	at org.junit.runners.ParentRunner.run(ParentRunner.java:363)
     [java] 	at org.junit.runner.JUnitCore.run(JUnitCore.java:137)
     [java] 	at org.junit.runner.JUnitCore.run(JUnitCore.java:115)
     [java] 	at org.junit.runner.JUnitCore.run(JUnitCore.java:105)
     [java] 	at org.junit.runner.JUnitCore.run(JUnitCore.java:94)
     [java] 	at org.apache.poi.util.OOXMLLite.build(OOXMLLite.java:103)
     [java] 	at org.apache.poi.util.OOXMLLite.main(OOXMLLite.java:86)
     [java] 
     [java] FAILURES!!!
     [java] Tests run: 1326,  Failures: 2
     [java] 
     [java] Exception in thread "main" java.lang.RuntimeException: Tests did not succeed,
cannot build ooxml-lite jar
     [java] 	at org.apache.poi.util.OOXMLLite.build(OOXMLLite.java:105)
     [java] 	at org.apache.poi.util.OOXMLLite.main(OOXMLLite.java:86)

BUILD FAILED
<https://builds.apache.org/job/POI/ws/build.xml>:1199: Java returned: 1

Total time: 7 minutes 39 seconds
Build step 'Invoke Ant' marked build as failure
[FINDBUGS] Skipping publisher since build result is FAILURE
[WARNINGS] Skipping publisher since build result is FAILURE
Archiving artifacts
Sending artifact delta relative to POI #818
Archived 16 artifacts
Archive block size is 32768
Received 1948 blocks and 50977 bytes
Compression is 99.9%
Took 19 sec
Recording test results

---------------------------------------------------------------------
To unsubscribe, e-mail: dev-unsubscribe@poi.apache.org
For additional commands, e-mail: dev-help@poi.apache.org


Mime
View raw message