poi-dev mailing list archives

Site index · List index
Message view « Date » · « Thread »
Top « Date » · « Thread »
From Apache Jenkins Server <jenk...@builds.apache.org>
Subject Build failed in Jenkins: POI #813
Date Tue, 25 Aug 2015 20:35:23 GMT
See <https://builds.apache.org/job/POI/813/changes>

Changes:

[centic] Next try for Sonar Maven build: Specify the src-pathes in the various pom.xml files

------------------------------------------
[...truncated 5145 lines...]
AU        src/documentation/resources/images/logoRaPiGmbH1.png
AU        src/documentation/resources/images/logoRussellBeattie4.png
AU        src/documentation/resources/images/logoKarmokar1s.png
AU        src/documentation/resources/images/logoRaPiGmbH2.png
AU        src/documentation/resources/images/logoRussellBeattie5.png
AU        src/documentation/resources/images/logoGustafsson1.png
AU        src/documentation/resources/images/logoGustafsson2.png
AU        src/documentation/resources/images/logoRaPiGmbH5.png
AU        src/documentation/resources/images/POIFSPropertyTablePreWrite.gif
AU        src/documentation/resources/images/logoKarmokar5s.png
AU        src/documentation/resources/images/logoRaPiGmbH6.png
AU        src/documentation/resources/images/logoRaPiGmbH7.png
AU        src/documentation/resources/images/logoRaPiGmbH8.png
AU        src/documentation/resources/images/logoRaPiGmbH9.png
AU        src/documentation/resources/images/project-logo.png
AU        src/documentation/resources/images/logoGlenStampoutlzis.png
AU        src/documentation/resources/images/utilClasses.gif
AU        src/documentation/resources/images/fix.jpg
AU        src/documentation/resources/images/add.jpg
AU        src/documentation/resources/images/calculatePayment.jpg
A         src/documentation/README.txt
At revision 1697767
At revision 1697766
no change for http://svn.apache.org/repos/asf/poi/trunk/forrest.properties since the previous
build
no change for https://svn.apache.org/repos/asf/poi/site/src/documentation since the previous
build
Deleting old artifacts from #811
[EnvInject] - Executing scripts and injecting environment variables after the SCM step.
[EnvInject] - Injecting as environment variables the properties content 
LANG=en_US.UTF-8

[EnvInject] - Variables injected successfully.
[POI] $ /home/jenkins/tools/ant/latest/bin/ant -Dcoverage.enabled=true clean jenkins
Buildfile: <https://builds.apache.org/job/POI/ws/build.xml>

clean:

check-jars:

fetch-jars:

testexist:

downloadfile:
      [get] Getting: http://repo1.maven.org/maven2/commons-logging/commons-logging/1.1.3/commons-logging-1.1.3.jar
      [get] To: <https://builds.apache.org/job/POI/ws/lib/commons-logging-1.1.3.jar>

testexist:

downloadfile:
      [get] Getting: http://repo1.maven.org/maven2/commons-codec/commons-codec/1.9/commons-codec-1.9.jar
      [get] To: <https://builds.apache.org/job/POI/ws/lib/commons-codec-1.9.jar>

testexist:

downloadfile:
      [get] Getting: http://repo1.maven.org/maven2/log4j/log4j/1.2.17/log4j-1.2.17.jar
      [get] To: <https://builds.apache.org/job/POI/ws/lib/log4j-1.2.17.jar>

testexist:

downloadfile:
      [get] Getting: http://repo1.maven.org/maven2/junit/junit/4.12/junit-4.12.jar
      [get] To: <https://builds.apache.org/job/POI/ws/lib/junit-4.12.jar>

testexist:

downloadfile:
      [get] Getting: http://repo1.maven.org/maven2/org/hamcrest/hamcrest-core/1.3/hamcrest-core-1.3.jar
      [get] To: <https://builds.apache.org/job/POI/ws/lib/hamcrest-core-1.3.jar>

testexist:

downloadfile:
      [get] Getting: http://repo1.maven.org/maven2/org/apache/ant/ant/1.9.4/ant-1.9.4.jar
      [get] To: <https://builds.apache.org/job/POI/ws/lib/ant-1.9.4.jar>

testexist:

downloadfile:
      [get] Getting: http://repo1.maven.org/maven2/org/apache/ant/ant-launcher/1.9.4/ant-launcher-1.9.4.jar
      [get] To: <https://builds.apache.org/job/POI/ws/lib/ant-launcher-1.9.4.jar>

testexist:

downloadfile:
      [get] Getting: http://repo1.maven.org/maven2/org/ow2/asm/asm-all/5.0.3/asm-all-5.0.3.jar
      [get] To: <https://builds.apache.org/job/POI/ws/lib/asm-all-5.0.3.jar>

testexist:

downloadfile:
      [get] Getting: http://repo1.maven.org/maven2/org/jacoco/jacoco/0.7.4.201502262128/jacoco-0.7.4.201502262128.zip
      [get] To: <https://builds.apache.org/job/POI/ws/lib/jacoco-0.7.4.201502262128.zip>
    [unzip] Expanding: <https://builds.apache.org/job/POI/ws/lib/jacoco-0.7.4.201502262128.zip>
into <https://builds.apache.org/job/POI/ws/>

testexist:

downloadfile:
      [get] Getting: http://repo1.maven.org/maven2/org/apache/rat/apache-rat/0.11/apache-rat-0.11.jar
      [get] To: <https://builds.apache.org/job/POI/ws/lib/apache-rat-0.11.jar>

testexist:

downloadfile:
      [get] Getting: http://repo1.maven.org/maven2/org/bouncycastle/bcprov-ext-jdk15on/1.51/bcprov-ext-jdk15on-1.51.jar
      [get] To: <https://builds.apache.org/job/POI/ws/compile-lib/bcprov-ext-jdk15on-1.51.jar>

testexist:

downloadfile:
      [get] Getting: http://repo1.maven.org/maven2/org/bouncycastle/bcpkix-jdk15on/1.51/bcpkix-jdk15on-1.51.jar
      [get] To: <https://builds.apache.org/job/POI/ws/compile-lib/bcpkix-jdk15on-1.51.jar>

testexist:

downloadfile:
      [get] Getting: http://repo1.maven.org/maven2/org/apache/santuario/xmlsec/2.0.1/xmlsec-2.0.1.jar
      [get] To: <https://builds.apache.org/job/POI/ws/compile-lib/xmlsec-2.0.1.jar>

testexist:

downloadfile:
      [get] Getting: http://repo1.maven.org/maven2/org/slf4j/slf4j-api/1.7.7/slf4j-api-1.7.7.jar
      [get] To: <https://builds.apache.org/job/POI/ws/compile-lib/slf4j-api-1.7.7.jar>

check-ooxml-jars:

fetch-ooxml-jars:

testexist:

downloadfile:
      [get] Getting: http://repo1.maven.org/maven2/org/apache/xmlbeans/xmlbeans/2.3.0/xmlbeans-2.3.0.jar
      [get] To: <https://builds.apache.org/job/POI/813/artifact/ooxml-lib/xmlbeans-2.3.0.jar>

testexist:

downloadfile:
      [get] Getting: http://repo1.maven.org/maven2/org/apache/xmlbeans/xmlbeans/2.6.0/xmlbeans-2.6.0.jar
      [get] To: <https://builds.apache.org/job/POI/813/artifact/ooxml-lib/xmlbeans-2.6.0.jar>

init:
    [mkdir] Created dir: <https://builds.apache.org/job/POI/ws/build>
    [mkdir] Created dir: <https://builds.apache.org/job/POI/ws/build/classes>
    [mkdir] Created dir: <https://builds.apache.org/job/POI/ws/build/test-classes>
    [mkdir] Created dir: <https://builds.apache.org/job/POI/ws/build/test-results>
    [mkdir] Created dir: <https://builds.apache.org/job/POI/ws/build/scratchpad-classes>
    [mkdir] Created dir: <https://builds.apache.org/job/POI/ws/build/scratchpad-test-classes>
    [mkdir] Created dir: <https://builds.apache.org/job/POI/ws/build/scratchpad-test-results>
    [mkdir] Created dir: <https://builds.apache.org/job/POI/ws/build/geometry-java>
    [mkdir] Created dir: <https://builds.apache.org/job/POI/ws/build/ooxml-classes>
    [mkdir] Created dir: <https://builds.apache.org/job/POI/ws/build/ooxml-test-classes>
    [mkdir] Created dir: <https://builds.apache.org/job/POI/ws/build/ooxml-test-results>
    [mkdir] Created dir: <https://builds.apache.org/job/POI/ws/build/excelant-classes>
    [mkdir] Created dir: <https://builds.apache.org/job/POI/ws/build/excelant-test-classes>
    [mkdir] Created dir: <https://builds.apache.org/job/POI/ws/build/excelant-test-results>
    [mkdir] Created dir: <https://builds.apache.org/job/POI/ws/build/examples-classes>
    [mkdir] Created dir: <https://builds.apache.org/job/POI/ws/build/integration-test-classes>
    [mkdir] Created dir: <https://builds.apache.org/job/POI/813/artifact/build/integration-test-results>
    [mkdir] Created dir: <https://builds.apache.org/job/POI/ws/build/dist>
    [mkdir] Created dir: <https://builds.apache.org/job/POI/ws/build/tmp/site/build/site>
     [echo] Using Java: 1.6.0_45/1.6.0_45-b06/20.45-b01/Java HotSpot(TM) Server VM from Sun
Microsystems Inc. on Linux: 3.13.0-30-generic

compile-main:
    [javac] Compiling 1177 source files to <https://builds.apache.org/job/POI/ws/build/classes>
    [javac] <https://builds.apache.org/job/POI/ws/src/java/org/apache/poi/sl/usermodel/Shape.java>:23:
type parameter P is not within its bound
    [javac]     P extends TextParagraph<S,P,? extends TextRun>
    [javac]                               ^
    [javac] <https://builds.apache.org/job/POI/ws/src/java/org/apache/poi/sl/usermodel/AutoShape.java>:22:
type parameter P is not within its bound
    [javac]     P extends TextParagraph<S,P,? extends TextRun>
    [javac]                               ^
    [javac] <https://builds.apache.org/job/POI/ws/src/java/org/apache/poi/sl/usermodel/TextShape.java>:24:
type parameter P is not within its bound
    [javac]     P extends TextParagraph<S,P,? extends TextRun>
    [javac]                               ^
    [javac] <https://builds.apache.org/job/POI/ws/src/java/org/apache/poi/sl/usermodel/TextShape.java>:96:
type parameter P is not within its bound
    [javac]     List<? extends TextParagraph<S,P,? extends TextRun>> getTextParagraphs();
    [javac]                                    ^
    [javac] <https://builds.apache.org/job/POI/ws/src/java/org/apache/poi/sl/usermodel/SimpleShape.java>:26:
type parameter P is not within its bound
    [javac]     P extends TextParagraph<S,P,? extends TextRun>
    [javac]                               ^
    [javac] <https://builds.apache.org/job/POI/ws/src/java/org/apache/poi/sl/usermodel/PlaceableShape.java>:24:
type parameter P is not within its bound
    [javac]     P extends TextParagraph<S,P,? extends TextRun>
    [javac]                               ^
    [javac] <https://builds.apache.org/job/POI/ws/src/java/org/apache/poi/sl/usermodel/ShapeContainer.java>:25:
type parameter P is not within its bound
    [javac]     P extends TextParagraph<S,P,? extends TextRun>
    [javac]                               ^
    [javac] <https://builds.apache.org/job/POI/ws/src/java/org/apache/poi/sl/usermodel/Sheet.java>:28:
type parameter P is not within its bound
    [javac]     P extends TextParagraph<S,P,? extends TextRun>
    [javac]                               ^
    [javac] <https://builds.apache.org/job/POI/ws/src/java/org/apache/poi/sl/usermodel/FreeformShape.java>:24:
type parameter P is not within its bound
    [javac]     P extends TextParagraph<S,P,? extends TextRun>
    [javac]                               ^
    [javac] <https://builds.apache.org/job/POI/ws/src/java/org/apache/poi/sl/usermodel/TextBox.java>:22:
type parameter P is not within its bound
    [javac]     P extends TextParagraph<S,P,? extends TextRun>
    [javac]                               ^
    [javac] <https://builds.apache.org/job/POI/ws/src/java/org/apache/poi/sl/usermodel/ConnectorShape.java>:22:
type parameter P is not within its bound
    [javac]     P extends TextParagraph<S,P,? extends TextRun>
    [javac]                               ^
    [javac] <https://builds.apache.org/job/POI/ws/src/java/org/apache/poi/sl/usermodel/GroupShape.java>:24:
type parameter P is not within its bound
    [javac]     P extends TextParagraph<S,P,? extends TextRun>
    [javac]                               ^
    [javac] <https://builds.apache.org/job/POI/ws/src/java/org/apache/poi/sl/usermodel/PictureShape.java>:24:
type parameter P is not within its bound
    [javac]     P extends TextParagraph<S,P,? extends TextRun>
    [javac]                               ^
    [javac] <https://builds.apache.org/job/POI/ws/src/java/org/apache/poi/sl/usermodel/TableShape.java>:22:
type parameter P is not within its bound
    [javac]     P extends TextParagraph<S,P,? extends TextRun>
    [javac]                               ^
    [javac] <https://builds.apache.org/job/POI/ws/src/java/org/apache/poi/sl/usermodel/SlideShow.java>:29:
type parameter P is not within its bound
    [javac]     P extends TextParagraph<S,P,? extends TextRun>
    [javac]                               ^
    [javac] <https://builds.apache.org/job/POI/ws/src/java/org/apache/poi/sl/usermodel/MasterSheet.java>:22:
type parameter P is not within its bound
    [javac]     P extends TextParagraph<S,P,? extends TextRun>
    [javac]                               ^
    [javac] <https://builds.apache.org/job/POI/ws/src/java/org/apache/poi/sl/usermodel/Background.java>:22:
type parameter P is not within its bound
    [javac]     P extends TextParagraph<S,P,? extends TextRun>
    [javac]                               ^
    [javac] <https://builds.apache.org/job/POI/ws/src/java/org/apache/poi/sl/usermodel/Slide.java>:22:
type parameter P is not within its bound
    [javac]     P extends TextParagraph<S,P,? extends TextRun>
    [javac]                               ^
    [javac] <https://builds.apache.org/job/POI/ws/src/java/org/apache/poi/sl/usermodel/Notes.java>:24:
type parameter P is not within its bound
    [javac]     P extends TextParagraph<S,P,? extends TextRun>
    [javac]                               ^
    [javac] <https://builds.apache.org/job/POI/ws/src/java/org/apache/poi/sl/usermodel/Line.java>:30:
type parameter P is not within its bound
    [javac]     P extends TextParagraph<S,P,? extends TextRun>
    [javac]                               ^
    [javac] <https://builds.apache.org/job/POI/ws/src/java/org/apache/poi/sl/usermodel/TableCell.java>:22:
type parameter P is not within its bound
    [javac]     P extends TextParagraph<S,P,? extends TextRun>
    [javac]                               ^
    [javac] Note: Some input files use or override a deprecated API.
    [javac] Note: Recompile with -Xlint:deprecation for details.
    [javac] Note: Some input files use unchecked or unsafe operations.
    [javac] Note: Recompile with -Xlint:unchecked for details.
    [javac] 21 errors

BUILD FAILED
<https://builds.apache.org/job/POI/ws/build.xml>:702: Compile failed; see the compiler
error output for details.

Total time: 8 seconds
Build step 'Invoke Ant' marked build as failure
[FINDBUGS] Skipping publisher since build result is FAILURE
[WARNINGS] Skipping publisher since build result is FAILURE
Archiving artifacts
Sending artifact delta relative to POI #810
Archived 2 artifacts
Archive block size is 32768
Received 164 blocks and 23693 bytes
Compression is 99.6%
Took 6.5 sec
Recording test results

---------------------------------------------------------------------
To unsubscribe, e-mail: dev-unsubscribe@poi.apache.org
For additional commands, e-mail: dev-help@poi.apache.org


Mime
View raw message