poi-dev mailing list archives

Site index · List index
Message view « Date » · « Thread »
Top « Date » · « Thread »
From Apache Jenkins Server <jenk...@builds.apache.org>
Subject Build failed in Jenkins: POI-OpenJDK #97
Date Wed, 15 Jul 2015 13:42:48 GMT
See <https://builds.apache.org/job/POI-OpenJDK/97/>

------------------------------------------
Started by an SCM change
Building remotely on freebsd1 (freebsd bsd) in workspace <https://builds.apache.org/job/POI-OpenJDK/ws/>
Updating http://svn.apache.org/repos/asf/poi/trunk at revision '2015-07-15T13:40:55.209 +0000'
At revision 1691207
no change for http://svn.apache.org/repos/asf/poi/trunk since the previous build
Copied 16 artifacts from "POI" build number 709
[POI-OpenJDK] $ /bin/bash -xe /tmp/hudson5628606776884128152.sh
+ ls -al ooxml-lib
total 5390
drwxr-xr-x   4 hudson  hudson        7 Jul 15 13:41 .
drwxr-xr-x  14 hudson  hudson       20 Jul 15 00:33 ..
drwxr-xr-x   6 hudson  hudson        9 Jul 15 13:41 .svn
-rw-r--r--   1 hudson  hudson        0 Jul 15 13:06 OfficeOpenXML-Part4.zip
drwxr-xr-x   2 hudson  hudson       18 Jul 15 13:41 ooxml-lib
-rw-r--r--   1 hudson  hudson  2666695 Jul 14 14:52 xmlbeans-2.3.0.jar
-rw-r--r--   1 hudson  hudson  2730866 Jul 14 14:52 xmlbeans-2.6.0.jar
[POI-OpenJDK] $ /home/jenkins/tools/ant/latest/bin/ant -Dcoverage.enabled=true clean jenkins
Buildfile: /usr<https://builds.apache.org/job/POI-OpenJDK/ws/build.xml>

clean:
   [delete] Deleting directory /usr<https://builds.apache.org/job/POI-OpenJDK/ws/build>

check-jars:

fetch-jars:

check-ooxml-jars:

fetch-ooxml-jars:

init:
    [mkdir] Created dir: /usr<https://builds.apache.org/job/POI-OpenJDK/ws/build>
    [mkdir] Created dir: /usr<https://builds.apache.org/job/POI-OpenJDK/ws/build/classes>
    [mkdir] Created dir: /usr<https://builds.apache.org/job/POI-OpenJDK/ws/build/test-classes>
    [mkdir] Created dir: /usr<https://builds.apache.org/job/POI-OpenJDK/ws/build/test-results>
    [mkdir] Created dir: /usr<https://builds.apache.org/job/POI-OpenJDK/ws/build/scratchpad-classes>
    [mkdir] Created dir: /usr<https://builds.apache.org/job/POI-OpenJDK/ws/build/scratchpad-test-classes>
    [mkdir] Created dir: /usr<https://builds.apache.org/job/POI-OpenJDK/ws/build/scratchpad-test-results>
    [mkdir] Created dir: /usr<https://builds.apache.org/job/POI-OpenJDK/ws/build/ooxml-classes>
    [mkdir] Created dir: /usr<https://builds.apache.org/job/POI-OpenJDK/ws/build/ooxml-test-classes>
    [mkdir] Created dir: /usr<https://builds.apache.org/job/POI-OpenJDK/ws/build/ooxml-test-results>
    [mkdir] Created dir: /usr<https://builds.apache.org/job/POI-OpenJDK/ws/build/excelant-classes>
    [mkdir] Created dir: /usr<https://builds.apache.org/job/POI-OpenJDK/ws/build/excelant-test-classes>
    [mkdir] Created dir: /usr<https://builds.apache.org/job/POI-OpenJDK/ws/build/excelant-test-results>
    [mkdir] Created dir: /usr<https://builds.apache.org/job/POI-OpenJDK/ws/build/examples-classes>
    [mkdir] Created dir: /usr<https://builds.apache.org/job/POI-OpenJDK/ws/build/integration-test-classes>
    [mkdir] Created dir: /usr<https://builds.apache.org/job/POI-OpenJDK/97/artifact/build/integration-test-results>
    [mkdir] Created dir: /usr<https://builds.apache.org/job/POI-OpenJDK/ws/build/dist>
    [mkdir] Created dir: /usr<https://builds.apache.org/job/POI-OpenJDK/ws/build/tmp/site/build/site>
     [echo] Using Java: 1.6.0_32/1.6.0_32-b27/20.0-b12/OpenJDK 64-Bit Server VM from Sun Microsystems
Inc. on FreeBSD: 9.1-RELEASE-p3

compile-main:
    [javac] Compiling 1030 source files to /usr<https://builds.apache.org/job/POI-OpenJDK/ws/build/classes>
    [javac] Note: Some input files use or override a deprecated API.
    [javac] Note: Recompile with -Xlint:deprecation for details.
    [javac] Note: Some input files use unchecked or unsafe operations.
    [javac] Note: Recompile with -Xlint:unchecked for details.
    [javac] Compiling 512 source files to /usr<https://builds.apache.org/job/POI-OpenJDK/ws/build/test-classes>
    [javac] Note: Some input files use or override a deprecated API.
    [javac] Note: Recompile with -Xlint:deprecation for details.
    [javac] Note: Some input files use unchecked or unsafe operations.
    [javac] Note: Recompile with -Xlint:unchecked for details.
     [copy] Copying 3 files to /usr<https://builds.apache.org/job/POI-OpenJDK/ws/build/classes>

compile-scratchpad:
    [javac] Compiling 506 source files to /usr<https://builds.apache.org/job/POI-OpenJDK/ws/build/scratchpad-classes>
    [javac] Note: Some input files use or override a deprecated API.
    [javac] Note: Recompile with -Xlint:deprecation for details.
    [javac] Note: Some input files use unchecked or unsafe operations.
    [javac] Note: Recompile with -Xlint:unchecked for details.
    [javac] Compiling 184 source files to /usr<https://builds.apache.org/job/POI-OpenJDK/ws/build/scratchpad-test-classes>
    [javac] Note: Some input files use or override a deprecated API.
    [javac] Note: Recompile with -Xlint:deprecation for details.
    [javac] Note: /usr<https://builds.apache.org/job/POI-OpenJDK/ws/src/scratchpad/testcases/org/apache/poi/hslf/TestReWriteSanity.java>
uses unchecked or unsafe operations.
    [javac] Note: Recompile with -Xlint:unchecked for details.
     [copy] Copying 2 files to /usr<https://builds.apache.org/job/POI-OpenJDK/ws/build/scratchpad-classes>

check-ooxml-xsds:

fetch-ooxml-xsds:
      [get] Destination already exists (skipping): /usr<https://builds.apache.org/job/POI-OpenJDK/ws/ooxml-lib/OfficeOpenXML-Part4.zip>
      [get] Getting: http://www.ecma-international.org/publications/files/ECMA-ST/Office%20Open%20XML%201st%20edition%20Part%202%20(PDF).zip
      [get] To: /usr<https://builds.apache.org/job/POI-OpenJDK/ws/ooxml-lib/OfficeOpenXML-Part2.zip>
      [get] Error getting http://www.ecma-international.org/publications/files/ECMA-ST/Office%20Open%20XML%201st%20edition%20Part%202%20(PDF).zip
to /usr<https://builds.apache.org/job/POI-OpenJDK/ws/ooxml-lib/OfficeOpenXML-Part2.zip>

BUILD FAILED
/usr<https://builds.apache.org/job/POI-OpenJDK/ws/build.xml>:562: java.net.SocketException:
Operation not permitted
	at java.net.PlainSocketImpl.socketConnect(Native Method)
	at java.net.AbstractPlainSocketImpl.doConnect(AbstractPlainSocketImpl.java:327)
	at java.net.AbstractPlainSocketImpl.connectToAddress(AbstractPlainSocketImpl.java:193)
	at java.net.AbstractPlainSocketImpl.connect(AbstractPlainSocketImpl.java:180)
	at java.net.SocksSocketImpl.connect(SocksSocketImpl.java:384)
	at java.net.Socket.connect(Socket.java:546)
	at java.net.Socket.connect(Socket.java:495)
	at sun.net.NetworkClient.doConnect(NetworkClient.java:178)
	at sun.net.www.http.HttpClient.openServer(HttpClient.java:409)
	at sun.net.www.http.HttpClient.openServer(HttpClient.java:530)
	at sun.net.www.http.HttpClient.<init>(HttpClient.java:240)
	at sun.net.www.http.HttpClient.New(HttpClient.java:321)
	at sun.net.www.http.HttpClient.New(HttpClient.java:338)
	at sun.net.www.protocol.http.HttpURLConnection.getNewHttpClient(HttpURLConnection.java:935)
	at sun.net.www.protocol.http.HttpURLConnection.plainConnect(HttpURLConnection.java:876)
	at sun.net.www.protocol.http.HttpURLConnection.connect(HttpURLConnection.java:801)
	at org.apache.tools.ant.taskdefs.Get$GetThread.openConnection(Get.java:662)
	at org.apache.tools.ant.taskdefs.Get$GetThread.get(Get.java:581)
	at org.apache.tools.ant.taskdefs.Get$GetThread.run(Get.java:571)

Total time: 1 minute 44 seconds
Build step 'Invoke Ant' marked build as failure
[FINDBUGS] Skipping publisher since build result is FAILURE
[WARNINGS] Skipping publisher since build result is FAILURE
Archiving artifacts
Recording test results

---------------------------------------------------------------------
To unsubscribe, e-mail: dev-unsubscribe@poi.apache.org
For additional commands, e-mail: dev-help@poi.apache.org


Mime
View raw message