poi-dev mailing list archives

Site index · List index
Message view « Date » · « Thread »
Top « Date » · « Thread »
From Apache Jenkins Server <jenk...@builds.apache.org>
Subject Build failed in Jenkins: POI-OpenJDK #93
Date Tue, 14 Jul 2015 14:52:41 GMT
See <https://builds.apache.org/job/POI-OpenJDK/93/>

------------------------------------------
Started by an SCM change
Building remotely on freebsd1 (freebsd bsd) in workspace <https://builds.apache.org/job/POI-OpenJDK/ws/>
Updating http://svn.apache.org/repos/asf/poi/trunk at revision '2015-07-14T14:50:51.750 +0000'
At revision 1690952
no change for http://svn.apache.org/repos/asf/poi/trunk since the previous build
[POI-OpenJDK] $ /home/jenkins/tools/ant/latest/bin/ant -Dcoverage.enabled=true clean jenkins
Buildfile: /usr<https://builds.apache.org/job/POI-OpenJDK/ws/build.xml>

clean:

check-jars:

fetch-jars:

testexist:

downloadfile:
      [get] Getting: http://repo1.maven.org/maven2/commons-logging/commons-logging/1.1.3/commons-logging-1.1.3.jar
      [get] To: /usr<https://builds.apache.org/job/POI-OpenJDK/ws/lib/commons-logging-1.1.3.jar>

testexist:

downloadfile:
      [get] Getting: http://repo1.maven.org/maven2/commons-codec/commons-codec/1.9/commons-codec-1.9.jar
      [get] To: /usr<https://builds.apache.org/job/POI-OpenJDK/ws/lib/commons-codec-1.9.jar>

testexist:

downloadfile:
      [get] Getting: http://repo1.maven.org/maven2/log4j/log4j/1.2.17/log4j-1.2.17.jar
      [get] To: /usr<https://builds.apache.org/job/POI-OpenJDK/ws/lib/log4j-1.2.17.jar>

testexist:

downloadfile:
      [get] Getting: http://repo1.maven.org/maven2/junit/junit/4.12/junit-4.12.jar
      [get] To: /usr<https://builds.apache.org/job/POI-OpenJDK/ws/lib/junit-4.12.jar>

testexist:

downloadfile:
      [get] Getting: http://repo1.maven.org/maven2/org/hamcrest/hamcrest-core/1.3/hamcrest-core-1.3.jar
      [get] To: /usr<https://builds.apache.org/job/POI-OpenJDK/ws/lib/hamcrest-core-1.3.jar>

testexist:

downloadfile:
      [get] Getting: http://repo1.maven.org/maven2/org/apache/ant/ant/1.9.4/ant-1.9.4.jar
      [get] To: /usr<https://builds.apache.org/job/POI-OpenJDK/ws/lib/ant-1.9.4.jar>

testexist:

downloadfile:
      [get] Getting: http://repo1.maven.org/maven2/org/apache/ant/ant-launcher/1.9.4/ant-launcher-1.9.4.jar
      [get] To: /usr<https://builds.apache.org/job/POI-OpenJDK/ws/lib/ant-launcher-1.9.4.jar>

testexist:

downloadfile:
      [get] Getting: http://repo1.maven.org/maven2/org/ow2/asm/asm-all/5.0.3/asm-all-5.0.3.jar
      [get] To: /usr<https://builds.apache.org/job/POI-OpenJDK/ws/lib/asm-all-5.0.3.jar>

testexist:

downloadfile:
      [get] Getting: http://repo1.maven.org/maven2/org/jacoco/jacoco/0.7.4.201502262128/jacoco-0.7.4.201502262128.zip
      [get] To: /usr<https://builds.apache.org/job/POI-OpenJDK/ws/lib/jacoco-0.7.4.201502262128.zip>
    [unzip] Expanding: /usr<https://builds.apache.org/job/POI-OpenJDK/ws/lib/jacoco-0.7.4.201502262128.zip>
into /usr<https://builds.apache.org/job/POI-OpenJDK/ws/>

testexist:

downloadfile:
      [get] Getting: http://repo1.maven.org/maven2/org/apache/rat/apache-rat/0.11/apache-rat-0.11.jar
      [get] To: /usr<https://builds.apache.org/job/POI-OpenJDK/ws/lib/apache-rat-0.11.jar>

testexist:

downloadfile:
      [get] Getting: http://repo1.maven.org/maven2/org/bouncycastle/bcprov-ext-jdk15on/1.51/bcprov-ext-jdk15on-1.51.jar
      [get] To: /usr<https://builds.apache.org/job/POI-OpenJDK/ws/compile-lib/bcprov-ext-jdk15on-1.51.jar>

testexist:

downloadfile:
      [get] Getting: http://repo1.maven.org/maven2/org/bouncycastle/bcpkix-jdk15on/1.51/bcpkix-jdk15on-1.51.jar
      [get] To: /usr<https://builds.apache.org/job/POI-OpenJDK/ws/compile-lib/bcpkix-jdk15on-1.51.jar>

testexist:

downloadfile:
      [get] Getting: http://repo1.maven.org/maven2/org/apache/santuario/xmlsec/2.0.1/xmlsec-2.0.1.jar
      [get] To: /usr<https://builds.apache.org/job/POI-OpenJDK/ws/compile-lib/xmlsec-2.0.1.jar>

testexist:

downloadfile:
      [get] Getting: http://repo1.maven.org/maven2/org/slf4j/slf4j-api/1.7.7/slf4j-api-1.7.7.jar
      [get] To: /usr<https://builds.apache.org/job/POI-OpenJDK/ws/compile-lib/slf4j-api-1.7.7.jar>

check-ooxml-jars:

fetch-ooxml-jars:

testexist:

downloadfile:
      [get] Getting: http://repo1.maven.org/maven2/org/apache/xmlbeans/xmlbeans/2.3.0/xmlbeans-2.3.0.jar
      [get] To: /usr<https://builds.apache.org/job/POI-OpenJDK/ws/ooxml-lib/xmlbeans-2.3.0.jar>

testexist:

downloadfile:
      [get] Getting: http://repo1.maven.org/maven2/org/apache/xmlbeans/xmlbeans/2.6.0/xmlbeans-2.6.0.jar
      [get] To: /usr<https://builds.apache.org/job/POI-OpenJDK/ws/ooxml-lib/xmlbeans-2.6.0.jar>

init:
    [mkdir] Created dir: /usr<https://builds.apache.org/job/POI-OpenJDK/ws/build>
    [mkdir] Created dir: /usr<https://builds.apache.org/job/POI-OpenJDK/ws/build/classes>
    [mkdir] Created dir: /usr<https://builds.apache.org/job/POI-OpenJDK/ws/build/test-classes>
    [mkdir] Created dir: /usr<https://builds.apache.org/job/POI-OpenJDK/ws/build/test-results>
    [mkdir] Created dir: /usr<https://builds.apache.org/job/POI-OpenJDK/ws/build/scratchpad-classes>
    [mkdir] Created dir: /usr<https://builds.apache.org/job/POI-OpenJDK/ws/build/scratchpad-test-classes>
    [mkdir] Created dir: /usr<https://builds.apache.org/job/POI-OpenJDK/ws/build/scratchpad-test-results>
    [mkdir] Created dir: /usr<https://builds.apache.org/job/POI-OpenJDK/ws/build/ooxml-classes>
    [mkdir] Created dir: /usr<https://builds.apache.org/job/POI-OpenJDK/ws/build/ooxml-test-classes>
    [mkdir] Created dir: /usr<https://builds.apache.org/job/POI-OpenJDK/ws/build/ooxml-test-results>
    [mkdir] Created dir: /usr<https://builds.apache.org/job/POI-OpenJDK/ws/build/excelant-classes>
    [mkdir] Created dir: /usr<https://builds.apache.org/job/POI-OpenJDK/ws/build/excelant-test-classes>
    [mkdir] Created dir: /usr<https://builds.apache.org/job/POI-OpenJDK/ws/build/excelant-test-results>
    [mkdir] Created dir: /usr<https://builds.apache.org/job/POI-OpenJDK/ws/build/examples-classes>
    [mkdir] Created dir: /usr<https://builds.apache.org/job/POI-OpenJDK/ws/build/integration-test-classes>
    [mkdir] Created dir: /usr<https://builds.apache.org/job/POI-OpenJDK/93/artifact/build/integration-test-results>
    [mkdir] Created dir: /usr<https://builds.apache.org/job/POI-OpenJDK/ws/build/dist>
    [mkdir] Created dir: /usr<https://builds.apache.org/job/POI-OpenJDK/ws/build/tmp/site/build/site>
     [echo] Using Java: 1.6.0_32/1.6.0_32-b27/20.0-b12/OpenJDK 64-Bit Server VM from Sun Microsystems
Inc. on FreeBSD: 9.1-RELEASE-p3

compile-main:
    [javac] Compiling 1027 source files to /usr<https://builds.apache.org/job/POI-OpenJDK/ws/build/classes>
    [javac] Note: Some input files use or override a deprecated API.
    [javac] Note: Recompile with -Xlint:deprecation for details.
    [javac] Note: Some input files use unchecked or unsafe operations.
    [javac] Note: Recompile with -Xlint:unchecked for details.
    [javac] Compiling 512 source files to /usr<https://builds.apache.org/job/POI-OpenJDK/ws/build/test-classes>
    [javac] Note: Some input files use or override a deprecated API.
    [javac] Note: Recompile with -Xlint:deprecation for details.
    [javac] Note: Some input files use unchecked or unsafe operations.
    [javac] Note: Recompile with -Xlint:unchecked for details.
     [copy] Copying 3 files to /usr<https://builds.apache.org/job/POI-OpenJDK/ws/build/classes>

compile-scratchpad:
    [javac] Compiling 506 source files to /usr<https://builds.apache.org/job/POI-OpenJDK/ws/build/scratchpad-classes>
    [javac] Note: Some input files use or override a deprecated API.
    [javac] Note: Recompile with -Xlint:deprecation for details.
    [javac] Note: Some input files use unchecked or unsafe operations.
    [javac] Note: Recompile with -Xlint:unchecked for details.
    [javac] Compiling 184 source files to /usr<https://builds.apache.org/job/POI-OpenJDK/ws/build/scratchpad-test-classes>
    [javac] Note: Some input files use or override a deprecated API.
    [javac] Note: Recompile with -Xlint:deprecation for details.
    [javac] Note: /usr<https://builds.apache.org/job/POI-OpenJDK/ws/src/scratchpad/testcases/org/apache/poi/hslf/TestReWriteSanity.java>
uses unchecked or unsafe operations.
    [javac] Note: Recompile with -Xlint:unchecked for details.
     [copy] Copying 2 files to /usr<https://builds.apache.org/job/POI-OpenJDK/ws/build/scratchpad-classes>

check-ooxml-xsds:

fetch-ooxml-xsds:
      [get] Getting: http://www.ecma-international.org/publications/files/ECMA-ST/Office%20Open%20XML%201st%20edition%20Part%204%20(PDF).zip
      [get] To: /usr<https://builds.apache.org/job/POI-OpenJDK/ws/ooxml-lib/OfficeOpenXML-Part4.zip>
      [get] Error getting http://www.ecma-international.org/publications/files/ECMA-ST/Office%20Open%20XML%201st%20edition%20Part%204%20(PDF).zip
to /usr<https://builds.apache.org/job/POI-OpenJDK/ws/ooxml-lib/OfficeOpenXML-Part4.zip>

BUILD FAILED
/usr<https://builds.apache.org/job/POI-OpenJDK/ws/build.xml>:562: java.net.SocketException:
Operation not permitted
	at java.net.PlainSocketImpl.socketConnect(Native Method)
	at java.net.AbstractPlainSocketImpl.doConnect(AbstractPlainSocketImpl.java:327)
	at java.net.AbstractPlainSocketImpl.connectToAddress(AbstractPlainSocketImpl.java:193)
	at java.net.AbstractPlainSocketImpl.connect(AbstractPlainSocketImpl.java:180)
	at java.net.SocksSocketImpl.connect(SocksSocketImpl.java:384)
	at java.net.Socket.connect(Socket.java:546)
	at java.net.Socket.connect(Socket.java:495)
	at sun.net.NetworkClient.doConnect(NetworkClient.java:178)
	at sun.net.www.http.HttpClient.openServer(HttpClient.java:409)
	at sun.net.www.http.HttpClient.openServer(HttpClient.java:530)
	at sun.net.www.http.HttpClient.<init>(HttpClient.java:240)
	at sun.net.www.http.HttpClient.New(HttpClient.java:321)
	at sun.net.www.http.HttpClient.New(HttpClient.java:338)
	at sun.net.www.protocol.http.HttpURLConnection.getNewHttpClient(HttpURLConnection.java:935)
	at sun.net.www.protocol.http.HttpURLConnection.plainConnect(HttpURLConnection.java:876)
	at sun.net.www.protocol.http.HttpURLConnection.connect(HttpURLConnection.java:801)
	at org.apache.tools.ant.taskdefs.Get$GetThread.openConnection(Get.java:662)
	at org.apache.tools.ant.taskdefs.Get$GetThread.get(Get.java:581)
	at org.apache.tools.ant.taskdefs.Get$GetThread.run(Get.java:571)

Total time: 1 minute 46 seconds
Build step 'Invoke Ant' marked build as failure
[FINDBUGS] Skipping publisher since build result is FAILURE
[WARNINGS] Skipping publisher since build result is FAILURE
Archiving artifacts
Recording test results

---------------------------------------------------------------------
To unsubscribe, e-mail: dev-unsubscribe@poi.apache.org
For additional commands, e-mail: dev-help@poi.apache.org


Mime
View raw message