poi-dev mailing list archives

Site index · List index
Message view « Date » · « Thread »
Top « Date » · « Thread »
From Apache Jenkins Server <jenk...@builds.apache.org>
Subject Build failed in Jenkins: POI #623
Date Wed, 29 Apr 2015 20:48:02 GMT
See <https://builds.apache.org/job/POI/623/changes>

Changes:

[nick] #57593 Complete create overloading in WorkbookFactory to take passwords

[nick] Fix inconsistent indents

[nick] #57593 Begin adding overloaded WorkbookFactory.create methods which take the spreadsheet
password

[nick] Sample password protected xlsx file from Tika

[nick] Use a constant for the name of the OOXML encrypted package node

[nick] Changelog update

[nick] When removing a SXSSF sheet, ensure temp files associated with it are disposed of #57666

[nick] Changelog/javadocs

[nick] Patch from Jon Scharff from bug #57826 - If a XSSF shape has a buFont but no bullet
character, mirror Excel and treat as un-bulleted

------------------------------------------
[...truncated 2212 lines...]
    [junit] Tests run: 3, Failures: 0, Errors: 0, Time elapsed: 0.042 sec
    [junit] Running org.apache.poi.xssf.model.TestCalculationChain
    [junit] Tests run: 1, Failures: 0, Errors: 0, Time elapsed: 0.468 sec
    [junit] Running org.apache.poi.xssf.model.TestCommentsTable
    [junit] Tests run: 7, Failures: 0, Errors: 0, Time elapsed: 0.184 sec
    [junit] Running org.apache.poi.xssf.model.TestExternalLinksTable
    [junit] Tests run: 4, Failures: 0, Errors: 0, Time elapsed: 0.105 sec
    [junit] Running org.apache.poi.xssf.model.TestMapInfo
    [junit] Tests run: 1, Failures: 0, Errors: 0, Time elapsed: 0.023 sec
    [junit] Running org.apache.poi.xssf.model.TestSharedStringsTable
    [junit] Tests run: 3, Failures: 0, Errors: 0, Time elapsed: 0.172 sec
    [junit] Running org.apache.poi.xssf.model.TestStylesTable
    [junit] Tests run: 6, Failures: 0, Errors: 0, Time elapsed: 0.164 sec
    [junit] Running org.apache.poi.xssf.model.TestThemesTable
    [junit] Tests run: 1, Failures: 0, Errors: 0, Time elapsed: 0.021 sec
    [junit] Running org.apache.poi.xssf.streaming.TestOutlining
    [junit] Tests run: 6, Failures: 0, Errors: 0, Time elapsed: 0.175 sec
    [junit] Running org.apache.poi.xssf.streaming.TestSXSSFCell
    [junit] Tests run: 25, Failures: 0, Errors: 0, Time elapsed: 0.63 sec
    [junit] Running org.apache.poi.xssf.streaming.TestSXSSFDataValidation
    [junit] Tests run: 2, Failures: 0, Errors: 0, Time elapsed: 0.252 sec
    [junit] Running org.apache.poi.xssf.streaming.TestSXSSFHyperlink
    [junit] Tests run: 1, Failures: 0, Errors: 0, Time elapsed: 0.085 sec
    [junit] Running org.apache.poi.xssf.streaming.TestSXSSFRow
    [junit] Tests run: 10, Failures: 0, Errors: 0, Time elapsed: 0.727 sec
    [junit] Running org.apache.poi.xssf.streaming.TestSXSSFSheet
    [junit] Tests run: 37, Failures: 0, Errors: 0, Time elapsed: 1.13 sec
    [junit] Running org.apache.poi.xssf.streaming.TestSXSSFWorkbook
    [junit] Tests run: 19, Failures: 0, Errors: 0, Time elapsed: 1.042 sec
    [junit] Running org.apache.poi.xssf.usermodel.TestFormulaEvaluatorOnXSSF
    [junit] Tests run: 2, Failures: 0, Errors: 0, Time elapsed: 0.601 sec
    [junit] Running org.apache.poi.xssf.usermodel.TestMissingWorkbookOnXSSF
    [junit] Tests run: 3, Failures: 0, Errors: 0, Time elapsed: 0.098 sec
    [junit] Running org.apache.poi.xssf.usermodel.TestMultiSheetFormulaEvaluatorOnXSSF
    [junit] Tests run: 1, Failures: 0, Errors: 0, Time elapsed: 0.014 sec
    [junit] Running org.apache.poi.xssf.usermodel.TestSheetHiding
    [junit] Tests run: 5, Failures: 0, Errors: 0, Time elapsed: 0.191 sec
    [junit] Running org.apache.poi.xssf.usermodel.TestXSSFBugs
    [junit] Tests run: 88, Failures: 0, Errors: 0, Time elapsed: 4.725 sec
    [junit] Running org.apache.poi.xssf.usermodel.TestXSSFCell
    [junit] Tests run: 38, Failures: 0, Errors: 0, Time elapsed: 1.572 sec
    [junit] Running org.apache.poi.xssf.usermodel.TestXSSFCellStyle
    [junit] Tests run: 38, Failures: 0, Errors: 0, Time elapsed: 0.903 sec
    [junit] Running org.apache.poi.xssf.usermodel.TestXSSFChart
    [junit] Tests run: 3, Failures: 0, Errors: 0, Time elapsed: 0.188 sec
    [junit] Running org.apache.poi.xssf.usermodel.TestXSSFChartSheet
    [junit] Tests run: 3, Failures: 0, Errors: 0, Time elapsed: 0.089 sec
    [junit] Running org.apache.poi.xssf.usermodel.TestXSSFColGrouping
    [junit] Tests run: 6, Failures: 0, Errors: 0, Time elapsed: 0.197 sec
    [junit] Running org.apache.poi.xssf.usermodel.TestXSSFColor
    [junit] Tests run: 3, Failures: 0, Errors: 0, Time elapsed: 0.048 sec
    [junit] Running org.apache.poi.xssf.usermodel.TestXSSFComment
    [junit] Tests run: 12, Failures: 0, Errors: 0, Time elapsed: 0.236 sec
    [junit] Running org.apache.poi.xssf.usermodel.TestXSSFConditionalFormatting
    [junit] Tests run: 13, Failures: 0, Errors: 0, Time elapsed: 0.261 sec
    [junit] Running org.apache.poi.xssf.usermodel.TestXSSFDataFormat
    [junit] Tests run: 2, Failures: 0, Errors: 0, Time elapsed: 0.097 sec
    [junit] Running org.apache.poi.xssf.usermodel.TestXSSFDataValidation
    [junit] Tests run: 6, Failures: 0, Errors: 0, Time elapsed: 0.332 sec
    [junit] Running org.apache.poi.xssf.usermodel.TestXSSFDialogSheet
    [junit] Tests run: 14, Failures: 0, Errors: 0, Time elapsed: 0.226 sec
    [junit] Running org.apache.poi.xssf.usermodel.TestXSSFDrawing
    [junit] Tests run: 18, Failures: 0, Errors: 0, Time elapsed: 0.552 sec
    [junit] Running org.apache.poi.xssf.usermodel.TestXSSFExternalFunctions
    [junit] Tests run: 2, Failures: 0, Errors: 0, Time elapsed: 0.036 sec
    [junit] Running org.apache.poi.xssf.usermodel.TestXSSFFont
    [junit] Tests run: 19, Failures: 0, Errors: 0, Time elapsed: 0.314 sec
    [junit] Running org.apache.poi.xssf.usermodel.TestXSSFFormulaEvaluation
    [junit] Tests run: 22, Failures: 0, Errors: 0, Time elapsed: 0.796 sec
    [junit] Running org.apache.poi.xssf.usermodel.TestXSSFFormulaParser
    [junit] Tests run: 6, Failures: 0, Errors: 0, Time elapsed: 0.04 sec
    [junit] Running org.apache.poi.xssf.usermodel.TestXSSFHeaderFooter
    [junit] Tests run: 2, Failures: 0, Errors: 0, Time elapsed: 0.009 sec
    [junit] Running org.apache.poi.xssf.usermodel.TestXSSFHyperlink
    [junit] Tests run: 8, Failures: 0, Errors: 0, Time elapsed: 0.275 sec
    [junit] Running org.apache.poi.xssf.usermodel.TestXSSFName
    [junit] Tests run: 20, Failures: 0, Errors: 0, Time elapsed: 0.409 sec
    [junit] Running org.apache.poi.xssf.usermodel.TestXSSFPicture
    [junit] Tests run: 6, Failures: 0, Errors: 0, Time elapsed: 0.208 sec
    [junit] Running org.apache.poi.xssf.usermodel.TestXSSFPictureData
    [junit] Tests run: 3, Failures: 0, Errors: 0, Time elapsed: 0.082 sec
    [junit] Running org.apache.poi.xssf.usermodel.TestXSSFPivotTable
    [junit] Tests run: 13, Failures: 0, Errors: 0, Time elapsed: 0.386 sec
    [junit] Running org.apache.poi.xssf.usermodel.TestXSSFPrintSetup
    [junit] Tests run: 16, Failures: 0, Errors: 0, Time elapsed: 0.301 sec
    [junit] Running org.apache.poi.xssf.usermodel.TestXSSFRichTextString
    [junit] Tests run: 16, Failures: 0, Errors: 0, Time elapsed: 0.299 sec
    [junit] Running org.apache.poi.xssf.usermodel.TestXSSFRow
    [junit] Tests run: 10, Failures: 0, Errors: 0, Time elapsed: 3.681 sec
    [junit] Running org.apache.poi.xssf.usermodel.TestXSSFSheet
    [junit] Tests run: 71, Failures: 0, Errors: 0, Time elapsed: 9.295 sec
    [junit] Running org.apache.poi.xssf.usermodel.TestXSSFSheetAutosizeColumn
    [junit] Tests run: 7, Failures: 0, Errors: 0, Time elapsed: 0.153 sec
    [junit] Running org.apache.poi.xssf.usermodel.TestXSSFSheetRowGrouping
    [junit] Tests run: 6, Failures: 0, Errors: 0, Time elapsed: 0.222 sec
    [junit] Running org.apache.poi.xssf.usermodel.TestXSSFSheetShiftRows
    [junit] Tests run: 19, Failures: 0, Errors: 0, Time elapsed: 1.775 sec
    [junit] Running org.apache.poi.xssf.usermodel.TestXSSFSheetUpdateArrayFormulas
    [junit] Tests run: 16, Failures: 0, Errors: 0, Time elapsed: 0.45 sec
    [junit] Running org.apache.poi.xssf.usermodel.TestXSSFSimpleShape
    [junit] Tests run: 1, Failures: 0, Errors: 0, Time elapsed: 0.014 sec
    [junit] Running org.apache.poi.xssf.usermodel.TestXSSFTable
    [junit] Tests run: 1, Failures: 0, Errors: 0, Time elapsed: 0.116 sec
    [junit] Running org.apache.poi.xssf.usermodel.TestXSSFTextParagraph
    [junit] Tests run: 1, Failures: 0, Errors: 0, Time elapsed: 0.013 sec
    [junit] Running org.apache.poi.xssf.usermodel.TestXSSFTextRun
    [junit] Tests run: 1, Failures: 0, Errors: 0, Time elapsed: 0.048 sec
    [junit] Running org.apache.poi.xssf.usermodel.TestXSSFVMLDrawing
    [junit] Tests run: 3, Failures: 0, Errors: 0, Time elapsed: 0.092 sec
    [junit] Running org.apache.poi.xssf.usermodel.TestXSSFWorkbook
    [junit] Tests run: 41, Failures: 0, Errors: 0, Time elapsed: 1.024 sec
    [junit] Running org.apache.poi.xssf.usermodel.charts.TestXSSFCategoryAxis
    [junit] Tests run: 1, Failures: 0, Errors: 0, Time elapsed: 0.036 sec
    [junit] Running org.apache.poi.xssf.usermodel.charts.TestXSSFChartAxis
    [junit] Tests run: 8, Failures: 0, Errors: 0, Time elapsed: 0.135 sec
    [junit] Running org.apache.poi.xssf.usermodel.charts.TestXSSFChartLegend
    [junit] Tests run: 3, Failures: 0, Errors: 0, Time elapsed: 0.107 sec
    [junit] Running org.apache.poi.xssf.usermodel.charts.TestXSSFLineChartData
    [junit] Tests run: 1, Failures: 0, Errors: 0, Time elapsed: 0.031 sec
    [junit] Running org.apache.poi.xssf.usermodel.charts.TestXSSFManualLayout
    [junit] Tests run: 2, Failures: 0, Errors: 0, Time elapsed: 0.073 sec
    [junit] Running org.apache.poi.xssf.usermodel.charts.TestXSSFScatterChartData
    [junit] Tests run: 1, Failures: 0, Errors: 0, Time elapsed: 0.019 sec
    [junit] Running org.apache.poi.xssf.usermodel.charts.TestXSSFValueAxis
    [junit] Tests run: 1, Failures: 0, Errors: 0, Time elapsed: 0.067 sec
    [junit] Running org.apache.poi.xssf.usermodel.extensions.TestXSSFBorder
    [junit] Tests run: 1, Failures: 0, Errors: 0, Time elapsed: 0.004 sec
    [junit] Running org.apache.poi.xssf.usermodel.extensions.TestXSSFCellFill
    [junit] Tests run: 5, Failures: 0, Errors: 0, Time elapsed: 0.098 sec
    [junit] Running org.apache.poi.xssf.usermodel.extensions.TestXSSFSheetComments
    [junit] Tests run: 1, Failures: 0, Errors: 0, Time elapsed: 0.003 sec
    [junit] Running org.apache.poi.xssf.usermodel.helpers.TestColumnHelper
    [junit] Tests run: 8, Failures: 0, Errors: 0, Time elapsed: 0.194 sec
    [junit] Running org.apache.poi.xssf.usermodel.helpers.TestHeaderFooterHelper
    [junit] Tests run: 2, Failures: 0, Errors: 0, Time elapsed: 0.096 sec
    [junit] Running org.apache.poi.xssf.util.TestCTColComparator
    [junit] Tests run: 2, Failures: 0, Errors: 0, Time elapsed: 0.002 sec
    [junit] Running org.apache.poi.xssf.util.TestEvilUnclosedBRFixingInputStream
    [junit] Tests run: 3, Failures: 0, Errors: 0, Time elapsed: 0.008 sec
    [junit] Running org.apache.poi.xssf.util.TestNumericRanges
    [junit] Tests run: 2, Failures: 0, Errors: 0, Time elapsed: 0.089 sec
    [junit] Running org.apache.poi.xwpf.TestAllExtendedProperties
    [junit] Tests run: 1, Failures: 0, Errors: 0, Time elapsed: 0.127 sec
    [junit] Running org.apache.poi.xwpf.TestDocumentProtection
    [junit] Tests run: 10, Failures: 0, Errors: 0, Time elapsed: 0.7 sec
    [junit] Running org.apache.poi.xwpf.TestPackageCorePropertiesGetKeywords
    [junit] Tests run: 1, Failures: 0, Errors: 0, Time elapsed: 0.074 sec
    [junit] Running org.apache.poi.xwpf.TestXWPFBugs
    [junit] Tests run: 2, Failures: 0, Errors: 0, Time elapsed: 0.075 sec
    [junit] Running org.apache.poi.xwpf.extractor.TestExternalEntities
    [junit] Tests run: 1, Failures: 0, Errors: 0, Time elapsed: 0.009 sec
    [junit] Running org.apache.poi.xwpf.extractor.TestXWPFWordExtractor
    [junit] Tests run: 18, Failures: 0, Errors: 0, Time elapsed: 0.709 sec
    [junit] Running org.apache.poi.xwpf.model.TestXWPFDecorators
    [junit] Tests run: 2, Failures: 0, Errors: 0, Time elapsed: 0.066 sec
    [junit] Running org.apache.poi.xwpf.model.TestXWPFHeaderFooterPolicy
    [junit] Tests run: 2, Failures: 0, Errors: 0, Time elapsed: 0.118 sec
    [junit] Running org.apache.poi.xwpf.usermodel.TestChangeTracking
    [junit] Tests run: 3, Failures: 0, Errors: 0, Time elapsed: 0.027 sec
    [junit] Running org.apache.poi.xwpf.usermodel.TestXWPFBugs
    [junit] Tests run: 4, Failures: 0, Errors: 0, Time elapsed: 0.128 sec
    [junit] Running org.apache.poi.xwpf.usermodel.TestXWPFDocument
    [junit] Tests run: 18, Failures: 0, Errors: 0, Time elapsed: 0.475 sec
    [junit] Running org.apache.poi.xwpf.usermodel.TestXWPFFootnotes
    [junit] Tests run: 2, Failures: 0, Errors: 0, Time elapsed: 0.027 sec
    [junit] Running org.apache.poi.xwpf.usermodel.TestXWPFHeader
    [junit] Tests run: 8, Failures: 0, Errors: 0, Time elapsed: 0.19 sec
    [junit] Running org.apache.poi.xwpf.usermodel.TestXWPFHeadings
    [junit] Tests run: 1, Failures: 0, Errors: 0, Time elapsed: 0.047 sec
    [junit] Running org.apache.poi.xwpf.usermodel.TestXWPFNumbering
    [junit] Tests run: 4, Failures: 0, Errors: 0, Time elapsed: 0.077 sec
    [junit] Running org.apache.poi.xwpf.usermodel.TestXWPFParagraph
    [junit] Tests run: 17, Failures: 0, Errors: 0, Time elapsed: 0.376 sec
    [junit] Running org.apache.poi.xwpf.usermodel.TestXWPFPictureData
    [junit] Tests run: 4, Failures: 0, Errors: 0, Time elapsed: 0.2 sec
    [junit] Running org.apache.poi.xwpf.usermodel.TestXWPFRun
    [junit] Tests run: 17, Failures: 0, Errors: 0, Time elapsed: 0.241 sec
    [junit] Running org.apache.poi.xwpf.usermodel.TestXWPFSDT
    [junit] Tests run: 4, Failures: 0, Errors: 0, Time elapsed: 0.139 sec
    [junit] Running org.apache.poi.xwpf.usermodel.TestXWPFSmartTag
    [junit] Tests run: 1, Failures: 0, Errors: 0, Time elapsed: 0.045 sec
    [junit] Running org.apache.poi.xwpf.usermodel.TestXWPFStyles
    [junit] Tests run: 7, Failures: 0, Errors: 0, Time elapsed: 0.147 sec
    [junit] Running org.apache.poi.xwpf.usermodel.TestXWPFTable
    [junit] Tests run: 12, Failures: 0, Errors: 0, Time elapsed: 0.203 sec
    [junit] Running org.apache.poi.xwpf.usermodel.TestXWPFTableCell
    [junit] Tests run: 3, Failures: 0, Errors: 0, Time elapsed: 0.114 sec
    [junit] Running org.apache.poi.xwpf.usermodel.TestXWPFTableRow
    [junit] Tests run: 3, Failures: 0, Errors: 0, Time elapsed: 0.078 sec
[jacoco:coverage] Enhancing junit with coverage
    [junit] Running org.apache.poi.poifs.crypt.TestSignatureInfo
    [junit] Tests run: 10, Failures: 0, Errors: 0, Time elapsed: 8.076 sec

testcoveragereport:
    [mkdir] Created dir: <https://builds.apache.org/job/POI/ws/build\coverage>
[jacoco:report] Loading execution data file <https://builds.apache.org/job/POI/ws/build\jacoco-excelant.exec>
[jacoco:report] Loading execution data file <https://builds.apache.org/job/POI/ws/build\jacoco-main.exec>
[jacoco:report] Loading execution data file <https://builds.apache.org/job/POI/ws/build\jacoco-ooxml-lite-xmlsec.exec>
[jacoco:report] Loading execution data file <https://builds.apache.org/job/POI/ws/build\jacoco-ooxml-lite.exec>
[jacoco:report] Loading execution data file <https://builds.apache.org/job/POI/ws/build\jacoco-ooxml-xmlsec.exec>
[jacoco:report] Loading execution data file <https://builds.apache.org/job/POI/ws/build\jacoco-ooxml.exec>
[jacoco:report] Loading execution data file <https://builds.apache.org/job/POI/ws/build\jacoco-scratchpad.exec>
[jacoco:report] Writing bundle 'Main' with 1251 classes
[jacoco:report] Writing bundle 'Scratchpad' with 548 classes
[jacoco:report] Writing bundle 'OOXML' with 533 classes
[jacoco:report] Writing bundle 'Excelant' with 13 classes
     [echo] Coverage results are available at coverage\index.html, coverage/coverage.xml

test-all:

compile-integration:
    [javac] Compiling 18 source files to <https://builds.apache.org/job/POI/ws/build\integration-test-classes>
    [javac] Note: <https://builds.apache.org/job/POI/ws/src\integrationtest\org\apache\poi\stress\HWPFFileHandler.java>
uses or overrides a deprecated API.
    [javac] Note: Recompile with -Xlint:deprecation for details.

-test-integration-check:

test-integration:
[jacoco:coverage] Enhancing junit with coverage
    [junit] Handling 1011 files
    [junit] Running org.apache.poi.TestAllFiles
    [junit] [Fatal Error] :1:1: The parser has encountered more than "4,096" entity expansions
in this document; this is the limit imposed by the application.
    [junit] [Fatal Error] :1:1: The parser has encountered more than "4,096" entity expansions
in this document; this is the limit imposed by the application.
    [junit] Failed: spreadsheet/protected_passtika.xlsx
    [junit] Tests run: 1011, Failures: 0, Errors: 1, Time elapsed: 180.329 sec
    [junit] Output:
    [junit] Handling 1011 files
    [junit] Failed: spreadsheet/protected_passtika.xlsx
    [junit] 
    [junit] Error: 
    [junit] [Fatal Error] :1:1: The parser has encountered more than "4,096" entity expansions
in this document; this is the limit imposed by the application.
    [junit] [Fatal Error] :1:1: The parser has encountered more than "4,096" entity expansions
in this document; this is the limit imposed by the application.
    [junit] 

BUILD FAILED
<https://builds.apache.org/job/POI/ws/build.xml>:1105: Test org.apache.poi.TestAllFiles
failed

Total time: 12 minutes 38 seconds
Build step 'Invoke Ant' marked build as failure
[FINDBUGS] Skipping publisher since build result is FAILURE
[WARNINGS] Skipping publisher since build result is FAILURE
Archiving artifacts
Sending artifact delta relative to POI #622
Archived 4349 artifacts
Archive block size is 32768
Received 1477 blocks and 3125757 bytes
Compression is 93.9%
Took 47 sec
Recording test results

---------------------------------------------------------------------
To unsubscribe, e-mail: dev-unsubscribe@poi.apache.org
For additional commands, e-mail: dev-help@poi.apache.org


Mime
View raw message