poi-dev mailing list archives

Site index · List index
Message view « Date » · « Thread »
Top « Date » · « Thread »
From Apache Jenkins Server <jenk...@builds.apache.org>
Subject Build failed in Jenkins: POI-JDK8 #245
Date Mon, 22 Dec 2014 16:13:54 GMT
See <https://builds.apache.org/job/POI-JDK8/245/changes>

Changes:

[centic] Fix two Eclipse warnings

[centic] one more for the changelog

[centic] Bug 57373: Fix get/setFirstVisibleTab() for XSSFWorkbook

[centic] List some more fixes in changelog.

[centic] Bug 57362: Properly initialize chart axis when loading a workbook which already contains
a chart.

------------------------------------------
Started by an SCM change
Building remotely on ubuntu-2 (docker Ubuntu ubuntu) in workspace <https://builds.apache.org/job/POI-JDK8/ws/>
Updating http://svn.apache.org/repos/asf/poi/trunk at revision '2014-12-22T16:12:10.879 +0000'
AU        test-data/spreadsheet/57362.xlsx
AU        test-data/spreadsheet/56511.xlsx
AU        test-data/spreadsheet/56644.xlsx
U         src/ooxml/testcases/org/apache/poi/xssf/usermodel/TestXSSFCell.java
U         src/ooxml/testcases/org/apache/poi/xssf/usermodel/TestXSSFRichTextString.java
U         src/ooxml/testcases/org/apache/poi/xssf/usermodel/charts/TestXSSFChartAxis.java
U         src/ooxml/testcases/org/apache/poi/xssf/usermodel/TestXSSFWorkbook.java
U         src/ooxml/testcases/org/apache/poi/xssf/streaming/TestSXSSFDataValidation.java
U         src/ooxml/java/org/apache/poi/util/OOXMLLite.java
U         src/ooxml/java/org/apache/poi/xssf/usermodel/XSSFCell.java
U         src/ooxml/java/org/apache/poi/xssf/usermodel/XSSFWorkbook.java
U         src/ooxml/java/org/apache/poi/xssf/usermodel/XSSFChart.java
U         src/ooxml/java/org/apache/poi/xssf/usermodel/XSSFRichTextString.java
U         src/ooxml/java/org/apache/poi/xssf/usermodel/XSSFRow.java
U         src/testcases/org/apache/poi/ss/usermodel/TestDataFormatter.java
U         src/java/org/apache/poi/hssf/usermodel/HSSFRichTextString.java
U         src/java/org/apache/poi/ss/usermodel/DateUtil.java
Fetching 'https://svn.apache.org/repos/asf/poi/site/forrest.properties' at -1 into '<https://builds.apache.org/job/POI-JDK8/ws/forrest.properties'>
Fetching 'https://svn.apache.org/repos/asf/poi/site/src/documentation' at -1 into '<https://builds.apache.org/job/POI-JDK8/ws/src/documentation'>
U         src/documentation/content/xdocs/status.xml
At revision 1647343
At revision 1647343
WARNING: clock of the subversion server appears to be out of sync. This can result in inconsistent
check out behavior.
no change for http://svn.apache.org/repos/asf/poi/trunk/forrest.properties since the previous
build
Deleting old artifacts from #243
[POI-JDK8] $ /home/jenkins/tools/ant/latest/bin/ant -DDISABLED.coverage.enabled=true clean
jenkins
Buildfile: <https://builds.apache.org/job/POI-JDK8/ws/build.xml>

clean:
   [delete] Deleting directory <https://builds.apache.org/job/POI-JDK8/ws/build>

check-jars:

fetch-jars:

check-ooxml-jars:

fetch-ooxml-jars:

init:
    [mkdir] Created dir: <https://builds.apache.org/job/POI-JDK8/ws/build>
    [mkdir] Created dir: <https://builds.apache.org/job/POI-JDK8/ws/build/classes>
    [mkdir] Created dir: <https://builds.apache.org/job/POI-JDK8/ws/build/test-classes>
    [mkdir] Created dir: <https://builds.apache.org/job/POI-JDK8/ws/build/test-results>
    [mkdir] Created dir: <https://builds.apache.org/job/POI-JDK8/ws/build/scratchpad-classes>
    [mkdir] Created dir: <https://builds.apache.org/job/POI-JDK8/ws/build/scratchpad-test-classes>
    [mkdir] Created dir: <https://builds.apache.org/job/POI-JDK8/ws/build/scratchpad-test-results>
    [mkdir] Created dir: <https://builds.apache.org/job/POI-JDK8/ws/build/ooxml-classes>
    [mkdir] Created dir: <https://builds.apache.org/job/POI-JDK8/ws/build/ooxml-test-classes>
    [mkdir] Created dir: <https://builds.apache.org/job/POI-JDK8/ws/build/ooxml-test-results>
    [mkdir] Created dir: <https://builds.apache.org/job/POI-JDK8/ws/build/excelant-classes>
    [mkdir] Created dir: <https://builds.apache.org/job/POI-JDK8/ws/build/excelant-test-classes>
    [mkdir] Created dir: <https://builds.apache.org/job/POI-JDK8/ws/build/excelant-test-results>
    [mkdir] Created dir: <https://builds.apache.org/job/POI-JDK8/ws/build/examples-classes>
    [mkdir] Created dir: <https://builds.apache.org/job/POI-JDK8/ws/build/dist>
    [mkdir] Created dir: <https://builds.apache.org/job/POI-JDK8/ws/build/tmp/site/build/site>
     [echo] Using Java: 1.8.0_20/1.8.0_20-b26/25.20-b23/Java HotSpot(TM) 64-Bit Server VM
from Oracle Corporation on Linux: 3.13.0-36-lowlatency

compile-main:
    [javac] Compiling 976 source files to <https://builds.apache.org/job/POI-JDK8/ws/build/classes>
    [javac] warning: [options] bootstrap class path not set in conjunction with -source 1.6
    [javac] Note: Some input files use or override a deprecated API.
    [javac] Note: Recompile with -Xlint:deprecation for details.
    [javac] Note: Some input files use unchecked or unsafe operations.
    [javac] Note: Recompile with -Xlint:unchecked for details.
    [javac] 1 warning
    [javac] Compiling 503 source files to <https://builds.apache.org/job/POI-JDK8/ws/build/test-classes>
    [javac] warning: [options] bootstrap class path not set in conjunction with -source 1.6
    [javac] Note: Some input files use or override a deprecated API.
    [javac] Note: Recompile with -Xlint:deprecation for details.
    [javac] Note: Some input files use unchecked or unsafe operations.
    [javac] Note: Recompile with -Xlint:unchecked for details.
    [javac] 1 warning
     [copy] Copying 3 files to <https://builds.apache.org/job/POI-JDK8/ws/build/classes>

compile-scratchpad:
    [javac] Compiling 528 source files to <https://builds.apache.org/job/POI-JDK8/ws/build/scratchpad-classes>
    [javac] warning: [options] bootstrap class path not set in conjunction with -source 1.6
    [javac] Note: Some input files use or override a deprecated API.
    [javac] Note: Recompile with -Xlint:deprecation for details.
    [javac] Note: Some input files use unchecked or unsafe operations.
    [javac] Note: Recompile with -Xlint:unchecked for details.
    [javac] 1 warning
    [javac] Compiling 179 source files to <https://builds.apache.org/job/POI-JDK8/ws/build/scratchpad-test-classes>
    [javac] warning: [options] bootstrap class path not set in conjunction with -source 1.6
    [javac] Note: Some input files use or override a deprecated API.
    [javac] Note: Recompile with -Xlint:deprecation for details.
    [javac] Note: Some input files use unchecked or unsafe operations.
    [javac] Note: Recompile with -Xlint:unchecked for details.
    [javac] 1 warning
     [copy] Copying 2 files to <https://builds.apache.org/job/POI-JDK8/ws/build/scratchpad-classes>

check-ooxml-xsds:

fetch-ooxml-xsds:

check-compiled-ooxml-xsds:

compile-ooxml-xsds:

compile-ooxml:
    [javac] Compiling 381 source files to <https://builds.apache.org/job/POI-JDK8/ws/build/ooxml-classes>
    [javac] warning: [options] bootstrap class path not set in conjunction with -source 1.6
    [javac] Note: Some input files use or override a deprecated API.
    [javac] Note: Recompile with -Xlint:deprecation for details.
    [javac] Note: Some input files use unchecked or unsafe operations.
    [javac] Note: Recompile with -Xlint:unchecked for details.
    [javac] 1 warning
    [javac] Compiling 177 source files to <https://builds.apache.org/job/POI-JDK8/ws/build/ooxml-test-classes>
    [javac] warning: [options] bootstrap class path not set in conjunction with -source 1.6
    [javac] Note: Some input files use or override a deprecated API.
    [javac] Note: Recompile with -Xlint:deprecation for details.
    [javac] 1 warning
     [copy] Copying 3 files to <https://builds.apache.org/job/POI-JDK8/ws/build/ooxml-classes>

compile-examples:
    [javac] Compiling 136 source files to <https://builds.apache.org/job/POI-JDK8/ws/build/examples-classes>
    [javac] warning: [options] bootstrap class path not set in conjunction with -source 1.6
    [javac] Note: Some input files use or override a deprecated API.
    [javac] Note: Recompile with -Xlint:deprecation for details.
    [javac] Note: Some input files use unchecked or unsafe operations.
    [javac] Note: Recompile with -Xlint:unchecked for details.
    [javac] 1 warning
     [copy] Copying 1 file to <https://builds.apache.org/job/POI-JDK8/ws/build/examples-classes>

compile-excelant:
    [javac] Compiling 14 source files to <https://builds.apache.org/job/POI-JDK8/ws/build/excelant-classes>
    [javac] warning: [options] bootstrap class path not set in conjunction with -source 1.6
    [javac] 1 warning
    [javac] Compiling 12 source files to <https://builds.apache.org/job/POI-JDK8/ws/build/excelant-test-classes>
    [javac] warning: [options] bootstrap class path not set in conjunction with -source 1.6
    [javac] 1 warning
     [copy] Copying 1 file to <https://builds.apache.org/job/POI-JDK8/ws/build/excelant-classes>

compile:

compile-ooxml-lite:
    [mkdir] Created dir: <https://builds.apache.org/job/POI-JDK8/ws/build/ooxml-lite-merged>
      [jar] Building jar: <https://builds.apache.org/job/POI-JDK8/ws/build/ooxml-lite-merged/ooxml-lite-merged.jar>
     [java] Collecting unit tests from <https://builds.apache.org/job/POI-JDK8/ws/build/ooxml-test-classes>
     [java] Inner class org.apache.poi.poifs.crypt.TestCertificateEncryption$CertData.class
not included
     [java] Inner class org.apache.poi.xslf.geom.TestPresetGeometries$1.class not included
     [java] Inner class org.apache.poi.xssf.usermodel.TestFormulaEvaluatorOnXSSF$Result.class
not included
     [java] Inner class org.apache.poi.xssf.usermodel.TestMultiSheetFormulaEvaluatorOnXSSF$SS.class
not included
     [java] Inner class org.apache.poi.xssf.usermodel.TestFormulaEvaluatorOnXSSF$SS.class
not included
     [java] Inner class org.apache.poi.xssf.usermodel.TestMultiSheetFormulaEvaluatorOnXSSF$Result.class
not included
     [java] Inner class org.apache.poi.xssf.usermodel.TestXSSFBugs$1.class not included
     [java] Class org.apache.poi.xssf.usermodel.TestXSSFSheetAutosizeColumn does not derive
from TestCase and does not have a @Test annotation
     [java] Inner class org.apache.poi.xssf.extractor.TestXSSFExportToXML$1.class not included
     [java] Inner class org.apache.poi.xssf.extractor.TestXSSFExportToXML$DummyEntityResolver.class
not included
     [java] Inner class org.apache.poi.xssf.streaming.TestSXSSFWorkbook$1.class not included
     [java] Inner class org.apache.poi.xssf.streaming.TestSXSSFWorkbook$NullOutputStream.class
not included
     [java] Inner class org.apache.poi.TestPOIXMLDocument$TestFactory.class not included
     [java] Inner class org.apache.poi.TestPOIXMLDocument$OPCParser.class not included
     [java] Found 159 classes
     [java] SLF4J: Failed to load class "org.slf4j.impl.StaticLoggerBinder".
     [java] SLF4J: Defaulting to no-operation (NOP) logger implementation
     [java] SLF4J: See http://www.slf4j.org/codes.html#StaticLoggerBinder for further details.
     [java] ....................................................................I......................................................................................................................................Name:
/word/document.xml - Content Type: application/vnd.openxmlformats-officedocument.wordprocessingml.document.main+xml
     [java] [Fatal Error] :1:1: JAXP00010001: The parser has encountered more than "4096"
entity expansions in this document; this is the limit imposed by the JDK.
     [java] [Fatal Error] :1:1: JAXP00010001: The parser has encountered more than "4096"
entity expansions in this document; this is the limit imposed by the JDK.
     [java] Warning - Row 13 has no cell 1, can't figure out test name
     [java] ................................................................................................................II...................................................................................................................................................................................I........I....................................................................................................................................................................................................................................................................Done
     [java] ...........<?xml version="1.0" encoding="UTF-8"?>
     [java] <worksheet xmlns="http://schemas.openxmlformats.org/spreadsheetml/2006/main"><dimension
ref="A1"/><sheetViews><sheetView workbookViewId="0" tabSelected="true"/></sheetViews><sheetFormatPr
defaultRowHeight="15.0"/><sheetData/><pageMargins bottom="0.75" footer="0.3" header="0.3"
left="0.7" right="0.7" top="0.75"/></worksheet>
     [java] ...........E.......................org.apache.poi.ss.usermodel.CellValue [12.0]
     [java] org.apache.poi.ss.usermodel.CellValue [12.0]
     [java] ....org.apache.poi.ss.usermodel.CellValue [1.0]
     [java] org.apache.poi.ss.usermodel.CellValue [1.0]
     [java] .org.apache.poi.ss.usermodel.CellValue [2.0]
     [java] org.apache.poi.ss.usermodel.CellValue [2.0]
     [java] .org.apache.poi.ss.usermodel.CellValue [2.0]
     [java] .org.apache.poi.ss.usermodel.CellValue [2.0]
     [java] .org.apache.poi.ss.usermodel.CellValue [2.0]
     [java] .org.apache.poi.ss.usermodel.CellValue [3.0]
     [java] ........................................................................................................................................Setting
col: 0 and row 0
     [java] Setting col: 1 and row 1
     [java] Exception in thread "main" java.lang.RuntimeException: Tests did not succeed,
cannot build ooxml-lite jar
     [java] 	at org.apache.poi.util.OOXMLLite.build(OOXMLLite.java:100)
     [java] 	at org.apache.poi.util.OOXMLLite.main(OOXMLLite.java:84)
     [java] .............................................................................................................................................................................................................................
     [java] Time: 40.771
     [java] There was 1 failure:
     [java] 1) testAddPivotTableToWorkbookWithLoadedPivotTable(org.apache.poi.xssf.usermodel.TestXSSFWorkbook)
     [java] java.lang.NullPointerException
     [java] 	at java.util.zip.ZipFile.getZipEntry(ZipFile.java:567)
     [java] 	at java.util.zip.ZipFile.access$900(ZipFile.java:61)
     [java] 	at java.util.zip.ZipFile$ZipEntryIterator.next(ZipFile.java:525)
     [java] 	at java.util.zip.ZipFile$ZipEntryIterator.nextElement(ZipFile.java:500)
     [java] 	at java.util.zip.ZipFile$ZipEntryIterator.nextElement(ZipFile.java:481)
     [java] 	at org.apache.poi.openxml4j.opc.ZipPackage.getPartsImpl(ZipPackage.java:188)
     [java] 	at org.apache.poi.openxml4j.opc.OPCPackage.getParts(OPCPackage.java:673)
     [java] 	at org.apache.poi.openxml4j.opc.OPCPackage.open(OPCPackage.java:253)
     [java] 	at org.apache.poi.openxml4j.opc.OPCPackage.open(OPCPackage.java:200)
     [java] 	at org.apache.poi.ss.usermodel.WorkbookFactory.create(WorkbookFactory.java:108)
     [java] 	at org.apache.poi.xssf.usermodel.TestXSSFWorkbook.testAddPivotTableToWorkbookWithLoadedPivotTable(TestXSSFWorkbook.java:797)
     [java] 	at sun.reflect.NativeMethodAccessorImpl.invoke0(Native Method)
     [java] 	at sun.reflect.NativeMethodAccessorImpl.invoke(NativeMethodAccessorImpl.java:62)
     [java] 	at sun.reflect.DelegatingMethodAccessorImpl.invoke(DelegatingMethodAccessorImpl.java:43)
     [java] 	at java.lang.reflect.Method.invoke(Method.java:483)
     [java] 	at org.junit.runners.model.FrameworkMethod$1.runReflectiveCall(FrameworkMethod.java:47)
     [java] 	at org.junit.internal.runners.model.ReflectiveCallable.run(ReflectiveCallable.java:12)
     [java] 	at org.junit.runners.model.FrameworkMethod.invokeExplosively(FrameworkMethod.java:44)
     [java] 	at org.junit.internal.runners.statements.InvokeMethod.evaluate(InvokeMethod.java:17)
     [java] 	at org.junit.runners.ParentRunner.runLeaf(ParentRunner.java:271)
     [java] 	at org.junit.runners.BlockJUnit4ClassRunner.runChild(BlockJUnit4ClassRunner.java:70)
     [java] 	at org.junit.runners.BlockJUnit4ClassRunner.runChild(BlockJUnit4ClassRunner.java:50)
     [java] 	at org.junit.runners.ParentRunner$3.run(ParentRunner.java:238)
     [java] 	at org.junit.runners.ParentRunner$1.schedule(ParentRunner.java:63)
     [java] 	at org.junit.runners.ParentRunner.runChildren(ParentRunner.java:236)
     [java] 	at org.junit.runners.ParentRunner.access$000(ParentRunner.java:53)
     [java] 	at org.junit.runners.ParentRunner$2.evaluate(ParentRunner.java:229)
     [java] 	at org.junit.runners.ParentRunner.run(ParentRunner.java:309)
     [java] 	at org.junit.runners.Suite.runChild(Suite.java:127)
     [java] 	at org.junit.runners.Suite.runChild(Suite.java:26)
     [java] 	at org.junit.runners.ParentRunner$3.run(ParentRunner.java:238)
     [java] 	at org.junit.runners.ParentRunner$1.schedule(ParentRunner.java:63)
     [java] 	at org.junit.runners.ParentRunner.runChildren(ParentRunner.java:236)
     [java] 	at org.junit.runners.ParentRunner.access$000(ParentRunner.java:53)
     [java] 	at org.junit.runners.ParentRunner$2.evaluate(ParentRunner.java:229)
     [java] 	at org.junit.runners.ParentRunner.run(ParentRunner.java:309)
     [java] 	at org.junit.runner.JUnitCore.run(JUnitCore.java:160)
     [java] 	at org.junit.runner.JUnitCore.run(JUnitCore.java:138)
     [java] 	at org.junit.runner.JUnitCore.run(JUnitCore.java:117)
     [java] 	at org.apache.poi.util.OOXMLLite.build(OOXMLLite.java:98)
     [java] 	at org.apache.poi.util.OOXMLLite.main(OOXMLLite.java:84)
     [java] 
     [java] FAILURES!!!
     [java] Tests run: 1172,  Failures: 1
     [java] 

BUILD FAILED
<https://builds.apache.org/job/POI-JDK8/ws/build.xml>:1049: Java returned: 1

Total time: 1 minute 38 seconds
Build step 'Invoke Ant' marked build as failure
[WARNINGS] Skipping publisher since build result is FAILURE
Archiving artifacts
Recording test results

---------------------------------------------------------------------
To unsubscribe, e-mail: dev-unsubscribe@poi.apache.org
For additional commands, e-mail: dev-help@poi.apache.org


Mime
View raw message