poi-dev mailing list archives

Site index · List index
Message view « Date » · « Thread »
Top « Date » · « Thread »
From Apache Jenkins Server <jenk...@builds.apache.org>
Subject Build failed in Jenkins: POI #266
Date Tue, 04 Mar 2014 12:41:30 GMT
See <https://builds.apache.org/job/POI/266/changes>

Changes:

[nick] POI is now on JDK 1.6, so remove 1.5 workaround

------------------------------------------
[...truncated 874 lines...]
    [junit] Running org.apache.poi.ss.formula.functions.TestFactDoubleFunctionsFromSpreadsheet
    [junit] Tests run: 1, Failures: 0, Errors: 0, Time elapsed: 0.091 sec
    [junit] Running org.apache.poi.ss.formula.functions.TestFinanceLib
    [junit] Tests run: 5, Failures: 0, Errors: 0, Time elapsed: 0.093 sec
    [junit] Running org.apache.poi.ss.formula.functions.TestFind
    [junit] Tests run: 1, Failures: 0, Errors: 0, Time elapsed: 0.012 sec
    [junit] Running org.apache.poi.ss.formula.functions.TestHex2Dec
    [junit] Tests run: 2, Failures: 0, Errors: 0, Time elapsed: 0.083 sec
    [junit] Running org.apache.poi.ss.formula.functions.TestIPMT
    [junit] Tests run: 1, Failures: 0, Errors: 0, Time elapsed: 0.078 sec
    [junit] Running org.apache.poi.ss.formula.functions.TestImRealFunctionsFromSpreadsheet
    [junit] Tests run: 1, Failures: 0, Errors: 0, Time elapsed: 0.012 sec
    [junit] Running org.apache.poi.ss.formula.functions.TestImaginaryFunctionsFromSpreadsheet
    [junit] Tests run: 1, Failures: 0, Errors: 0, Time elapsed: 0.073 sec
    [junit] Running org.apache.poi.ss.formula.functions.TestIndex
    [junit] Tests run: 3, Failures: 0, Errors: 0, Time elapsed: 0.088 sec
    [junit] Running org.apache.poi.ss.formula.functions.TestIndexFunctionFromSpreadsheet
    [junit] Tests run: 1, Failures: 0, Errors: 0, Time elapsed: 0.022 sec
    [junit] Running org.apache.poi.ss.formula.functions.TestIndirect
    [junit] Tests run: 2, Failures: 0, Errors: 0, Time elapsed: 0.078 sec
    [junit] Running org.apache.poi.ss.formula.functions.TestIndirectFunctionFromSpreadsheet
    [junit] Tests run: 1, Failures: 0, Errors: 0, Time elapsed: 0.082 sec
    [junit] Running org.apache.poi.ss.formula.functions.TestIntercept
    [junit] Tests run: 4, Failures: 0, Errors: 0, Time elapsed: 0.091 sec
    [junit] Running org.apache.poi.ss.formula.functions.TestIrr
    [junit] Tests run: 3, Failures: 0, Errors: 0, Time elapsed: 0.091 sec
    [junit] Running org.apache.poi.ss.formula.functions.TestIsBlank
    [junit] Tests run: 1, Failures: 0, Errors: 0, Time elapsed: 0.011 sec
    [junit] Running org.apache.poi.ss.formula.functions.TestLeftRight
    [junit] Tests run: 2, Failures: 0, Errors: 0, Time elapsed: 0.077 sec
    [junit] Running org.apache.poi.ss.formula.functions.TestLen
    [junit] Tests run: 3, Failures: 0, Errors: 0, Time elapsed: 0.087 sec
    [junit] Running org.apache.poi.ss.formula.functions.TestLookupFunctionsFromSpreadsheet
    [junit] Tests run: 1, Failures: 0, Errors: 0, Time elapsed: 0.048 sec
    [junit] Running org.apache.poi.ss.formula.functions.TestMatch
    [junit] Tests run: 8, Failures: 0, Errors: 0, Time elapsed: 0.137 sec
    [junit] Running org.apache.poi.ss.formula.functions.TestMatchFunctionsFromSpreadsheet
    [junit] Tests run: 1, Failures: 0, Errors: 0, Time elapsed: 0.091 sec
    [junit] Running org.apache.poi.ss.formula.functions.TestMathX
    [junit] Tests run: 23, Failures: 0, Errors: 0, Time elapsed: 0.399 sec
    [junit] Running org.apache.poi.ss.formula.functions.TestMid
    [junit] Tests run: 4, Failures: 0, Errors: 0, Time elapsed: 0.091 sec
    [junit] Running org.apache.poi.ss.formula.functions.TestMirr
    [junit] Tests run: 4, Failures: 0, Errors: 0, Time elapsed: 0.096 sec
    [junit] Running org.apache.poi.ss.formula.functions.TestNper
    [junit] Tests run: 2, Failures: 0, Errors: 0, Time elapsed: 0.083 sec
    [junit] Running org.apache.poi.ss.formula.functions.TestNpv
    [junit] Tests run: 2, Failures: 0, Errors: 0, Time elapsed: 0.083 sec
    [junit] Running org.apache.poi.ss.formula.functions.TestOct2Dec
    [junit] Tests run: 2, Failures: 0, Errors: 0, Time elapsed: 0.092 sec
    [junit] Running org.apache.poi.ss.formula.functions.TestOffset
    [junit] Tests run: 2, Failures: 0, Errors: 0, Time elapsed: 0.011 sec
    [junit] Running org.apache.poi.ss.formula.functions.TestPPMT
    [junit] Tests run: 1, Failures: 0, Errors: 0, Time elapsed: 0.011 sec
    [junit] Running org.apache.poi.ss.formula.functions.TestPmt
    [junit] Tests run: 2, Failures: 0, Errors: 0, Time elapsed: 0.07 sec
    [junit] Running org.apache.poi.ss.formula.functions.TestPoisson
    [junit] Tests run: 6, Failures: 0, Errors: 0, Time elapsed: 0.099 sec
    [junit] Running org.apache.poi.ss.formula.functions.TestQuotient
    [junit] Tests run: 2, Failures: 0, Errors: 0, Time elapsed: 0.092 sec
    [junit] Running org.apache.poi.ss.formula.functions.TestQuotientFunctionsFromSpreadsheet
    [junit] Tests run: 1, Failures: 0, Errors: 0, Time elapsed: 0.012 sec
    [junit] Running org.apache.poi.ss.formula.functions.TestRank
    [junit] Tests run: 1, Failures: 0, Errors: 0, Time elapsed: 0.015 sec
    [junit] Running org.apache.poi.ss.formula.functions.TestReptFunctionsFromSpreadsheet
    [junit] Tests run: 1, Failures: 0, Errors: 0, Time elapsed: 0.071 sec
    [junit] Running org.apache.poi.ss.formula.functions.TestRomanFunctionsFromSpreadsheet
    [junit] Tests run: 1, Failures: 0, Errors: 0, Time elapsed: 0.015 sec
    [junit] Running org.apache.poi.ss.formula.functions.TestRoundFuncs
    [junit] Tests run: 2, Failures: 0, Errors: 0, Time elapsed: 0.072 sec
    [junit] Running org.apache.poi.ss.formula.functions.TestRowCol
    [junit] Tests run: 4, Failures: 0, Errors: 0, Time elapsed: 0.087 sec
    [junit] Running org.apache.poi.ss.formula.functions.TestSlope
    [junit] Tests run: 3, Failures: 0, Errors: 0, Time elapsed: 0.093 sec
    [junit] Running org.apache.poi.ss.formula.functions.TestStatsLib
    [junit] Tests run: 9, Failures: 0, Errors: 0, Time elapsed: 0.19 sec
    [junit] Running org.apache.poi.ss.formula.functions.TestSubtotal
    [junit] Tests run: 10, Failures: 0, Errors: 0, Time elapsed: 0.195 sec
    [junit] Running org.apache.poi.ss.formula.functions.TestSumif
    [junit] Tests run: 2, Failures: 0, Errors: 0, Time elapsed: 0.098 sec
    [junit] Running org.apache.poi.ss.formula.functions.TestSumifs
    [junit] Tests run: 4, Failures: 0, Errors: 0, Time elapsed: 0.079 sec
    [junit] Running org.apache.poi.ss.formula.functions.TestSumproduct
    [junit] Tests run: 5, Failures: 0, Errors: 0, Time elapsed: 0.188 sec
    [junit] Running org.apache.poi.ss.formula.functions.TestTFunc
    [junit] Tests run: 5, Failures: 0, Errors: 0, Time elapsed: 0.091 sec
    [junit] Running org.apache.poi.ss.formula.functions.TestText
    [junit] Tests run: 4, Failures: 0, Errors: 0, Time elapsed: 0.097 sec
    [junit] Running org.apache.poi.ss.formula.functions.TestTime
    [junit] Tests run: 2, Failures: 0, Errors: 0, Time elapsed: 0.096 sec
    [junit] Running org.apache.poi.ss.formula.functions.TestTrim
    [junit] Tests run: 3, Failures: 0, Errors: 0, Time elapsed: 0.086 sec
    [junit] Running org.apache.poi.ss.formula.functions.TestTrunc
    [junit] Tests run: 5, Failures: 0, Errors: 0, Time elapsed: 0.097 sec
    [junit] Running org.apache.poi.ss.formula.functions.TestValue
    [junit] Tests run: 2, Failures: 0, Errors: 0, Time elapsed: 0.079 sec
    [junit] Running org.apache.poi.ss.formula.functions.TestWeekNumFunctionsFromSpreadsheet
    [junit] Tests run: 1, Failures: 0, Errors: 0, Time elapsed: 0.012 sec
    [junit] Running org.apache.poi.ss.formula.functions.TestWeekNumFunctionsFromSpreadsheet2013
    [junit] Tests run: 1, Failures: 0, Errors: 0, Time elapsed: 0.012 sec
    [junit] Running org.apache.poi.ss.formula.functions.TestXYNumericFunction
    [junit] Tests run: 3, Failures: 0, Errors: 0, Time elapsed: 0.075 sec
    [junit] Running org.apache.poi.ss.formula.ptg.TestArea3DPtg
    [junit] Tests run: 1, Failures: 0, Errors: 0, Time elapsed: 0.011 sec
    [junit] Running org.apache.poi.ss.formula.ptg.TestAreaErrPtg
    [junit] Tests run: 1, Failures: 0, Errors: 0, Time elapsed: 0.01 sec
    [junit] Running org.apache.poi.ss.formula.ptg.TestAreaPtg
    [junit] Tests run: 3, Failures: 0, Errors: 0, Time elapsed: 0.08 sec
    [junit] Running org.apache.poi.ss.formula.ptg.TestArrayPtg
    [junit] Tests run: 5, Failures: 0, Errors: 0, Time elapsed: 0.095 sec
    [junit] Running org.apache.poi.ss.formula.ptg.TestAttrPtg
    [junit] Tests run: 1, Failures: 0, Errors: 0, Time elapsed: 0.009 sec
    [junit] Running org.apache.poi.ss.formula.ptg.TestErrPtg
    [junit] Tests run: 1, Failures: 0, Errors: 0, Time elapsed: 0.01 sec
    [junit] Running org.apache.poi.ss.formula.ptg.TestExternalFunctionFormulas
    [junit] Tests run: 3, Failures: 0, Errors: 0, Time elapsed: 0.014 sec
    [junit] Running org.apache.poi.ss.formula.ptg.TestExternalNameReference
    [junit] Tests run: 3, Failures: 0, Errors: 0, Time elapsed: 0.014 sec
    [junit] Running org.apache.poi.ss.formula.ptg.TestFuncPtg
    [junit] Tests run: 2, Failures: 0, Errors: 0, Time elapsed: 0.01 sec
    [junit] Running org.apache.poi.ss.formula.ptg.TestFuncVarPtg
    [junit] Tests run: 1, Failures: 0, Errors: 0, Time elapsed: 0.074 sec
    [junit] Running org.apache.poi.ss.formula.ptg.TestIntersectionPtg
    [junit] Tests run: 1, Failures: 0, Errors: 0, Time elapsed: 0.01 sec
    [junit] Running org.apache.poi.ss.formula.ptg.TestPercentPtg
    [junit] Tests run: 1, Failures: 0, Errors: 0, Time elapsed: 0.068 sec
    [junit] Running org.apache.poi.ss.formula.ptg.TestRangePtg
    [junit] Tests run: 1, Failures: 0, Errors: 0, Time elapsed: 0.011 sec
    [junit] Running org.apache.poi.ss.formula.ptg.TestRef3DPtg
    [junit] Tests run: 1, Failures: 0, Errors: 0, Time elapsed: 0.072 sec
    [junit] Running org.apache.poi.ss.formula.ptg.TestReferencePtg
    [junit] Tests run: 4, Failures: 0, Errors: 0, Time elapsed: 0.091 sec
    [junit] Running org.apache.poi.ss.formula.ptg.TestUnionPtg
    [junit] Tests run: 1, Failures: 0, Errors: 0, Time elapsed: 0.009 sec
    [junit] Running org.apache.poi.ss.usermodel.TestDataFormatter
    [junit] Tests run: 19, Failures: 0, Errors: 0, Time elapsed: 0.482 sec
    [junit] Running org.apache.poi.ss.usermodel.TestFractionFormat
    [junit] Tests run: 2, Failures: 0, Errors: 0, Time elapsed: 0.602 sec
    [junit] Running org.apache.poi.ss.usermodel.charts.TestDataSources
    [junit] Tests run: 6, Failures: 0, Errors: 0, Time elapsed: 0.125 sec
    [junit] Running org.apache.poi.ss.util.TestCellRangeAddress
    [junit] Tests run: 2, Failures: 0, Errors: 0, Time elapsed: 0.089 sec
    [junit] Running org.apache.poi.ss.util.TestCellReference
    [junit] Tests run: 6, Failures: 0, Errors: 0, Time elapsed: 0.095 sec
    [junit] Running org.apache.poi.ss.util.TestDateFormatConverter
    [junit] Open C:\Users\hudson\AppData\Local\Temp\1\poifiles\LocaleDatesDefault1322732267.xlsx
in Excel
    [junit] Open C:\Users\hudson\AppData\Local\Temp\1\poifiles\LocaleDatesShort1449787544.xlsx
in Excel
    [junit] Open C:\Users\hudson\AppData\Local\Temp\1\poifiles\LocaleDatesMedium758857157.xlsx
in Excel
    [junit] Open C:\Users\hudson\AppData\Local\Temp\1\poifiles\LocaleDatesLong-499521124.xlsx
in Excel
    [junit] Open C:\Users\hudson\AppData\Local\Temp\1\poifiles\LocaleDatesFull1669820146.xlsx
in Excel
    [junit] Open C:\Users\hudson\AppData\Local\Temp\1\poifiles\LocaleDateTimesDefault1455741915.xlsx
in Excel
    [junit] Open C:\Users\hudson\AppData\Local\Temp\1\poifiles\LocaleDateTimesShort2047888381.xlsx
in Excel
    [junit] Open C:\Users\hudson\AppData\Local\Temp\1\poifiles\LocaleDateTimesMedium-711473406.xlsx
in Excel
    [junit] Open C:\Users\hudson\AppData\Local\Temp\1\poifiles\LocaleDateTimesLong797947310.xlsx
in Excel
    [junit] Open C:\Users\hudson\AppData\Local\Temp\1\poifiles\LocaleDateTimesFull-508918884.xlsx
in Excel
    [junit] Open C:\Users\hudson\AppData\Local\Temp\1\poifiles\LocaleTimesDefault-464420143.xlsx
in Excel
    [junit] Open C:\Users\hudson\AppData\Local\Temp\1\poifiles\LocaleTimesShort-1578207838.xlsx
in Excel
    [junit] Open C:\Users\hudson\AppData\Local\Temp\1\poifiles\LocaleTimesMedium189615632.xlsx
in Excel
    [junit] Open C:\Users\hudson\AppData\Local\Temp\1\poifiles\LocaleTimesLong-566950787.xlsx
in Excel
    [junit] Open C:\Users\hudson\AppData\Local\Temp\1\poifiles\LocaleTimesFull585240874.xlsx
in Excel
    [junit] Tests run: 1, Failures: 0, Errors: 0, Time elapsed: 1.368 sec
    [junit] Running org.apache.poi.ss.util.TestExpandedDouble
    [junit] Tests run: 3, Failures: 0, Errors: 0, Time elapsed: 0.039 sec
    [junit] Running org.apache.poi.ss.util.TestNumberComparer
    [junit] Tests run: 4, Failures: 0, Errors: 0, Time elapsed: 0.129 sec
    [junit] Running org.apache.poi.ss.util.TestNumberToTextConverter
    [junit] Tests run: 2, Failures: 0, Errors: 0, Time elapsed: 0.072 sec
    [junit] Running org.apache.poi.ss.util.TestRegion
    [junit] Tests run: 3, Failures: 0, Errors: 0, Time elapsed: 0.083 sec
    [junit] Running org.apache.poi.ss.util.TestSheetBuilder
    [junit] Tests run: 3, Failures: 0, Errors: 0, Time elapsed: 0.095 sec
    [junit] Running org.apache.poi.ss.util.TestWorkbookUtil
    [junit] Tests run: 1, Failures: 0, Errors: 0, Time elapsed: 0.01 sec
    [junit] Running org.apache.poi.ss.util.cellwalk.TestCellWalk
    [junit] Tests run: 1, Failures: 0, Errors: 0, Time elapsed: 0.067 sec
    [junit] Running org.apache.poi.util.TestArrayUtil
    [junit] Tests run: 2, Failures: 0, Errors: 0, Time elapsed: 0.009 sec
    [junit] Running org.apache.poi.util.TestBinaryTree
    [junit] Tests run: 20, Failures: 0, Errors: 0, Time elapsed: 0.723 sec
    [junit] Running org.apache.poi.util.TestBitField
    [junit] Tests run: 16, Failures: 0, Errors: 0, Time elapsed: 0.293 sec
    [junit] Running org.apache.poi.util.TestByteField
    [junit] Tests run: 5, Failures: 0, Errors: 0, Time elapsed: 0.083 sec
    [junit] Running org.apache.poi.util.TestHexDump
    [junit] Tests run: 2, Failures: 0, Errors: 0, Time elapsed: 0.012 sec
    [junit] Running org.apache.poi.util.TestIntList
    [junit] Tests run: 18, Failures: 0, Errors: 0, Time elapsed: 0.367 sec
    [junit] Running org.apache.poi.util.TestIntegerField
    [junit] Tests run: 5, Failures: 0, Errors: 0, Time elapsed: 0.11 sec
    [junit] Running org.apache.poi.util.TestLittleEndian
    [junit] Tests run: 14, Failures: 0, Errors: 0, Time elapsed: 0.268 sec
    [junit] Running org.apache.poi.util.TestLittleEndianStreams
    [junit] Tests run: 2, Failures: 0, Errors: 0, Time elapsed: 0.093 sec
    [junit] Running org.apache.poi.util.TestLongField
    [junit] Tests run: 5, Failures: 0, Errors: 0, Time elapsed: 0.09 sec
    [junit] Running org.apache.poi.util.TestPOILogFactory
    [junit] Tests run: 1, Failures: 0, Errors: 0, Time elapsed: 0.09 sec
    [junit] Running org.apache.poi.util.TestPOILogger
    [junit] Tests run: 1, Failures: 0, Errors: 0, Time elapsed: 0.009 sec
    [junit] Running org.apache.poi.util.TestShortField
    [junit] Tests run: 5, Failures: 0, Errors: 0, Time elapsed: 0.073 sec
    [junit] Running org.apache.poi.util.TestShortList
    [junit] Tests run: 18, Failures: 0, Errors: 0, Time elapsed: 0.289 sec
    [junit] Running org.apache.poi.util.TestStringUtil
    [junit] Tests run: 5, Failures: 0, Errors: 0, Time elapsed: 0.185 sec
    [junit] Running org.apache.poi.util.TestTempFile
    [junit] Tests run: 1, Failures: 0, Errors: 0, Time elapsed: 0.01 sec

-test-main-write-testfile:

-test-scratchpad-check:

test-scratchpad-download-resources:
    [mkdir] Created dir: <https://builds.apache.org/job/POI/ws/build\scratchpad-test-resources>

testexist:

downloadfile:
      [get] Getting: http://sourceforge.net/projects/monafont/files/monafont/monafont-2.90/monafont-ttf-2.90.zip/download
      [get] To: <https://builds.apache.org/job/POI/ws/build\scratchpad-test-resources\monafont-ttf-2.90.zip>
      [get] http://sourceforge.net/projects/monafont/files/monafont/monafont-2.90/monafont-ttf-2.90.zip/download
moved to http://downloads.sourceforge.net/project/monafont/monafont/monafont-2.90/monafont-ttf-2.90.zip?r=&ts=1393936879&use_mirror=tcpdiag
      [get] http://downloads.sourceforge.net/project/monafont/monafont/monafont-2.90/monafont-ttf-2.90.zip?r=&ts=1393936879&use_mirror=tcpdiag
moved to http://tcpdiag.dl.sourceforge.net/project/monafont/monafont/monafont-2.90/monafont-ttf-2.90.zip
    [unzip] Expanding: <https://builds.apache.org/job/POI/ws/build\scratchpad-test-resources\monafont-ttf-2.90.zip>
into <https://builds.apache.org/job/POI/ws/build\scratchpad-test-resources>

testexist:

downloadfile:
      [get] Getting: https://googlefontdirectory.googlecode.com/hg-history/c5955de4df3e40f6ab705bbccbd1f5ad93998287/cabin/Cabin-Regular.ttf
      [get] To: <https://builds.apache.org/job/POI/ws/build\scratchpad-test-resources\Cabin-Regular.ttf>
      [get] Error getting https://googlefontdirectory.googlecode.com/hg-history/c5955de4df3e40f6ab705bbccbd1f5ad93998287/cabin/Cabin-Regular.ttf
to <https://builds.apache.org/job/POI/ws/build\scratchpad-test-resources\Cabin-Regular.ttf>

BUILD FAILED
<https://builds.apache.org/job/POI/ws/build.xml>:1444: The following error occurred
while executing this line:
<https://builds.apache.org/job/POI/ws/build.xml>:338: java.io.IOException: Premature
EOF
	at sun.net.www.http.ChunkedInputStream.readAheadBlocking(ChunkedInputStream.java:538)
	at sun.net.www.http.ChunkedInputStream.readAhead(ChunkedInputStream.java:582)
	at sun.net.www.http.ChunkedInputStream.read(ChunkedInputStream.java:669)
	at java.io.FilterInputStream.read(FilterInputStream.java:116)
	at sun.net.www.protocol.http.HttpURLConnection$HttpInputStream.read(HttpURLConnection.java:2676)
	at sun.net.www.protocol.http.HttpURLConnection$HttpInputStream.read(HttpURLConnection.java:2671)
	at org.apache.tools.ant.taskdefs.Get$GetThread.downloadFile(Get.java:747)
	at org.apache.tools.ant.taskdefs.Get$GetThread.get(Get.java:588)
	at org.apache.tools.ant.taskdefs.Get$GetThread.run(Get.java:571)

Total time: 6 minutes 16 seconds
Build step 'Invoke Ant' marked build as failure
[WARNINGS] Skipping publisher since build result is FAILURE
Archiving artifacts
Recording test results

---------------------------------------------------------------------
To unsubscribe, e-mail: dev-unsubscribe@poi.apache.org
For additional commands, e-mail: dev-help@poi.apache.org


Mime
View raw message