poi-dev mailing list archives

Site index · List index
Message view « Date » · « Thread »
Top « Date » · « Thread »
From Glen Stampoultzis <gst...@iinet.net.au>
Subject Build failure
Date Thu, 11 Mar 2004 05:44:07 GMT

Ryan, you probably already know about this but I thought I'd post this for 
you anyway.

>Buildfile: build.xml
>
>clean:
>    [delete] Deleting directory /x1/home/glens/jakarta-poi/build
>
>-check-reports:
>
>reports:
>
>check-jars:
>
>fetch-jars:
>
>init:
>     [mkdir] Created dir: /x1/home/glens/jakarta-poi/build
>     [mkdir] Created dir: /x1/home/glens/jakarta-poi/build/classes
>     [mkdir] Created dir: /x1/home/glens/jakarta-poi/build/contrib-classes
>     [mkdir] Created dir: /x1/home/glens/jakarta-poi/build/scratchpad-classes
>     [mkdir] Created dir: /x1/home/glens/jakarta-poi/build/test-classes
>     [mkdir] Created dir: 
> /x1/home/glens/jakarta-poi/build/contrib-test-classes
>     [mkdir] Created dir: 
> /x1/home/glens/jakarta-poi/build/scratchpad-test-classes
>     [mkdir] Created dir: /x1/home/glens/jakarta-poi/build/test-results
>     [mkdir] Created dir: 
> /x1/home/glens/jakarta-poi/build/scratchpad-test-results
>     [mkdir] Created dir: 
> /x1/home/glens/jakarta-poi/build/contrib-test-results
>     [mkdir] Created dir: 
> /x1/home/glens/jakarta-poi/build/tmp/site/build/site/junit
>     [mkdir] Created dir: 
> /x1/home/glens/jakarta-poi/build/tmp/site/build/site/jdepend
>     [mkdir] Created dir: 
> /x1/home/glens/jakarta-poi/build/tmp/site/src/documentation/content/jdepend
>     [mkdir] Created dir: 
> /x1/home/glens/jakarta-poi/build/tmp/site/build/site/apidocs
>     [mkdir] Created dir: /x1/home/glens/jakarta-poi/build/dist
>      [copy] Copying 221 files to 
> /x1/home/glens/jakarta-poi/build/tmp/site/src/documentation
>      [copy] Copying 1 file to /x1/home/glens/jakarta-poi/build/tmp/site
>
>compile-main:
>     [javac] Compiling 318 source files to 
> /x1/home/glens/jakarta-poi/build/classes
>     [javac] Note: Some input files use or override a deprecated API.
>     [javac] Note: Recompile with -deprecation for details.
>     [javac] Compiling 134 source files to 
> /x1/home/glens/jakarta-poi/build/test-classes
>     [javac] Note: 
> /x1/home/glens/jakarta-poi/src/testcases/org/apache/poi/hssf/record/TestRecordFactory.java

> uses or overrides a deprecated API.
>     [javac] Note: Recompile with -deprecation for details.
>
>-test-main-check:
>
>test-main:
>     [junit] Running org.apache.poi.hpsf.basic.TestBasic
>     [junit] Tests run: 5, Failures: 0, Errors: 0, Time elapsed: 1.683 sec
>     [junit] Running org.apache.poi.hpsf.basic.TestClassID
>     [junit] Tests run: 3, Failures: 0, Errors: 0, Time elapsed: 0.027 sec
>     [junit] Running org.apache.poi.hpsf.basic.TestEmptyProperties
>     [junit] Tests run: 3, Failures: 0, Errors: 0, Time elapsed: 0.162 sec
>     [junit] Running org.apache.poi.hpsf.basic.TestUnicode
>     [junit] Tests run: 1, Failures: 0, Errors: 0, Time elapsed: 0.2 sec
>     [junit] Running org.apache.poi.hpsf.basic.TestWrite
>     [junit] Tests run: 9, Failures: 0, Errors: 0, Time elapsed: 0.569 sec
>     [junit] Running org.apache.poi.hssf.eventmodel.TestEventRecordFactory
>     [junit] Tests run: 5, Failures: 0, Errors: 0, Time elapsed: 0.342 sec
>     [junit] Running org.apache.poi.hssf.eventmodel.TestModelFactory
>     [junit] Tests run: 2, Failures: 0, Errors: 0, Time elapsed: 0.507 sec
>     [junit] Running org.apache.poi.hssf.model.TestFormulaParser
>     [junit] class org.apache.poi.hssf.record.formula.StringPtg
>     [junit] class org.apache.poi.hssf.record.formula.StringPtg
>     [junit] <FunctionVarPtg>
>     [junit]    field_1_num_args=2
>     [junit]       name         =HYPERLINK
>     [junit]    field_2_fnc_index=359
>     [junit] </FunctionPtg>
>     [junit] Tests run: 22, Failures: 0, Errors: 0, Time elapsed: 0.611 sec
>     [junit] Running 
> org.apache.poi.hssf.record.aggregates.TestFormulaRecordAggregate
>     [junit] Tests run: 1, Failures: 0, Errors: 0, Time elapsed: 0.04 sec
>     [junit] Running 
> org.apache.poi.hssf.record.aggregates.TestRowRecordsAggregate
>     [junit] Tests run: 1, Failures: 0, Errors: 0, Time elapsed: 0.02 sec
>     [junit] Running 
> org.apache.poi.hssf.record.aggregates.TestValueRecordsAggregate
>     [junit] Tests run: 1, Failures: 1, Errors: 0, Time elapsed: 0.07 sec
>     [junit] TEST 
> org.apache.poi.hssf.record.aggregates.TestValueRecordsAggregate FAILED
>     [junit] Running org.apache.poi.hssf.record.TestAreaFormatRecord
>     [junit] Tests run: 2, Failures: 0, Errors: 0, Time elapsed: 0.04 sec
>     [junit] Running org.apache.poi.hssf.record.TestAreaRecord
>     [junit] Tests run: 2, Failures: 0, Errors: 0, Time elapsed: 0.022 sec
>     [junit] Running org.apache.poi.hssf.record.TestAxisLineFormatRecord
>     [junit] Tests run: 2, Failures: 0, Errors: 0, Time elapsed: 0.024 sec
>     [junit] Running org.apache.poi.hssf.record.TestAxisOptionsRecord
>     [junit] Tests run: 2, Failures: 0, Errors: 0, Time elapsed: 0.022 sec
>     [junit] Running org.apache.poi.hssf.record.TestAxisParentRecord
>     [junit] Tests run: 2, Failures: 0, Errors: 0, Time elapsed: 0.021 sec
>     [junit] Running org.apache.poi.hssf.record.TestAxisRecord
>     [junit] Tests run: 2, Failures: 0, Errors: 0, Time elapsed: 0.019 sec
>     [junit] Running org.apache.poi.hssf.record.TestAxisUsedRecord
>     [junit] Tests run: 2, Failures: 0, Errors: 0, Time elapsed: 0.022 sec
>     [junit] Running org.apache.poi.hssf.record.TestBarRecord
>     [junit] Tests run: 2, Failures: 0, Errors: 0, Time elapsed: 0.025 sec
>     [junit] Running org.apache.poi.hssf.record.TestBoundSheetRecord
>     [junit] Tests run: 3, Failures: 0, Errors: 0, Time elapsed: 0.018 sec
>     [junit] Running org.apache.poi.hssf.record.TestCategorySeriesAxisRecord
>     [junit] Tests run: 2, Failures: 0, Errors: 0, Time elapsed: 0.02 sec
>     [junit] Running org.apache.poi.hssf.record.TestChartRecord
>     [junit] Tests run: 2, Failures: 0, Errors: 0, Time elapsed: 0.018 sec
>     [junit] Running org.apache.poi.hssf.record.TestDatRecord
>     [junit] Tests run: 2, Failures: 0, Errors: 0, Time elapsed: 0.028 sec
>     [junit] Running org.apache.poi.hssf.record.TestDataFormatRecord
>     [junit] Tests run: 2, Failures: 0, Errors: 0, Time elapsed: 0.025 sec
>     [junit] Running 
> org.apache.poi.hssf.record.TestDefaultDataLabelTextPropertiesRecord
>     [junit] Tests run: 2, Failures: 0, Errors: 0, Time elapsed: 0.025 sec
>     [junit] Running org.apache.poi.hssf.record.TestFontBasisRecord
>     [junit] Tests run: 2, Failures: 0, Errors: 0, Time elapsed: 0.026 sec
>     [junit] Running org.apache.poi.hssf.record.TestFontIndexRecord
>     [junit] Tests run: 2, Failures: 0, Errors: 0, Time elapsed: 0.027 sec
>     [junit] Running org.apache.poi.hssf.record.TestFormulaRecord
>     [junit] Tests run: 3, Failures: 0, Errors: 0, Time elapsed: 0.111 sec
>     [junit] Running org.apache.poi.hssf.record.TestFrameRecord
>     [junit] Tests run: 2, Failures: 0, Errors: 0, Time elapsed: 0.022 sec
>     [junit] Running org.apache.poi.hssf.record.TestLegendRecord
>     [junit] Tests run: 2, Failures: 0, Errors: 0, Time elapsed: 0.021 sec
>     [junit] Running org.apache.poi.hssf.record.TestLineFormatRecord
>     [junit] Tests run: 2, Failures: 0, Errors: 0, Time elapsed: 0.021 sec
>     [junit] Running org.apache.poi.hssf.record.TestLinkedDataRecord
>     [junit] Tests run: 2, Failures: 0, Errors: 0, Time elapsed: 0.082 sec
>     [junit] Running org.apache.poi.hssf.record.TestMergeCellsRecord
>     [junit] Tests run: 1, Failures: 0, Errors: 0, Time elapsed: 0.018 sec
>     [junit] Running org.apache.poi.hssf.record.TestNameRecord
>     [junit] Tests run: 1, Failures: 0, Errors: 0, Time elapsed: 0.084 sec
>     [junit] Running org.apache.poi.hssf.record.TestNumberFormatIndexRecord
>     [junit] Tests run: 2, Failures: 0, Errors: 0, Time elapsed: 0.023 sec
>     [junit] Running org.apache.poi.hssf.record.TestObjectLinkRecord
>     [junit] Tests run: 2, Failures: 0, Errors: 0, Time elapsed: 0.022 sec
>     [junit] Running org.apache.poi.hssf.record.TestPaletteRecord
>     [junit] Tests run: 1, Failures: 0, Errors: 0, Time elapsed: 0.093 sec
>     [junit] Running org.apache.poi.hssf.record.TestPaneRecord
>     [junit] Tests run: 2, Failures: 0, Errors: 0, Time elapsed: 0.02 sec
>     [junit] Running org.apache.poi.hssf.record.TestPlotAreaRecord
>     [junit] Tests run: 2, Failures: 0, Errors: 0, Time elapsed: 0.029 sec
>     [junit] Running org.apache.poi.hssf.record.TestPlotGrowthRecord
>     [junit] Tests run: 2, Failures: 0, Errors: 0, Time elapsed: 0.026 sec
>     [junit] Running org.apache.poi.hssf.record.TestRecordFactory
>     [junit] Tests run: 3, Failures: 0, Errors: 0, Time elapsed: 0.277 sec
>     [junit] Running org.apache.poi.hssf.record.TestSCLRecord
>     [junit] Tests run: 2, Failures: 0, Errors: 0, Time elapsed: 0.022 sec
>     [junit] Running org.apache.poi.hssf.record.TestSSTDeserializer
>     [junit] Tests run: 4, Failures: 0, Errors: 0, Time elapsed: 0.2 sec
>     [junit] Running org.apache.poi.hssf.record.TestSSTRecord
>     [junit] Tests run: 7, Failures: 0, Errors: 0, Time elapsed: 14.009 sec
>     [junit] Running org.apache.poi.hssf.record.TestSSTRecordSizeCalculator
>     [junit] Tests run: 6, Failures: 0, Errors: 0, Time elapsed: 0.035 sec
>     [junit] Running 
> org.apache.poi.hssf.record.TestSeriesChartGroupIndexRecord
>     [junit] Tests run: 2, Failures: 0, Errors: 0, Time elapsed: 0.018 sec
>     [junit] Running org.apache.poi.hssf.record.TestSeriesIndexRecord
>     [junit] Tests run: 2, Failures: 0, Errors: 0, Time elapsed: 0.016 sec
>     [junit] Running org.apache.poi.hssf.record.TestSeriesLabelsRecord
>     [junit] Tests run: 2, Failures: 0, Errors: 0, Time elapsed: 0.024 sec
>     [junit] Running org.apache.poi.hssf.record.TestSeriesListRecord
>     [junit] Tests run: 2, Failures: 0, Errors: 0, Time elapsed: 0.018 sec
>     [junit] Running org.apache.poi.hssf.record.TestSeriesRecord
>     [junit] Tests run: 2, Failures: 0, Errors: 0, Time elapsed: 0.029 sec
>     [junit] Running org.apache.poi.hssf.record.TestSeriesTextRecord
>     [junit] Tests run: 2, Failures: 0, Errors: 0, Time elapsed: 0.032 sec
>     [junit] Running org.apache.poi.hssf.record.TestSeriesToChartGroupRecord
>     [junit] Tests run: 2, Failures: 0, Errors: 0, Time elapsed: 0.016 sec
>     [junit] Running org.apache.poi.hssf.record.TestSheetPropertiesRecord
>     [junit] Tests run: 2, Failures: 0, Errors: 0, Time elapsed: 0.021 sec
>     [junit] Running org.apache.poi.hssf.record.TestStringRecord
>     [junit] Tests run: 2, Failures: 0, Errors: 0, Time elapsed: 0.029 sec
>     [junit] Running org.apache.poi.hssf.record.TestSupBookRecord
>     [junit] Tests run: 2, Failures: 0, Errors: 0, Time elapsed: 0.015 sec
>     [junit] Running org.apache.poi.hssf.record.TestTextRecord
>     [junit] Tests run: 2, Failures: 0, Errors: 0, Time elapsed: 0.03 sec
>     [junit] Running org.apache.poi.hssf.record.TestTickRecord
>     [junit] Tests run: 2, Failures: 0, Errors: 0, Time elapsed: 0.021 sec
>     [junit] Running org.apache.poi.hssf.record.TestUnitsRecord
>     [junit] Tests run: 2, Failures: 0, Errors: 0, Time elapsed: 0.021 sec
>     [junit] Running org.apache.poi.hssf.record.TestValueRangeRecord
>     [junit] Tests run: 2, Failures: 0, Errors: 0, Time elapsed: 0.037 sec
>     [junit] Running org.apache.poi.hssf.record.formula.TestFuncPtg
>     [junit] Tests run: 1, Failures: 0, Errors: 0, Time elapsed: 0.139 sec
>     [junit] Running org.apache.poi.hssf.usermodel.TestBugs
>     [junit] [WARNING] Unknown Ptg 2a (42) at cell (0,4)
>     [junit] [WARNING] Unknown Ptg 2a (42) at cell (0,7)
>     [junit] [WARNING] Unknown Ptg 2a (42) at cell (0,8)
>     [junit] [WARNING] Unknown Ptg 2a (42) at cell (0,12)
>     [junit] [WARNING] Unknown Ptg 2a (42) at cell (1,4)
>     [junit] [WARNING] Unknown Ptg 2a (42) at cell (1,8)
>     [junit] [WARNING] Unknown Ptg 2a (42) at cell (2,4)
>     [junit] [WARNING] Unknown Ptg 3c (60)
>     [junit] [WARNING] Unknown Ptg 3c (60)
>     [junit] [WARNING] Unknown Ptg 3c (60)
>     [junit] [WARNING] Unknown Ptg 3c (60)
>     [junit] [WARNING] Unknown Ptg 3c (60)
>     [junit] [WARNING] Unknown Ptg 3c (60)
>     [junit] [WARNING] Unknown Ptg 3c (60)
>     [junit] [WARNING] Unknown Ptg 3c (60)
>     [junit] [WARNING] Unknown Ptg 3c (60)
>     [junit] [WARNING] Unknown Ptg 3c (60)
>     [junit] [WARNING] Unknown Ptg 2a (42) at cell (0,4)
>     [junit] [WARNING] Unknown Ptg 2a (42) at cell (0,7)
>     [junit] [WARNING] Unknown Ptg 2a (42) at cell (0,8)
>     [junit] [WARNING] Unknown Ptg 2a (42) at cell (0,12)
>     [junit] [WARNING] Unknown Ptg 2a (42) at cell (1,4)
>     [junit] [WARNING] Unknown Ptg 2a (42) at cell (1,8)
>     [junit] [WARNING] Unknown Ptg 2a (42) at cell (2,4)
>     [junit] Tests run: 20, Failures: 1, Errors: 5, Time elapsed: 30.935 sec
>     [junit] TEST org.apache.poi.hssf.usermodel.TestBugs FAILED
>     [junit] Running org.apache.poi.hssf.usermodel.TestCellStyle
>     [junit] Tests run: 3, Failures: 0, Errors: 0, Time elapsed: 0.935 sec
>     [junit] Running org.apache.poi.hssf.usermodel.TestCloneSheet
>     [junit] Tests run: 1, Failures: 0, Errors: 0, Time elapsed: 0.239 sec
>     [junit] Running org.apache.poi.hssf.usermodel.TestFormulas
>     [junit] Tests run: 26, Failures: 2, Errors: 9, Time elapsed: 19.556 sec
>     [junit] TEST org.apache.poi.hssf.usermodel.TestFormulas FAILED
>     [junit] Running org.apache.poi.hssf.usermodel.TestHSSFCell
>     [junit] Tests run: 4, Failures: 3, Errors: 0, Time elapsed: 0.799 sec
>     [junit] TEST org.apache.poi.hssf.usermodel.TestHSSFCell FAILED
>     [junit] Running org.apache.poi.hssf.usermodel.TestHSSFDateUtil
>     [junit] Tests run: 1, Failures: 0, Errors: 0, Time elapsed: 0.039 sec
>     [junit] Running org.apache.poi.hssf.usermodel.TestHSSFHeaderFooter
>     [junit] Tests run: 2, Failures: 0, Errors: 0, Time elapsed: 0.668 sec
>     [junit] Running org.apache.poi.hssf.usermodel.TestHSSFPalette
>     [junit] Tests run: 3, Failures: 0, Errors: 0, Time elapsed: 0.591 sec
>     [junit] Running org.apache.poi.hssf.usermodel.TestHSSFRow
>     [junit] Tests run: 2, Failures: 2, Errors: 0, Time elapsed: 0.269 sec
>     [junit] TEST org.apache.poi.hssf.usermodel.TestHSSFRow FAILED
>     [junit] Running org.apache.poi.hssf.usermodel.TestHSSFSheet
>     [junit] Tests run: 12, Failures: 0, Errors: 5, Time elapsed: 0.384 sec
>     [junit] TEST org.apache.poi.hssf.usermodel.TestHSSFSheet FAILED
>     [junit] Running org.apache.poi.hssf.usermodel.TestHSSFSheetOrder
>     [junit] Tests run: 1, Failures: 0, Errors: 0, Time elapsed: 0.265 sec
>     [junit] Running org.apache.poi.hssf.usermodel.TestHSSFSheetSetOrder
>     [junit] Tests run: 1, Failures: 0, Errors: 0, Time elapsed: 0.243 sec
>     [junit] Running org.apache.poi.hssf.usermodel.TestNamedRange
>     [junit] Tests run: 12, Failures: 0, Errors: 4, Time elapsed: 1.109 sec
>     [junit] TEST org.apache.poi.hssf.usermodel.TestNamedRange FAILED
>     [junit] Running org.apache.poi.hssf.usermodel.TestReadWriteChart
>     [junit] Tests run: 1, Failures: 0, Errors: 0, Time elapsed: 0.505 sec
>     [junit] Running org.apache.poi.hssf.usermodel.TestSanityChecker
>     [junit] Tests run: 1, Failures: 0, Errors: 0, Time elapsed: 0.194 sec
>     [junit] Running org.apache.poi.hssf.usermodel.TestSheetShiftRows
>     [junit] Tests run: 3, Failures: 0, Errors: 3, Time elapsed: 0.476 sec
>     [junit] TEST org.apache.poi.hssf.usermodel.TestSheetShiftRows FAILED
>     [junit] Running org.apache.poi.hssf.usermodel.TestWorkbook
>     [junit] Tests run: 16, Failures: 2, Errors: 2, Time elapsed: 6.411 sec
>     [junit] TEST org.apache.poi.hssf.usermodel.TestWorkbook FAILED
>     [junit] Running org.apache.poi.hssf.util.TestAreaReference
>     [junit] Tests run: 2, Failures: 0, Errors: 0, Time elapsed: 0.015 sec
>     [junit] Running org.apache.poi.hssf.util.TestCellReference
>     [junit] Tests run: 8, Failures: 0, Errors: 0, Time elapsed: 0.014 sec
>     [junit] Running org.apache.poi.hssf.util.TestRKUtil
>     [junit] Tests run: 1, Failures: 0, Errors: 0, Time elapsed: 0.011 sec
>     [junit] Running org.apache.poi.hssf.util.TestRangeAddress
>     [junit] Tests run: 1, Failures: 0, Errors: 0, Time elapsed: 0.013 sec
>     [junit] Running org.apache.poi.hssf.util.TestSheetReferences
>     [junit] Tests run: 1, Failures: 0, Errors: 0, Time elapsed: 0.01 sec
>     [junit] Running 
> org.apache.poi.poifs.eventfilesystem.TestPOIFSReaderRegistry
>     [junit] Tests run: 2, Failures: 0, Errors: 0, Time elapsed: 0.022 sec
>     [junit] Running org.apache.poi.poifs.filesystem.TestDirectoryNode
>     [junit] Tests run: 4, Failures: 0, Errors: 0, Time elapsed: 0.096 sec
>     [junit] Running org.apache.poi.poifs.filesystem.TestDocument
>     [junit] Tests run: 1, Failures: 0, Errors: 0, Time elapsed: 4.534 sec
>     [junit] Running org.apache.poi.poifs.filesystem.TestDocumentDescriptor
>     [junit] Tests run: 1, Failures: 0, Errors: 0, Time elapsed: 0.033 sec
>     [junit] Running org.apache.poi.poifs.filesystem.TestDocumentInputStream
>     [junit] Tests run: 7, Failures: 0, Errors: 0, Time elapsed: 8.2 sec
>     [junit] Running org.apache.poi.poifs.filesystem.TestDocumentNode
>     [junit] Tests run: 1, Failures: 0, Errors: 0, Time elapsed: 0.07 sec
>     [junit] Running org.apache.poi.poifs.filesystem.TestDocumentOutputStream
>     [junit] Tests run: 4, Failures: 0, Errors: 0, Time elapsed: 0.022 sec
>     [junit] Running org.apache.poi.poifs.filesystem.TestPOIFSDocumentPath
>     [junit] Tests run: 4, Failures: 0, Errors: 0, Time elapsed: 0.012 sec
>     [junit] Running org.apache.poi.poifs.property.TestDirectoryProperty
>     [junit] Tests run: 6, Failures: 0, Errors: 0, Time elapsed: 0.226 sec
>     [junit] Running org.apache.poi.poifs.property.TestDocumentProperty
>     [junit] Tests run: 2, Failures: 0, Errors: 0, Time elapsed: 0.032 sec
>     [junit] Running org.apache.poi.poifs.property.TestPropertyFactory
>     [junit] Tests run: 1, Failures: 0, Errors: 0, Time elapsed: 0.051 sec
>     [junit] Running org.apache.poi.poifs.property.TestPropertyTable
>     [junit] Tests run: 2, Failures: 0, Errors: 0, Time elapsed: 0.08 sec
>     [junit] Running org.apache.poi.poifs.property.TestRootProperty
>     [junit] Tests run: 3, Failures: 0, Errors: 0, Time elapsed: 0.051 sec
>     [junit] Running org.apache.poi.poifs.storage.TestBATBlock
>     [junit] Tests run: 6, Failures: 0, Errors: 0, Time elapsed: 0.046 sec
>     [junit] Running 
> org.apache.poi.poifs.storage.TestBlockAllocationTableReader
>     [junit] Tests run: 3, Failures: 0, Errors: 0, Time elapsed: 0.214 sec
>     [junit] Running 
> org.apache.poi.poifs.storage.TestBlockAllocationTableWriter
>     [junit] Tests run: 3, Failures: 0, Errors: 0, Time elapsed: 0.071 sec
>     [junit] Running org.apache.poi.poifs.storage.TestBlockListImpl
>     [junit] Tests run: 4, Failures: 0, Errors: 0, Time elapsed: 0.052 sec
>     [junit] Running org.apache.poi.poifs.storage.TestDocumentBlock
>     [junit] Tests run: 3, Failures: 0, Errors: 0, Time elapsed: 0.486 sec
>     [junit] Running org.apache.poi.poifs.storage.TestHeaderBlockReader
>     [junit] Tests run: 1, Failures: 0, Errors: 0, Time elapsed: 0.026 sec
>     [junit] Running org.apache.poi.poifs.storage.TestHeaderBlockWriter
>     [junit] Tests run: 4, Failures: 0, Errors: 0, Time elapsed: 0.046 sec
>     [junit] Running org.apache.poi.poifs.storage.TestPropertyBlock
>     [junit] Tests run: 1, Failures: 0, Errors: 0, Time elapsed: 0.05 sec
>     [junit] Running org.apache.poi.poifs.storage.TestRawDataBlock
>     [junit] Tests run: 3, Failures: 0, Errors: 0, Time elapsed: 0.034 sec
>     [junit] Running org.apache.poi.poifs.storage.TestRawDataBlockList
>     [junit] Tests run: 3, Failures: 0, Errors: 0, Time elapsed: 0.072 sec
>     [junit] Running org.apache.poi.poifs.storage.TestSmallDocumentBlock
>     [junit] Tests run: 6, Failures: 0, Errors: 0, Time elapsed: 0.688 sec
>     [junit] Running org.apache.poi.poifs.storage.TestSmallBlockTableReader
>     [junit] Tests run: 1, Failures: 0, Errors: 0, Time elapsed: 0.076 sec
>     [junit] Running org.apache.poi.poifs.storage.TestSmallBlockTableWriter
>     [junit] Tests run: 1, Failures: 0, Errors: 0, Time elapsed: 0.074 sec
>     [junit] Running org.apache.poi.poifs.storage.TestSmallDocumentBlockList
>     [junit] Tests run: 1, Failures: 0, Errors: 0, Time elapsed: 0.027 sec
>     [junit] Running org.apache.poi.util.TestBinaryTree
>     [junit] Tests run: 20, Failures: 0, Errors: 0, Time elapsed: 1.337 sec
>     [junit] Running org.apache.poi.util.TestBitField
>     [junit] Tests run: 15, Failures: 0, Errors: 0, Time elapsed: 0.012 sec
>     [junit] Running org.apache.poi.util.TestByteField
>     [junit] Tests run: 5, Failures: 0, Errors: 0, Time elapsed: 0.018 sec
>     [junit] Running org.apache.poi.util.TestHexDump
>     [junit] Tests run: 2, Failures: 1, Errors: 0, Time elapsed: 0.017 sec
>     [junit] TEST org.apache.poi.util.TestHexDump FAILED
>     [junit] Running org.apache.poi.util.TestIntList
>     [junit] Tests run: 18, Failures: 0, Errors: 0, Time elapsed: 0.067 sec
>     [junit] Running org.apache.poi.util.TestIntegerField
>     [junit] Tests run: 5, Failures: 0, Errors: 0, Time elapsed: 0.022 sec
>     [junit] Running org.apache.poi.util.TestLittleEndian
>     [junit] Tests run: 15, Failures: 0, Errors: 0, Time elapsed: 0.015 sec
>     [junit] Running org.apache.poi.util.TestLongField
>     [junit] Tests run: 5, Failures: 0, Errors: 0, Time elapsed: 0.017 sec
>     [junit] Running org.apache.poi.util.TestPOILogFactory
>     [junit] Tests run: 1, Failures: 0, Errors: 0, Time elapsed: 0.02 sec
>     [junit] Running org.apache.poi.util.TestPOILogger
>     [junit] Tests run: 1, Failures: 0, Errors: 0, Time elapsed: 0.019 sec
>     [junit] Running org.apache.poi.util.TestShortField
>     [junit] Tests run: 5, Failures: 0, Errors: 0, Time elapsed: 0.017 sec
>     [junit] Running org.apache.poi.util.TestShortList
>     [junit] Tests run: 18, Failures: 0, Errors: 0, Time elapsed: 0.087 sec
>     [junit] Running org.apache.poi.util.TestStringUtil
>     [junit] Tests run: 7, Failures: 0, Errors: 0, Time elapsed: 0.023 sec
>
>-test-main-write-testfile:
>
>compile-scratchpad:
>     [javac] Compiling 155 source files to 
> /x1/home/glens/jakarta-poi/build/scratchpad-classes
>     [javac] 
> /x1/home/glens/jakarta-poi/src/scratchpad/src/org/apache/poi/hwpf/HWPFTestCase.java:14:

> cannot resolve symbol
>     [javac] symbol  : class HWPFDocFixture
>     [javac] location: class org.apache.poi.hwpf.HWPFTestCase
>     [javac]   protected HWPFDocFixture _hWPFDocFixture;
>     [javac]             ^
>     [javac] 
> /x1/home/glens/jakarta-poi/src/scratchpad/src/org/apache/poi/hwpf/HWPFTestCase.java:25:

> cannot resolve symbol
>     [javac] symbol  : class HWPFDocFixture
>     [javac] location: class org.apache.poi.hwpf.HWPFTestCase
>     [javac]     _hWPFDocFixture = new HWPFDocFixture(this);
>     [javac]                           ^
>     [javac] 2 errors
>
>BUILD FAILED
>file:/x1/home/glens/jakarta-poi/build.xml:214: Compile failed; see the 
>compiler error output for details.
>
>Total time: 2 minutes 7 seconds
>Build result 256
>/home/glens/cron/build.rb:8: unhandled exception


Glen Stampoultzis
gstamp@iinet.net.au
http://members.iinet.net.au/~gstamp/glen/

Mime
  • Unnamed multipart/alternative (inline, None, 0 bytes)
View raw message