plc4x-dev mailing list archives

Site index · List index
Message view « Date » · « Thread »
Top « Date » · « Thread »
From Christofer Dutz <christofer.d...@c-ware.de>
Subject Re: Trouble building on OSX
Date Wed, 16 Jan 2019 20:18:34 GMT
Hi Justin,

I just installed the 3.3.9 version of Maven you told me you were using and the build worked
just fine. 
Also running all the tests, I didn't get any failures.

Also did I shut down my entire internet connection and re-ran the Modbus tests and they still
passed without errors.

Could you please re-run your build with the maven "-X" option?

Chris



Am 16.01.19, 20:57 schrieb "Justin Mclean" <justin@classsoftware.com>:

    Hi,
    
    Trying to build develop branch on OSX 10.14.1 Java 1.8.0_171-b11 Maven 3.3.9. I’m getting
a number of issues when trying to do this:
    
    "mvn compile" gives:
    [INFO] karaf-ads-feature .................................. FAILURE [  0.369 s]
    [ERROR] Failed to execute goal org.apache.karaf.tooling:karaf-maven-plugin:4.2.1:features-generate-descriptor
(generate-features-file) on project karaf-ads-feature: Unable to create features.xml file:
java.io.IOException: Is a directory -> [Help 1]
    
    mvn package
    
    [INFO] PLC4J: Driver: Modbus .............................. FAILURE [ 58.780 s]
    
    [ERROR] Tests run: 8, Failures: 0, Errors: 1, Skipped: 0, Time elapsed: 51.345 s <<<
FAILURE! - in org.apache.plc4x.java.modbus.ModbusPlcDriverTest
    [ERROR] getConnectionUnknownHost  Time elapsed: 32.044 s  <<< ERROR!
    java.lang.Exception: Unexpected exception, expected<org.apache.plc4x.java.api.exceptions.PlcConnectionException>
but was<io.netty.channel.ConnectTimeoutException>
    Caused by: io.netty.channel.ConnectTimeoutException: connection timed out: nowhere/92.242.140.2:8080
    
    Thanks,
    Justin
    
    

Mime
View raw message