plc4x-dev mailing list archives

Site index · List index
Message view « Date » · « Thread »
Top « Date » · « Thread »
From Justin Mclean <jus...@classsoftware.com>
Subject Trouble building on OSX
Date Wed, 16 Jan 2019 19:56:58 GMT
Hi,

Trying to build develop branch on OSX 10.14.1 Java 1.8.0_171-b11 Maven 3.3.9. I’m getting
a number of issues when trying to do this:

"mvn compile" gives:
[INFO] karaf-ads-feature .................................. FAILURE [  0.369 s]
[ERROR] Failed to execute goal org.apache.karaf.tooling:karaf-maven-plugin:4.2.1:features-generate-descriptor
(generate-features-file) on project karaf-ads-feature: Unable to create features.xml file:
java.io.IOException: Is a directory -> [Help 1]

mvn package

[INFO] PLC4J: Driver: Modbus .............................. FAILURE [ 58.780 s]

[ERROR] Tests run: 8, Failures: 0, Errors: 1, Skipped: 0, Time elapsed: 51.345 s <<<
FAILURE! - in org.apache.plc4x.java.modbus.ModbusPlcDriverTest
[ERROR] getConnectionUnknownHost  Time elapsed: 32.044 s  <<< ERROR!
java.lang.Exception: Unexpected exception, expected<org.apache.plc4x.java.api.exceptions.PlcConnectionException>
but was<io.netty.channel.ConnectTimeoutException>
Caused by: io.netty.channel.ConnectTimeoutException: connection timed out: nowhere/92.242.140.2:8080

Thanks,
Justin


Mime
View raw message