pirk-commits mailing list archives

Site index · List index
Message view « Date » · « Thread »
Top « Date » · « Thread »
From eawilli...@apache.org
Subject [09/26] incubator-pirk git commit: Jekyll build from gh-pages:e25c8a4
Date Tue, 12 Jul 2016 18:35:51 GMT
http://git-wip-us.apache.org/repos/asf/incubator-pirk/blob/fee5ae3f/target/generated-sources/annotations/org/openjdk/jmh/infra/generated/Blackhole_jmhType_B1.java
----------------------------------------------------------------------
diff --git a/target/generated-sources/annotations/org/openjdk/jmh/infra/generated/Blackhole_jmhType_B1.java b/target/generated-sources/annotations/org/openjdk/jmh/infra/generated/Blackhole_jmhType_B1.java
new file mode 100644
index 0000000..732c06c
--- /dev/null
+++ b/target/generated-sources/annotations/org/openjdk/jmh/infra/generated/Blackhole_jmhType_B1.java
@@ -0,0 +1,20 @@
+package org.openjdk.jmh.infra.generated;
+import org.openjdk.jmh.infra.Blackhole;
+public class Blackhole_jmhType_B1 extends org.openjdk.jmh.infra.Blackhole {
+    boolean p000, p001, p002, p003, p004, p005, p006, p007, p008, p009, p010, p011, p012, p013, p014, p015;
+    boolean p016, p017, p018, p019, p020, p021, p022, p023, p024, p025, p026, p027, p028, p029, p030, p031;
+    boolean p032, p033, p034, p035, p036, p037, p038, p039, p040, p041, p042, p043, p044, p045, p046, p047;
+    boolean p048, p049, p050, p051, p052, p053, p054, p055, p056, p057, p058, p059, p060, p061, p062, p063;
+    boolean p064, p065, p066, p067, p068, p069, p070, p071, p072, p073, p074, p075, p076, p077, p078, p079;
+    boolean p080, p081, p082, p083, p084, p085, p086, p087, p088, p089, p090, p091, p092, p093, p094, p095;
+    boolean p096, p097, p098, p099, p100, p101, p102, p103, p104, p105, p106, p107, p108, p109, p110, p111;
+    boolean p112, p113, p114, p115, p116, p117, p118, p119, p120, p121, p122, p123, p124, p125, p126, p127;
+    boolean p128, p129, p130, p131, p132, p133, p134, p135, p136, p137, p138, p139, p140, p141, p142, p143;
+    boolean p144, p145, p146, p147, p148, p149, p150, p151, p152, p153, p154, p155, p156, p157, p158, p159;
+    boolean p160, p161, p162, p163, p164, p165, p166, p167, p168, p169, p170, p171, p172, p173, p174, p175;
+    boolean p176, p177, p178, p179, p180, p181, p182, p183, p184, p185, p186, p187, p188, p189, p190, p191;
+    boolean p192, p193, p194, p195, p196, p197, p198, p199, p200, p201, p202, p203, p204, p205, p206, p207;
+    boolean p208, p209, p210, p211, p212, p213, p214, p215, p216, p217, p218, p219, p220, p221, p222, p223;
+    boolean p224, p225, p226, p227, p228, p229, p230, p231, p232, p233, p234, p235, p236, p237, p238, p239;
+    boolean p240, p241, p242, p243, p244, p245, p246, p247, p248, p249, p250, p251, p252, p253, p254, p255;
+}

http://git-wip-us.apache.org/repos/asf/incubator-pirk/blob/fee5ae3f/target/generated-sources/annotations/org/openjdk/jmh/infra/generated/Blackhole_jmhType_B2.java
----------------------------------------------------------------------
diff --git a/target/generated-sources/annotations/org/openjdk/jmh/infra/generated/Blackhole_jmhType_B2.java b/target/generated-sources/annotations/org/openjdk/jmh/infra/generated/Blackhole_jmhType_B2.java
new file mode 100644
index 0000000..0b74e0b
--- /dev/null
+++ b/target/generated-sources/annotations/org/openjdk/jmh/infra/generated/Blackhole_jmhType_B2.java
@@ -0,0 +1,19 @@
+package org.openjdk.jmh.infra.generated;
+import java.util.concurrent.atomic.AtomicIntegerFieldUpdater;
+public class Blackhole_jmhType_B2 extends Blackhole_jmhType_B1 {
+    public volatile int setupTrialMutex;
+    public volatile int tearTrialMutex;
+    public final static AtomicIntegerFieldUpdater<Blackhole_jmhType_B2> setupTrialMutexUpdater = AtomicIntegerFieldUpdater.newUpdater(Blackhole_jmhType_B2.class, "setupTrialMutex");
+    public final static AtomicIntegerFieldUpdater<Blackhole_jmhType_B2> tearTrialMutexUpdater = AtomicIntegerFieldUpdater.newUpdater(Blackhole_jmhType_B2.class, "tearTrialMutex");
+
+    public volatile int setupIterationMutex;
+    public volatile int tearIterationMutex;
+    public final static AtomicIntegerFieldUpdater<Blackhole_jmhType_B2> setupIterationMutexUpdater = AtomicIntegerFieldUpdater.newUpdater(Blackhole_jmhType_B2.class, "setupIterationMutex");
+    public final static AtomicIntegerFieldUpdater<Blackhole_jmhType_B2> tearIterationMutexUpdater = AtomicIntegerFieldUpdater.newUpdater(Blackhole_jmhType_B2.class, "tearIterationMutex");
+
+    public volatile int setupInvocationMutex;
+    public volatile int tearInvocationMutex;
+    public final static AtomicIntegerFieldUpdater<Blackhole_jmhType_B2> setupInvocationMutexUpdater = AtomicIntegerFieldUpdater.newUpdater(Blackhole_jmhType_B2.class, "setupInvocationMutex");
+    public final static AtomicIntegerFieldUpdater<Blackhole_jmhType_B2> tearInvocationMutexUpdater = AtomicIntegerFieldUpdater.newUpdater(Blackhole_jmhType_B2.class, "tearInvocationMutex");
+
+}

http://git-wip-us.apache.org/repos/asf/incubator-pirk/blob/fee5ae3f/target/generated-sources/annotations/org/openjdk/jmh/infra/generated/Blackhole_jmhType_B3.java
----------------------------------------------------------------------
diff --git a/target/generated-sources/annotations/org/openjdk/jmh/infra/generated/Blackhole_jmhType_B3.java b/target/generated-sources/annotations/org/openjdk/jmh/infra/generated/Blackhole_jmhType_B3.java
new file mode 100644
index 0000000..d2b3935
--- /dev/null
+++ b/target/generated-sources/annotations/org/openjdk/jmh/infra/generated/Blackhole_jmhType_B3.java
@@ -0,0 +1,20 @@
+package org.openjdk.jmh.infra.generated;
+public class Blackhole_jmhType_B3 extends Blackhole_jmhType_B2 {
+    boolean p000, p001, p002, p003, p004, p005, p006, p007, p008, p009, p010, p011, p012, p013, p014, p015;
+    boolean p016, p017, p018, p019, p020, p021, p022, p023, p024, p025, p026, p027, p028, p029, p030, p031;
+    boolean p032, p033, p034, p035, p036, p037, p038, p039, p040, p041, p042, p043, p044, p045, p046, p047;
+    boolean p048, p049, p050, p051, p052, p053, p054, p055, p056, p057, p058, p059, p060, p061, p062, p063;
+    boolean p064, p065, p066, p067, p068, p069, p070, p071, p072, p073, p074, p075, p076, p077, p078, p079;
+    boolean p080, p081, p082, p083, p084, p085, p086, p087, p088, p089, p090, p091, p092, p093, p094, p095;
+    boolean p096, p097, p098, p099, p100, p101, p102, p103, p104, p105, p106, p107, p108, p109, p110, p111;
+    boolean p112, p113, p114, p115, p116, p117, p118, p119, p120, p121, p122, p123, p124, p125, p126, p127;
+    boolean p128, p129, p130, p131, p132, p133, p134, p135, p136, p137, p138, p139, p140, p141, p142, p143;
+    boolean p144, p145, p146, p147, p148, p149, p150, p151, p152, p153, p154, p155, p156, p157, p158, p159;
+    boolean p160, p161, p162, p163, p164, p165, p166, p167, p168, p169, p170, p171, p172, p173, p174, p175;
+    boolean p176, p177, p178, p179, p180, p181, p182, p183, p184, p185, p186, p187, p188, p189, p190, p191;
+    boolean p192, p193, p194, p195, p196, p197, p198, p199, p200, p201, p202, p203, p204, p205, p206, p207;
+    boolean p208, p209, p210, p211, p212, p213, p214, p215, p216, p217, p218, p219, p220, p221, p222, p223;
+    boolean p224, p225, p226, p227, p228, p229, p230, p231, p232, p233, p234, p235, p236, p237, p238, p239;
+    boolean p240, p241, p242, p243, p244, p245, p246, p247, p248, p249, p250, p251, p252, p253, p254, p255;
+}
+

http://git-wip-us.apache.org/repos/asf/incubator-pirk/blob/fee5ae3f/target/maven-archiver/pom.properties
----------------------------------------------------------------------
diff --git a/target/maven-archiver/pom.properties b/target/maven-archiver/pom.properties
new file mode 100644
index 0000000..df22ad3
--- /dev/null
+++ b/target/maven-archiver/pom.properties
@@ -0,0 +1,5 @@
+#Generated by Maven
+#Tue Jul 12 12:01:49 EDT 2016
+version=0.0.1-SNAPSHOT
+groupId=org.apache.pirk
+artifactId=pirk

http://git-wip-us.apache.org/repos/asf/incubator-pirk/blob/fee5ae3f/target/maven-status/maven-compiler-plugin/compile/default-compile/createdFiles.lst
----------------------------------------------------------------------
diff --git a/target/maven-status/maven-compiler-plugin/compile/default-compile/createdFiles.lst b/target/maven-status/maven-compiler-plugin/compile/default-compile/createdFiles.lst
new file mode 100644
index 0000000..6c24c06
--- /dev/null
+++ b/target/maven-status/maven-compiler-plugin/compile/default-compile/createdFiles.lst
@@ -0,0 +1,106 @@
+org/apache/pirk/responder/wideskies/spark/EncRowCalcPrecomputedCache.class
+org/apache/pirk/utils/EpochDateParser.class
+org/apache/pirk/responder/wideskies/spark/FilterData.class
+org/apache/pirk/utils/FileIOUtils$2.class
+org/apache/pirk/responder/wideskies/spark/Accumulators.class
+org/apache/pirk/schema/query/filter/DataFilter.class
+org/apache/pirk/responder/wideskies/mapreduce/ColumnMultMapper.class
+org/apache/pirk/benchmark/generated/PaillierBenchmark_testWithoutGMP_jmhTest.class
+org/apache/pirk/utils/StringUtils.class
+org/apache/pirk/utils/FileConst.class
+org/apache/pirk/encryption/PrimeGenerator.class
+org/apache/pirk/utils/FileIOUtils$Callable.class
+org/apache/pirk/benchmark/PaillierBenchmark$PaillierBenchmarkState.class
+org/apache/pirk/responder/wideskies/spark/ComputeResponse.class
+org/apache/pirk/test/distributed/DistributedTestCLI.class
+org/apache/pirk/benchmark/generated/PaillierBenchmark_jmhType_B3.class
+org/apache/pirk/utils/FileIOUtils$1.class
+org/apache/pirk/responder/wideskies/spark/EncColMultReducer.class
+org/apache/pirk/responder/wideskies/spark/HashSelectorsAndPartitionData.class
+org/apache/pirk/utils/StopListUtils.class
+org/apache/pirk/schema/data/LoadDataSchemas.class
+org/apache/pirk/utils/CSVOutputUtils.class
+org/apache/pirk/utils/SystemConfiguration.class
+org/apache/pirk/querier/wideskies/decrypt/DecryptResponseRunnable.class
+org/apache/pirk/responder/wideskies/spark/BroadcastVars.class
+org/apache/pirk/querier/wideskies/QuerierDriverCLI.class
+org/apache/pirk/utils/PIRException.class
+org/apache/pirk/encryption/ModPowAbstraction.class
+org/apache/pirk/test/utils/TestUtils.class
+org/apache/pirk/query/wideskies/Query.class
+org/apache/pirk/responder/wideskies/spark/ExpTableGenerator.class
+org/openjdk/jmh/infra/generated/Blackhole_jmhType_B3.class
+org/apache/pirk/responder/wideskies/common/ComputeEncryptedRow$1.class
+org/apache/pirk/responder/wideskies/mapreduce/ExpTableReducer.class
+org/apache/pirk/test/distributed/testsuite/DistTestSuite.class
+org/apache/pirk/inputformat/hadoop/BaseInputFormat.class
+org/apache/pirk/responder/wideskies/mapreduce/FinalResponseReducer.class
+org/apache/pirk/utils/FileIOUtils.class
+org/apache/pirk/utils/KeyedHash.class
+org/apache/pirk/benchmark/generated/PaillierBenchmark_PaillierBenchmarkState_jmhType_B2.class
+org/apache/pirk/benchmark/generated/PaillierBenchmark_PaillierBenchmarkState_jmhType_B1.class
+org/apache/pirk/responder/wideskies/mapreduce/ColumnMultReducer.class
+org/apache/pirk/benchmark/generated/PaillierBenchmark_jmhType.class
+org/apache/pirk/inputformat/hadoop/json/JSONInputFormatBase.class
+org/apache/pirk/querier/wideskies/Querier.class
+org/apache/pirk/querier/wideskies/QuerierDriver.class
+org/apache/pirk/schema/query/filter/StopListFilter.class
+META-INF/BenchmarkList
+org/apache/pirk/benchmark/generated/PaillierBenchmark_testWithGMPConstantTime_jmhTest.class
+org/apache/pirk/schema/data/DataSchema.class
+org/apache/pirk/responder/wideskies/common/ComputeEncryptedRow.class
+org/apache/pirk/test/utils/Inputs.class
+org/apache/pirk/test/utils/StandaloneQuery.class
+org/apache/pirk/responder/wideskies/mapreduce/ComputeResponseTool.class
+org/apache/pirk/schema/query/QuerySchema.class
+org/apache/pirk/test/distributed/DistributedTestDriver.class
+org/apache/pirk/responder/wideskies/spark/EncColMultGroupedMapper.class
+org/apache/pirk/schema/data/partitioner/ISO8601DatePartitioner.class
+org/apache/pirk/querier/wideskies/encrypt/EncryptQuery.class
+org/apache/pirk/responder/wideskies/spark/ComputeExpLookupTable.class
+org/apache/pirk/inputformat/hadoop/json/JSONInputFormat.class
+org/apache/pirk/schema/data/partitioner/IPDataPartitioner.class
+org/apache/pirk/benchmark/BenchmarkDriver.class
+org/apache/pirk/query/wideskies/QueryUtils.class
+org/apache/pirk/inputformat/hadoop/BytesArrayWritable.class
+org/apache/pirk/responder/wideskies/spark/ExpKeyFilenameMap.class
+org/apache/pirk/utils/HDFS.class
+META-INF/CompilerHints
+org/apache/pirk/querier/wideskies/encrypt/ExpTableRunnable.class
+org/apache/pirk/responder/wideskies/ResponderCLI.class
+org/apache/pirk/schema/data/partitioner/PrimitiveTypePartitioner.class
+org/apache/pirk/benchmark/generated/PaillierBenchmark_jmhType_B2.class
+org/apache/pirk/responder/wideskies/common/HashSelectorAndPartitionData.class
+org/apache/pirk/benchmark/generated/PaillierBenchmark_jmhType_B1.class
+org/apache/pirk/inputformat/hadoop/InputFormatConst.class
+org/apache/pirk/inputformat/hadoop/json/JSONRecordReader.class
+org/openjdk/jmh/infra/generated/Blackhole_jmhType.class
+org/apache/pirk/utils/QueryParserUtils.class
+org/apache/pirk/schema/query/filter/FilterFactory.class
+org/apache/pirk/schema/data/partitioner/DataPartitioner.class
+org/openjdk/jmh/infra/generated/Blackhole_jmhType_B1.class
+org/apache/pirk/responder/wideskies/ResponderDriver.class
+org/apache/pirk/benchmark/generated/PaillierBenchmark_testWithGMP_jmhTest.class
+org/apache/pirk/responder/wideskies/mapreduce/MRStats.class
+org/apache/pirk/responder/wideskies/mapreduce/RowCalcReducer.class
+org/apache/pirk/schema/query/LoadQuerySchemas.class
+org/apache/pirk/benchmark/generated/PaillierBenchmark_PaillierBenchmarkState_jmhType_B3.class
+org/apache/pirk/encryption/Paillier.class
+org/apache/pirk/responder/wideskies/mapreduce/HashSelectorsAndPartitionDataMapper.class
+org/apache/pirk/schema/response/QueryResponseJSON.class
+org/apache/pirk/test/utils/BaseTests.class
+org/apache/pirk/querier/wideskies/encrypt/EncryptQueryRunnable.class
+org/apache/pirk/response/wideskies/Response.class
+org/apache/pirk/responder/wideskies/mapreduce/MRStats$Stats.class
+org/apache/pirk/responder/wideskies/standalone/Responder.class
+org/openjdk/jmh/infra/generated/Blackhole_jmhType_B2.class
+org/apache/pirk/utils/ISO8601DateParser.class
+org/apache/pirk/inputformat/hadoop/TextArrayWritable.class
+org/apache/pirk/query/wideskies/QueryInfo.class
+org/apache/pirk/utils/LogUtils.class
+org/apache/pirk/benchmark/generated/PaillierBenchmark_PaillierBenchmarkState_jmhType.class
+org/apache/pirk/querier/wideskies/decrypt/DecryptResponse.class
+org/apache/pirk/benchmark/PaillierBenchmark.class
+org/apache/pirk/querier/wideskies/QuerierConst.class
+org/apache/pirk/responder/wideskies/mapreduce/ExpTableMapper.class
+org/apache/pirk/responder/wideskies/spark/EncRowCalc.class

http://git-wip-us.apache.org/repos/asf/incubator-pirk/blob/fee5ae3f/target/maven-status/maven-compiler-plugin/compile/default-compile/inputFiles.lst
----------------------------------------------------------------------
diff --git a/target/maven-status/maven-compiler-plugin/compile/default-compile/inputFiles.lst b/target/maven-status/maven-compiler-plugin/compile/default-compile/inputFiles.lst
new file mode 100644
index 0000000..1e4766e
--- /dev/null
+++ b/target/maven-status/maven-compiler-plugin/compile/default-compile/inputFiles.lst
@@ -0,0 +1,83 @@
+/Users/voyager/apachePirk/incubator-pirk/src/main/java/org/apache/pirk/responder/wideskies/spark/ExpTableGenerator.java
+/Users/voyager/apachePirk/incubator-pirk/src/main/java/org/apache/pirk/querier/wideskies/decrypt/DecryptResponse.java
+/Users/voyager/apachePirk/incubator-pirk/src/main/java/org/apache/pirk/responder/wideskies/mapreduce/ColumnMultReducer.java
+/Users/voyager/apachePirk/incubator-pirk/src/main/java/org/apache/pirk/schema/data/partitioner/DataPartitioner.java
+/Users/voyager/apachePirk/incubator-pirk/src/main/java/org/apache/pirk/utils/HDFS.java
+/Users/voyager/apachePirk/incubator-pirk/src/main/java/org/apache/pirk/responder/wideskies/ResponderCLI.java
+/Users/voyager/apachePirk/incubator-pirk/src/main/java/org/apache/pirk/utils/EpochDateParser.java
+/Users/voyager/apachePirk/incubator-pirk/src/main/java/org/apache/pirk/querier/wideskies/QuerierDriver.java
+/Users/voyager/apachePirk/incubator-pirk/src/main/java/org/apache/pirk/schema/query/LoadQuerySchemas.java
+/Users/voyager/apachePirk/incubator-pirk/src/main/java/org/apache/pirk/utils/LogUtils.java
+/Users/voyager/apachePirk/incubator-pirk/src/main/java/org/apache/pirk/inputformat/hadoop/BytesArrayWritable.java
+/Users/voyager/apachePirk/incubator-pirk/src/main/java/org/apache/pirk/benchmark/BenchmarkDriver.java
+/Users/voyager/apachePirk/incubator-pirk/src/main/java/org/apache/pirk/utils/StringUtils.java
+/Users/voyager/apachePirk/incubator-pirk/src/main/java/org/apache/pirk/utils/QueryParserUtils.java
+/Users/voyager/apachePirk/incubator-pirk/src/main/java/org/apache/pirk/schema/data/partitioner/PrimitiveTypePartitioner.java
+/Users/voyager/apachePirk/incubator-pirk/src/main/java/org/apache/pirk/querier/wideskies/Querier.java
+/Users/voyager/apachePirk/incubator-pirk/src/main/java/org/apache/pirk/responder/wideskies/mapreduce/ComputeResponseTool.java
+/Users/voyager/apachePirk/incubator-pirk/src/main/java/org/apache/pirk/responder/wideskies/spark/HashSelectorsAndPartitionData.java
+/Users/voyager/apachePirk/incubator-pirk/src/main/java/org/apache/pirk/responder/wideskies/standalone/Responder.java
+/Users/voyager/apachePirk/incubator-pirk/src/main/java/org/apache/pirk/inputformat/hadoop/BaseInputFormat.java
+/Users/voyager/apachePirk/incubator-pirk/src/main/java/org/apache/pirk/utils/FileIOUtils.java
+/Users/voyager/apachePirk/incubator-pirk/src/main/java/org/apache/pirk/responder/wideskies/mapreduce/ExpTableMapper.java
+/Users/voyager/apachePirk/incubator-pirk/src/main/java/org/apache/pirk/utils/SystemConfiguration.java
+/Users/voyager/apachePirk/incubator-pirk/src/main/java/org/apache/pirk/test/distributed/testsuite/DistTestSuite.java
+/Users/voyager/apachePirk/incubator-pirk/src/main/java/org/apache/pirk/responder/wideskies/spark/EncColMultReducer.java
+/Users/voyager/apachePirk/incubator-pirk/src/main/java/org/apache/pirk/inputformat/hadoop/json/JSONInputFormat.java
+/Users/voyager/apachePirk/incubator-pirk/src/main/java/org/apache/pirk/responder/wideskies/spark/EncRowCalc.java
+/Users/voyager/apachePirk/incubator-pirk/src/main/java/org/apache/pirk/utils/PIRException.java
+/Users/voyager/apachePirk/incubator-pirk/src/main/java/org/apache/pirk/test/distributed/DistributedTestDriver.java
+/Users/voyager/apachePirk/incubator-pirk/src/main/java/org/apache/pirk/utils/FileConst.java
+/Users/voyager/apachePirk/incubator-pirk/src/main/java/org/apache/pirk/querier/wideskies/QuerierConst.java
+/Users/voyager/apachePirk/incubator-pirk/src/main/java/org/apache/pirk/inputformat/hadoop/TextArrayWritable.java
+/Users/voyager/apachePirk/incubator-pirk/src/main/java/org/apache/pirk/inputformat/hadoop/json/JSONInputFormatBase.java
+/Users/voyager/apachePirk/incubator-pirk/src/main/java/org/apache/pirk/response/wideskies/Response.java
+/Users/voyager/apachePirk/incubator-pirk/src/main/java/org/apache/pirk/schema/query/QuerySchema.java
+/Users/voyager/apachePirk/incubator-pirk/src/main/java/org/apache/pirk/schema/query/filter/StopListFilter.java
+/Users/voyager/apachePirk/incubator-pirk/src/main/java/org/apache/pirk/responder/wideskies/spark/FilterData.java
+/Users/voyager/apachePirk/incubator-pirk/src/main/java/org/apache/pirk/querier/wideskies/decrypt/DecryptResponseRunnable.java
+/Users/voyager/apachePirk/incubator-pirk/src/main/java/org/apache/pirk/encryption/Paillier.java
+/Users/voyager/apachePirk/incubator-pirk/src/main/java/org/apache/pirk/responder/wideskies/spark/ComputeResponse.java
+/Users/voyager/apachePirk/incubator-pirk/src/main/java/org/apache/pirk/encryption/PrimeGenerator.java
+/Users/voyager/apachePirk/incubator-pirk/src/main/java/org/apache/pirk/responder/wideskies/mapreduce/ColumnMultMapper.java
+/Users/voyager/apachePirk/incubator-pirk/src/main/java/org/apache/pirk/responder/wideskies/ResponderDriver.java
+/Users/voyager/apachePirk/incubator-pirk/src/main/java/org/apache/pirk/responder/wideskies/spark/EncRowCalcPrecomputedCache.java
+/Users/voyager/apachePirk/incubator-pirk/src/main/java/org/apache/pirk/schema/data/LoadDataSchemas.java
+/Users/voyager/apachePirk/incubator-pirk/src/main/java/org/apache/pirk/schema/data/DataSchema.java
+/Users/voyager/apachePirk/incubator-pirk/src/main/java/org/apache/pirk/utils/KeyedHash.java
+/Users/voyager/apachePirk/incubator-pirk/src/main/java/org/apache/pirk/schema/data/partitioner/IPDataPartitioner.java
+/Users/voyager/apachePirk/incubator-pirk/src/main/java/org/apache/pirk/query/wideskies/QueryInfo.java
+/Users/voyager/apachePirk/incubator-pirk/src/main/java/org/apache/pirk/responder/wideskies/spark/ExpKeyFilenameMap.java
+/Users/voyager/apachePirk/incubator-pirk/src/main/java/org/apache/pirk/encryption/ModPowAbstraction.java
+/Users/voyager/apachePirk/incubator-pirk/src/main/java/org/apache/pirk/utils/CSVOutputUtils.java
+/Users/voyager/apachePirk/incubator-pirk/src/main/java/org/apache/pirk/responder/wideskies/mapreduce/ExpTableReducer.java
+/Users/voyager/apachePirk/incubator-pirk/src/main/java/org/apache/pirk/test/utils/StandaloneQuery.java
+/Users/voyager/apachePirk/incubator-pirk/src/main/java/org/apache/pirk/responder/wideskies/mapreduce/HashSelectorsAndPartitionDataMapper.java
+/Users/voyager/apachePirk/incubator-pirk/src/main/java/org/apache/pirk/querier/wideskies/encrypt/EncryptQuery.java
+/Users/voyager/apachePirk/incubator-pirk/src/main/java/org/apache/pirk/query/wideskies/QueryUtils.java
+/Users/voyager/apachePirk/incubator-pirk/src/main/java/org/apache/pirk/inputformat/hadoop/InputFormatConst.java
+/Users/voyager/apachePirk/incubator-pirk/src/main/java/org/apache/pirk/test/distributed/DistributedTestCLI.java
+/Users/voyager/apachePirk/incubator-pirk/src/main/java/org/apache/pirk/responder/wideskies/common/ComputeEncryptedRow.java
+/Users/voyager/apachePirk/incubator-pirk/src/main/java/org/apache/pirk/test/utils/Inputs.java
+/Users/voyager/apachePirk/incubator-pirk/src/main/java/org/apache/pirk/responder/wideskies/spark/ComputeExpLookupTable.java
+/Users/voyager/apachePirk/incubator-pirk/src/main/java/org/apache/pirk/responder/wideskies/spark/EncColMultGroupedMapper.java
+/Users/voyager/apachePirk/incubator-pirk/src/main/java/org/apache/pirk/responder/wideskies/mapreduce/FinalResponseReducer.java
+/Users/voyager/apachePirk/incubator-pirk/src/main/java/org/apache/pirk/responder/wideskies/mapreduce/MRStats.java
+/Users/voyager/apachePirk/incubator-pirk/src/main/java/org/apache/pirk/responder/wideskies/mapreduce/RowCalcReducer.java
+/Users/voyager/apachePirk/incubator-pirk/src/main/java/org/apache/pirk/utils/ISO8601DateParser.java
+/Users/voyager/apachePirk/incubator-pirk/src/main/java/org/apache/pirk/querier/wideskies/encrypt/EncryptQueryRunnable.java
+/Users/voyager/apachePirk/incubator-pirk/src/main/java/org/apache/pirk/query/wideskies/Query.java
+/Users/voyager/apachePirk/incubator-pirk/src/main/java/org/apache/pirk/schema/query/filter/FilterFactory.java
+/Users/voyager/apachePirk/incubator-pirk/src/main/java/org/apache/pirk/schema/response/QueryResponseJSON.java
+/Users/voyager/apachePirk/incubator-pirk/src/main/java/org/apache/pirk/utils/StopListUtils.java
+/Users/voyager/apachePirk/incubator-pirk/src/main/java/org/apache/pirk/querier/wideskies/encrypt/ExpTableRunnable.java
+/Users/voyager/apachePirk/incubator-pirk/src/main/java/org/apache/pirk/schema/data/partitioner/ISO8601DatePartitioner.java
+/Users/voyager/apachePirk/incubator-pirk/src/main/java/org/apache/pirk/responder/wideskies/spark/BroadcastVars.java
+/Users/voyager/apachePirk/incubator-pirk/src/main/java/org/apache/pirk/benchmark/PaillierBenchmark.java
+/Users/voyager/apachePirk/incubator-pirk/src/main/java/org/apache/pirk/responder/wideskies/spark/Accumulators.java
+/Users/voyager/apachePirk/incubator-pirk/src/main/java/org/apache/pirk/inputformat/hadoop/json/JSONRecordReader.java
+/Users/voyager/apachePirk/incubator-pirk/src/main/java/org/apache/pirk/test/utils/BaseTests.java
+/Users/voyager/apachePirk/incubator-pirk/src/main/java/org/apache/pirk/test/utils/TestUtils.java
+/Users/voyager/apachePirk/incubator-pirk/src/main/java/org/apache/pirk/responder/wideskies/common/HashSelectorAndPartitionData.java
+/Users/voyager/apachePirk/incubator-pirk/src/main/java/org/apache/pirk/querier/wideskies/QuerierDriverCLI.java
+/Users/voyager/apachePirk/incubator-pirk/src/main/java/org/apache/pirk/schema/query/filter/DataFilter.java

http://git-wip-us.apache.org/repos/asf/incubator-pirk/blob/fee5ae3f/target/maven-status/maven-compiler-plugin/testCompile/default-testCompile/createdFiles.lst
----------------------------------------------------------------------
diff --git a/target/maven-status/maven-compiler-plugin/testCompile/default-testCompile/createdFiles.lst b/target/maven-status/maven-compiler-plugin/testCompile/default-testCompile/createdFiles.lst
new file mode 100644
index 0000000..4c12308
--- /dev/null
+++ b/target/maven-status/maven-compiler-plugin/testCompile/default-testCompile/createdFiles.lst
@@ -0,0 +1,9 @@
+test/schema/query/LoadQuerySchemaTest.class
+test/general/KeyedHashTest.class
+test/schema/data/LoadDataSchemaTest.class
+META-INF/BenchmarkList
+test/wideskies/standalone/StandaloneTest.class
+test/general/QueryParserUtilsTest.class
+META-INF/CompilerHints
+test/general/ISO8601DateParserTest.class
+test/general/PartitionUtilsTest.class

http://git-wip-us.apache.org/repos/asf/incubator-pirk/blob/fee5ae3f/target/maven-status/maven-compiler-plugin/testCompile/default-testCompile/inputFiles.lst
----------------------------------------------------------------------
diff --git a/target/maven-status/maven-compiler-plugin/testCompile/default-testCompile/inputFiles.lst b/target/maven-status/maven-compiler-plugin/testCompile/default-testCompile/inputFiles.lst
new file mode 100644
index 0000000..0206508
--- /dev/null
+++ b/target/maven-status/maven-compiler-plugin/testCompile/default-testCompile/inputFiles.lst
@@ -0,0 +1,8 @@
+/Users/voyager/apachePirk/incubator-pirk/src/test/java/test/general/ISO8601DateParserTest.java
+/Users/voyager/apachePirk/incubator-pirk/src/test/java/test/general/QueryParserUtilsTest.java
+/Users/voyager/apachePirk/incubator-pirk/src/test/java/test/general/PartitionUtilsTest.java
+/Users/voyager/apachePirk/incubator-pirk/src/test/java/test/schema/data/LoadDataSchemaTest.java
+/Users/voyager/apachePirk/incubator-pirk/src/test/java/test/general/PaillierTest.java
+/Users/voyager/apachePirk/incubator-pirk/src/test/java/test/general/KeyedHashTest.java
+/Users/voyager/apachePirk/incubator-pirk/src/test/java/test/schema/query/LoadQuerySchemaTest.java
+/Users/voyager/apachePirk/incubator-pirk/src/test/java/test/wideskies/standalone/StandaloneTest.java

http://git-wip-us.apache.org/repos/asf/incubator-pirk/blob/fee5ae3f/target/pirk-0.0.1-SNAPSHOT-exe.jar
----------------------------------------------------------------------
diff --git a/target/pirk-0.0.1-SNAPSHOT-exe.jar b/target/pirk-0.0.1-SNAPSHOT-exe.jar
new file mode 100644
index 0000000..ce5556e
Binary files /dev/null and b/target/pirk-0.0.1-SNAPSHOT-exe.jar differ

http://git-wip-us.apache.org/repos/asf/incubator-pirk/blob/fee5ae3f/target/pirk-0.0.1-SNAPSHOT.jar
----------------------------------------------------------------------
diff --git a/target/pirk-0.0.1-SNAPSHOT.jar b/target/pirk-0.0.1-SNAPSHOT.jar
new file mode 100644
index 0000000..d8a4fbf
Binary files /dev/null and b/target/pirk-0.0.1-SNAPSHOT.jar differ

http://git-wip-us.apache.org/repos/asf/incubator-pirk/blob/fee5ae3f/target/surefire-reports/TEST-test.general.ISO8601DateParserTest.xml
----------------------------------------------------------------------
diff --git a/target/surefire-reports/TEST-test.general.ISO8601DateParserTest.xml b/target/surefire-reports/TEST-test.general.ISO8601DateParserTest.xml
new file mode 100644
index 0000000..405d131
--- /dev/null
+++ b/target/surefire-reports/TEST-test.general.ISO8601DateParserTest.xml
@@ -0,0 +1,65 @@
+<?xml version="1.0" encoding="UTF-8"?>
+<testsuite name="test.general.ISO8601DateParserTest" time="0.015" tests="1" errors="0" skipped="0" failures="0">
+  <properties>
+    <property name="java.runtime.name" value="Java(TM) SE Runtime Environment"/>
+    <property name="sun.boot.library.path" value="/Library/Java/JavaVirtualMachines/jdk1.7.0_80.jdk/Contents/Home/jre/lib"/>
+    <property name="java.vm.version" value="24.80-b11"/>
+    <property name="gopherProxySet" value="false"/>
+    <property name="java.vm.vendor" value="Oracle Corporation"/>
+    <property name="maven.multiModuleProjectDirectory" value="/Users/voyager/apachePirk/incubator-pirk"/>
+    <property name="java.vendor.url" value="http://java.oracle.com/"/>
+    <property name="path.separator" value=":"/>
+    <property name="guice.disable.misplaced.annotation.check" value="true"/>
+    <property name="java.vm.name" value="Java HotSpot(TM) 64-Bit Server VM"/>
+    <property name="file.encoding.pkg" value="sun.io"/>
+    <property name="user.country" value="US"/>
+    <property name="sun.java.launcher" value="SUN_STANDARD"/>
+    <property name="sun.os.patch.level" value="unknown"/>
+    <property name="java.vm.specification.name" value="Java Virtual Machine Specification"/>
+    <property name="user.dir" value="/Users/voyager/apachePirk/incubator-pirk"/>
+    <property name="java.runtime.version" value="1.7.0_80-b15"/>
+    <property name="java.awt.graphicsenv" value="sun.awt.CGraphicsEnvironment"/>
+    <property name="java.endorsed.dirs" value="/Library/Java/JavaVirtualMachines/jdk1.7.0_80.jdk/Contents/Home/jre/lib/endorsed"/>
+    <property name="os.arch" value="x86_64"/>
+    <property name="java.io.tmpdir" value="/var/folders/83/07wq_8t55pn3mgj99512hb8c0000gn/T/"/>
+    <property name="line.separator" value="&#10;"/>
+    <property name="java.vm.specification.vendor" value="Oracle Corporation"/>
+    <property name="os.name" value="Mac OS X"/>
+    <property name="classworlds.conf" value="/usr/local/Cellar/maven/3.3.3/libexec/bin/m2.conf"/>
+    <property name="sun.jnu.encoding" value="UTF-8"/>
+    <property name="java.library.path" value="/Users/voyager/Library/Java/Extensions:/Library/Java/Extensions:/Network/Library/Java/Extensions:/System/Library/Java/Extensions:/usr/lib/java:."/>
+    <property name="java.specification.name" value="Java Platform API Specification"/>
+    <property name="java.class.version" value="51.0"/>
+    <property name="sun.management.compiler" value="HotSpot 64-Bit Tiered Compilers"/>
+    <property name="os.version" value="10.10.1"/>
+    <property name="http.nonProxyHosts" value="local|*.local|169.254/16|*.169.254/16"/>
+    <property name="user.home" value="/Users/voyager"/>
+    <property name="user.timezone" value="America/New_York"/>
+    <property name="java.awt.printerjob" value="sun.lwawt.macosx.CPrinterJob"/>
+    <property name="java.specification.version" value="1.7"/>
+    <property name="file.encoding" value="UTF-8"/>
+    <property name="user.name" value="voyager"/>
+    <property name="java.class.path" value="/usr/local/Cellar/maven/3.3.3/libexec/boot/plexus-classworlds-2.5.2.jar"/>
+    <property name="java.vm.specification.version" value="1.7"/>
+    <property name="sun.arch.data.model" value="64"/>
+    <property name="java.home" value="/Library/Java/JavaVirtualMachines/jdk1.7.0_80.jdk/Contents/Home/jre"/>
+    <property name="sun.java.command" value="org.codehaus.plexus.classworlds.launcher.Launcher package"/>
+    <property name="java.specification.vendor" value="Oracle Corporation"/>
+    <property name="user.language" value="en"/>
+    <property name="awt.toolkit" value="sun.lwawt.macosx.LWCToolkit"/>
+    <property name="java.vm.info" value="mixed mode"/>
+    <property name="java.version" value="1.7.0_80"/>
+    <property name="java.ext.dirs" value="/Users/voyager/Library/Java/Extensions:/Library/Java/JavaVirtualMachines/jdk1.7.0_80.jdk/Contents/Home/jre/lib/ext:/Library/Java/Extensions:/Network/Library/Java/Extensions:/System/Library/Java/Extensions:/usr/lib/java"/>
+    <property name="sun.boot.class.path" value="/Library/Java/JavaVirtualMachines/jdk1.7.0_80.jdk/Contents/Home/jre/lib/resources.jar:/Library/Java/JavaVirtualMachines/jdk1.7.0_80.jdk/Contents/Home/jre/lib/rt.jar:/Library/Java/JavaVirtualMachines/jdk1.7.0_80.jdk/Contents/Home/jre/lib/sunrsasign.jar:/Library/Java/JavaVirtualMachines/jdk1.7.0_80.jdk/Contents/Home/jre/lib/jsse.jar:/Library/Java/JavaVirtualMachines/jdk1.7.0_80.jdk/Contents/Home/jre/lib/jce.jar:/Library/Java/JavaVirtualMachines/jdk1.7.0_80.jdk/Contents/Home/jre/lib/charsets.jar:/Library/Java/JavaVirtualMachines/jdk1.7.0_80.jdk/Contents/Home/jre/lib/jfr.jar:/Library/Java/JavaVirtualMachines/jdk1.7.0_80.jdk/Contents/Home/jre/classes"/>
+    <property name="java.vendor" value="Oracle Corporation"/>
+    <property name="maven.home" value="/usr/local/Cellar/maven/3.3.3/libexec"/>
+    <property name="file.separator" value="/"/>
+    <property name="java.vendor.url.bug" value="http://bugreport.sun.com/bugreport/"/>
+    <property name="sun.cpu.endian" value="little"/>
+    <property name="sun.io.unicode.encoding" value="UnicodeBig"/>
+    <property name="socksNonProxyHosts" value="local|*.local|169.254/16|*.169.254/16"/>
+    <property name="ftp.nonProxyHosts" value="local|*.local|169.254/16|*.169.254/16"/>
+    <property name="sun.cpu.isalist" value=""/>
+  </properties>
+  <testcase name="testDateParsing" classname="test.general.ISO8601DateParserTest" time="0.015"/>
+</testsuite>
\ No newline at end of file

http://git-wip-us.apache.org/repos/asf/incubator-pirk/blob/fee5ae3f/target/surefire-reports/TEST-test.general.KeyedHashTest.xml
----------------------------------------------------------------------
diff --git a/target/surefire-reports/TEST-test.general.KeyedHashTest.xml b/target/surefire-reports/TEST-test.general.KeyedHashTest.xml
new file mode 100644
index 0000000..4d697e0
--- /dev/null
+++ b/target/surefire-reports/TEST-test.general.KeyedHashTest.xml
@@ -0,0 +1,66 @@
+<?xml version="1.0" encoding="UTF-8"?>
+<testsuite name="test.general.KeyedHashTest" time="0.088" tests="2" errors="0" skipped="0" failures="0">
+  <properties>
+    <property name="java.runtime.name" value="Java(TM) SE Runtime Environment"/>
+    <property name="sun.boot.library.path" value="/Library/Java/JavaVirtualMachines/jdk1.7.0_80.jdk/Contents/Home/jre/lib"/>
+    <property name="java.vm.version" value="24.80-b11"/>
+    <property name="gopherProxySet" value="false"/>
+    <property name="java.vm.vendor" value="Oracle Corporation"/>
+    <property name="maven.multiModuleProjectDirectory" value="/Users/voyager/apachePirk/incubator-pirk"/>
+    <property name="java.vendor.url" value="http://java.oracle.com/"/>
+    <property name="path.separator" value=":"/>
+    <property name="guice.disable.misplaced.annotation.check" value="true"/>
+    <property name="java.vm.name" value="Java HotSpot(TM) 64-Bit Server VM"/>
+    <property name="file.encoding.pkg" value="sun.io"/>
+    <property name="user.country" value="US"/>
+    <property name="sun.java.launcher" value="SUN_STANDARD"/>
+    <property name="sun.os.patch.level" value="unknown"/>
+    <property name="java.vm.specification.name" value="Java Virtual Machine Specification"/>
+    <property name="user.dir" value="/Users/voyager/apachePirk/incubator-pirk"/>
+    <property name="java.runtime.version" value="1.7.0_80-b15"/>
+    <property name="java.awt.graphicsenv" value="sun.awt.CGraphicsEnvironment"/>
+    <property name="java.endorsed.dirs" value="/Library/Java/JavaVirtualMachines/jdk1.7.0_80.jdk/Contents/Home/jre/lib/endorsed"/>
+    <property name="os.arch" value="x86_64"/>
+    <property name="java.io.tmpdir" value="/var/folders/83/07wq_8t55pn3mgj99512hb8c0000gn/T/"/>
+    <property name="line.separator" value="&#10;"/>
+    <property name="java.vm.specification.vendor" value="Oracle Corporation"/>
+    <property name="os.name" value="Mac OS X"/>
+    <property name="classworlds.conf" value="/usr/local/Cellar/maven/3.3.3/libexec/bin/m2.conf"/>
+    <property name="sun.jnu.encoding" value="UTF-8"/>
+    <property name="java.library.path" value="/Users/voyager/Library/Java/Extensions:/Library/Java/Extensions:/Network/Library/Java/Extensions:/System/Library/Java/Extensions:/usr/lib/java:."/>
+    <property name="java.specification.name" value="Java Platform API Specification"/>
+    <property name="java.class.version" value="51.0"/>
+    <property name="sun.management.compiler" value="HotSpot 64-Bit Tiered Compilers"/>
+    <property name="os.version" value="10.10.1"/>
+    <property name="http.nonProxyHosts" value="local|*.local|169.254/16|*.169.254/16"/>
+    <property name="user.home" value="/Users/voyager"/>
+    <property name="user.timezone" value="America/New_York"/>
+    <property name="java.awt.printerjob" value="sun.lwawt.macosx.CPrinterJob"/>
+    <property name="java.specification.version" value="1.7"/>
+    <property name="file.encoding" value="UTF-8"/>
+    <property name="user.name" value="voyager"/>
+    <property name="java.class.path" value="/usr/local/Cellar/maven/3.3.3/libexec/boot/plexus-classworlds-2.5.2.jar"/>
+    <property name="java.vm.specification.version" value="1.7"/>
+    <property name="sun.arch.data.model" value="64"/>
+    <property name="java.home" value="/Library/Java/JavaVirtualMachines/jdk1.7.0_80.jdk/Contents/Home/jre"/>
+    <property name="sun.java.command" value="org.codehaus.plexus.classworlds.launcher.Launcher package"/>
+    <property name="java.specification.vendor" value="Oracle Corporation"/>
+    <property name="user.language" value="en"/>
+    <property name="awt.toolkit" value="sun.lwawt.macosx.LWCToolkit"/>
+    <property name="java.vm.info" value="mixed mode"/>
+    <property name="java.version" value="1.7.0_80"/>
+    <property name="java.ext.dirs" value="/Users/voyager/Library/Java/Extensions:/Library/Java/JavaVirtualMachines/jdk1.7.0_80.jdk/Contents/Home/jre/lib/ext:/Library/Java/Extensions:/Network/Library/Java/Extensions:/System/Library/Java/Extensions:/usr/lib/java"/>
+    <property name="sun.boot.class.path" value="/Library/Java/JavaVirtualMachines/jdk1.7.0_80.jdk/Contents/Home/jre/lib/resources.jar:/Library/Java/JavaVirtualMachines/jdk1.7.0_80.jdk/Contents/Home/jre/lib/rt.jar:/Library/Java/JavaVirtualMachines/jdk1.7.0_80.jdk/Contents/Home/jre/lib/sunrsasign.jar:/Library/Java/JavaVirtualMachines/jdk1.7.0_80.jdk/Contents/Home/jre/lib/jsse.jar:/Library/Java/JavaVirtualMachines/jdk1.7.0_80.jdk/Contents/Home/jre/lib/jce.jar:/Library/Java/JavaVirtualMachines/jdk1.7.0_80.jdk/Contents/Home/jre/lib/charsets.jar:/Library/Java/JavaVirtualMachines/jdk1.7.0_80.jdk/Contents/Home/jre/lib/jfr.jar:/Library/Java/JavaVirtualMachines/jdk1.7.0_80.jdk/Contents/Home/jre/classes"/>
+    <property name="java.vendor" value="Oracle Corporation"/>
+    <property name="maven.home" value="/usr/local/Cellar/maven/3.3.3/libexec"/>
+    <property name="file.separator" value="/"/>
+    <property name="java.vendor.url.bug" value="http://bugreport.sun.com/bugreport/"/>
+    <property name="sun.cpu.endian" value="little"/>
+    <property name="sun.io.unicode.encoding" value="UnicodeBig"/>
+    <property name="socksNonProxyHosts" value="local|*.local|169.254/16|*.169.254/16"/>
+    <property name="ftp.nonProxyHosts" value="local|*.local|169.254/16|*.169.254/16"/>
+    <property name="sun.cpu.isalist" value=""/>
+  </properties>
+  <testcase name="testKeyedHash" classname="test.general.KeyedHashTest" time="0.001"/>
+  <testcase name="testKeyedHashWithType" classname="test.general.KeyedHashTest" time="0.087"/>
+</testsuite>
\ No newline at end of file

http://git-wip-us.apache.org/repos/asf/incubator-pirk/blob/fee5ae3f/target/surefire-reports/TEST-test.general.PaillierTest.xml
----------------------------------------------------------------------
diff --git a/target/surefire-reports/TEST-test.general.PaillierTest.xml b/target/surefire-reports/TEST-test.general.PaillierTest.xml
new file mode 100644
index 0000000..6234f99
--- /dev/null
+++ b/target/surefire-reports/TEST-test.general.PaillierTest.xml
@@ -0,0 +1,67 @@
+<?xml version="1.0" encoding="UTF-8"?>
+<testsuite name="test.general.PaillierTest" time="421.346" tests="3" errors="0" skipped="0" failures="0">
+  <properties>
+    <property name="java.runtime.name" value="Java(TM) SE Runtime Environment"/>
+    <property name="sun.boot.library.path" value="/Library/Java/JavaVirtualMachines/jdk1.7.0_80.jdk/Contents/Home/jre/lib"/>
+    <property name="java.vm.version" value="24.80-b11"/>
+    <property name="gopherProxySet" value="false"/>
+    <property name="java.vm.vendor" value="Oracle Corporation"/>
+    <property name="maven.multiModuleProjectDirectory" value="/Users/voyager/apachePirk/incubator-pirk"/>
+    <property name="java.vendor.url" value="http://java.oracle.com/"/>
+    <property name="path.separator" value=":"/>
+    <property name="guice.disable.misplaced.annotation.check" value="true"/>
+    <property name="java.vm.name" value="Java HotSpot(TM) 64-Bit Server VM"/>
+    <property name="file.encoding.pkg" value="sun.io"/>
+    <property name="user.country" value="US"/>
+    <property name="sun.java.launcher" value="SUN_STANDARD"/>
+    <property name="sun.os.patch.level" value="unknown"/>
+    <property name="java.vm.specification.name" value="Java Virtual Machine Specification"/>
+    <property name="user.dir" value="/Users/voyager/apachePirk/incubator-pirk"/>
+    <property name="java.runtime.version" value="1.7.0_80-b15"/>
+    <property name="java.awt.graphicsenv" value="sun.awt.CGraphicsEnvironment"/>
+    <property name="java.endorsed.dirs" value="/Library/Java/JavaVirtualMachines/jdk1.7.0_80.jdk/Contents/Home/jre/lib/endorsed"/>
+    <property name="os.arch" value="x86_64"/>
+    <property name="java.io.tmpdir" value="/var/folders/83/07wq_8t55pn3mgj99512hb8c0000gn/T/"/>
+    <property name="line.separator" value="&#10;"/>
+    <property name="java.vm.specification.vendor" value="Oracle Corporation"/>
+    <property name="os.name" value="Mac OS X"/>
+    <property name="classworlds.conf" value="/usr/local/Cellar/maven/3.3.3/libexec/bin/m2.conf"/>
+    <property name="sun.jnu.encoding" value="UTF-8"/>
+    <property name="java.library.path" value="/Users/voyager/Library/Java/Extensions:/Library/Java/Extensions:/Network/Library/Java/Extensions:/System/Library/Java/Extensions:/usr/lib/java:."/>
+    <property name="java.specification.name" value="Java Platform API Specification"/>
+    <property name="java.class.version" value="51.0"/>
+    <property name="sun.management.compiler" value="HotSpot 64-Bit Tiered Compilers"/>
+    <property name="os.version" value="10.10.1"/>
+    <property name="http.nonProxyHosts" value="local|*.local|169.254/16|*.169.254/16"/>
+    <property name="user.home" value="/Users/voyager"/>
+    <property name="user.timezone" value="America/New_York"/>
+    <property name="java.awt.printerjob" value="sun.lwawt.macosx.CPrinterJob"/>
+    <property name="java.specification.version" value="1.7"/>
+    <property name="file.encoding" value="UTF-8"/>
+    <property name="user.name" value="voyager"/>
+    <property name="java.class.path" value="/usr/local/Cellar/maven/3.3.3/libexec/boot/plexus-classworlds-2.5.2.jar"/>
+    <property name="java.vm.specification.version" value="1.7"/>
+    <property name="sun.arch.data.model" value="64"/>
+    <property name="java.home" value="/Library/Java/JavaVirtualMachines/jdk1.7.0_80.jdk/Contents/Home/jre"/>
+    <property name="sun.java.command" value="org.codehaus.plexus.classworlds.launcher.Launcher package"/>
+    <property name="java.specification.vendor" value="Oracle Corporation"/>
+    <property name="user.language" value="en"/>
+    <property name="awt.toolkit" value="sun.lwawt.macosx.LWCToolkit"/>
+    <property name="java.vm.info" value="mixed mode"/>
+    <property name="java.version" value="1.7.0_80"/>
+    <property name="java.ext.dirs" value="/Users/voyager/Library/Java/Extensions:/Library/Java/JavaVirtualMachines/jdk1.7.0_80.jdk/Contents/Home/jre/lib/ext:/Library/Java/Extensions:/Network/Library/Java/Extensions:/System/Library/Java/Extensions:/usr/lib/java"/>
+    <property name="sun.boot.class.path" value="/Library/Java/JavaVirtualMachines/jdk1.7.0_80.jdk/Contents/Home/jre/lib/resources.jar:/Library/Java/JavaVirtualMachines/jdk1.7.0_80.jdk/Contents/Home/jre/lib/rt.jar:/Library/Java/JavaVirtualMachines/jdk1.7.0_80.jdk/Contents/Home/jre/lib/sunrsasign.jar:/Library/Java/JavaVirtualMachines/jdk1.7.0_80.jdk/Contents/Home/jre/lib/jsse.jar:/Library/Java/JavaVirtualMachines/jdk1.7.0_80.jdk/Contents/Home/jre/lib/jce.jar:/Library/Java/JavaVirtualMachines/jdk1.7.0_80.jdk/Contents/Home/jre/lib/charsets.jar:/Library/Java/JavaVirtualMachines/jdk1.7.0_80.jdk/Contents/Home/jre/lib/jfr.jar:/Library/Java/JavaVirtualMachines/jdk1.7.0_80.jdk/Contents/Home/jre/classes"/>
+    <property name="java.vendor" value="Oracle Corporation"/>
+    <property name="maven.home" value="/usr/local/Cellar/maven/3.3.3/libexec"/>
+    <property name="file.separator" value="/"/>
+    <property name="java.vendor.url.bug" value="http://bugreport.sun.com/bugreport/"/>
+    <property name="sun.cpu.endian" value="little"/>
+    <property name="sun.io.unicode.encoding" value="UnicodeBig"/>
+    <property name="socksNonProxyHosts" value="local|*.local|169.254/16|*.169.254/16"/>
+    <property name="ftp.nonProxyHosts" value="local|*.local|169.254/16|*.169.254/16"/>
+    <property name="sun.cpu.isalist" value=""/>
+  </properties>
+  <testcase name="testPaillierWithKeyGeneration" classname="test.general.PaillierTest" time="421.339"/>
+  <testcase name="testPIRExceptions" classname="test.general.PaillierTest" time="0.004"/>
+  <testcase name="testPaillierGivenAllParameters" classname="test.general.PaillierTest" time="0.003"/>
+</testsuite>
\ No newline at end of file

http://git-wip-us.apache.org/repos/asf/incubator-pirk/blob/fee5ae3f/target/surefire-reports/TEST-test.general.PartitionUtilsTest.xml
----------------------------------------------------------------------
diff --git a/target/surefire-reports/TEST-test.general.PartitionUtilsTest.xml b/target/surefire-reports/TEST-test.general.PartitionUtilsTest.xml
new file mode 100644
index 0000000..11e00cb
--- /dev/null
+++ b/target/surefire-reports/TEST-test.general.PartitionUtilsTest.xml
@@ -0,0 +1,67 @@
+<?xml version="1.0" encoding="UTF-8"?>
+<testsuite name="test.general.PartitionUtilsTest" time="0.012" tests="3" errors="0" skipped="0" failures="0">
+  <properties>
+    <property name="java.runtime.name" value="Java(TM) SE Runtime Environment"/>
+    <property name="sun.boot.library.path" value="/Library/Java/JavaVirtualMachines/jdk1.7.0_80.jdk/Contents/Home/jre/lib"/>
+    <property name="java.vm.version" value="24.80-b11"/>
+    <property name="gopherProxySet" value="false"/>
+    <property name="java.vm.vendor" value="Oracle Corporation"/>
+    <property name="maven.multiModuleProjectDirectory" value="/Users/voyager/apachePirk/incubator-pirk"/>
+    <property name="java.vendor.url" value="http://java.oracle.com/"/>
+    <property name="path.separator" value=":"/>
+    <property name="guice.disable.misplaced.annotation.check" value="true"/>
+    <property name="java.vm.name" value="Java HotSpot(TM) 64-Bit Server VM"/>
+    <property name="file.encoding.pkg" value="sun.io"/>
+    <property name="user.country" value="US"/>
+    <property name="sun.java.launcher" value="SUN_STANDARD"/>
+    <property name="sun.os.patch.level" value="unknown"/>
+    <property name="java.vm.specification.name" value="Java Virtual Machine Specification"/>
+    <property name="user.dir" value="/Users/voyager/apachePirk/incubator-pirk"/>
+    <property name="java.runtime.version" value="1.7.0_80-b15"/>
+    <property name="java.awt.graphicsenv" value="sun.awt.CGraphicsEnvironment"/>
+    <property name="java.endorsed.dirs" value="/Library/Java/JavaVirtualMachines/jdk1.7.0_80.jdk/Contents/Home/jre/lib/endorsed"/>
+    <property name="os.arch" value="x86_64"/>
+    <property name="java.io.tmpdir" value="/var/folders/83/07wq_8t55pn3mgj99512hb8c0000gn/T/"/>
+    <property name="line.separator" value="&#10;"/>
+    <property name="java.vm.specification.vendor" value="Oracle Corporation"/>
+    <property name="os.name" value="Mac OS X"/>
+    <property name="classworlds.conf" value="/usr/local/Cellar/maven/3.3.3/libexec/bin/m2.conf"/>
+    <property name="sun.jnu.encoding" value="UTF-8"/>
+    <property name="java.library.path" value="/Users/voyager/Library/Java/Extensions:/Library/Java/Extensions:/Network/Library/Java/Extensions:/System/Library/Java/Extensions:/usr/lib/java:."/>
+    <property name="java.specification.name" value="Java Platform API Specification"/>
+    <property name="java.class.version" value="51.0"/>
+    <property name="sun.management.compiler" value="HotSpot 64-Bit Tiered Compilers"/>
+    <property name="os.version" value="10.10.1"/>
+    <property name="http.nonProxyHosts" value="local|*.local|169.254/16|*.169.254/16"/>
+    <property name="user.home" value="/Users/voyager"/>
+    <property name="user.timezone" value="America/New_York"/>
+    <property name="java.awt.printerjob" value="sun.lwawt.macosx.CPrinterJob"/>
+    <property name="java.specification.version" value="1.7"/>
+    <property name="file.encoding" value="UTF-8"/>
+    <property name="user.name" value="voyager"/>
+    <property name="java.class.path" value="/usr/local/Cellar/maven/3.3.3/libexec/boot/plexus-classworlds-2.5.2.jar"/>
+    <property name="java.vm.specification.version" value="1.7"/>
+    <property name="sun.arch.data.model" value="64"/>
+    <property name="java.home" value="/Library/Java/JavaVirtualMachines/jdk1.7.0_80.jdk/Contents/Home/jre"/>
+    <property name="sun.java.command" value="org.codehaus.plexus.classworlds.launcher.Launcher package"/>
+    <property name="java.specification.vendor" value="Oracle Corporation"/>
+    <property name="user.language" value="en"/>
+    <property name="awt.toolkit" value="sun.lwawt.macosx.LWCToolkit"/>
+    <property name="java.vm.info" value="mixed mode"/>
+    <property name="java.version" value="1.7.0_80"/>
+    <property name="java.ext.dirs" value="/Users/voyager/Library/Java/Extensions:/Library/Java/JavaVirtualMachines/jdk1.7.0_80.jdk/Contents/Home/jre/lib/ext:/Library/Java/Extensions:/Network/Library/Java/Extensions:/System/Library/Java/Extensions:/usr/lib/java"/>
+    <property name="sun.boot.class.path" value="/Library/Java/JavaVirtualMachines/jdk1.7.0_80.jdk/Contents/Home/jre/lib/resources.jar:/Library/Java/JavaVirtualMachines/jdk1.7.0_80.jdk/Contents/Home/jre/lib/rt.jar:/Library/Java/JavaVirtualMachines/jdk1.7.0_80.jdk/Contents/Home/jre/lib/sunrsasign.jar:/Library/Java/JavaVirtualMachines/jdk1.7.0_80.jdk/Contents/Home/jre/lib/jsse.jar:/Library/Java/JavaVirtualMachines/jdk1.7.0_80.jdk/Contents/Home/jre/lib/jce.jar:/Library/Java/JavaVirtualMachines/jdk1.7.0_80.jdk/Contents/Home/jre/lib/charsets.jar:/Library/Java/JavaVirtualMachines/jdk1.7.0_80.jdk/Contents/Home/jre/lib/jfr.jar:/Library/Java/JavaVirtualMachines/jdk1.7.0_80.jdk/Contents/Home/jre/classes"/>
+    <property name="java.vendor" value="Oracle Corporation"/>
+    <property name="maven.home" value="/usr/local/Cellar/maven/3.3.3/libexec"/>
+    <property name="file.separator" value="/"/>
+    <property name="java.vendor.url.bug" value="http://bugreport.sun.com/bugreport/"/>
+    <property name="sun.cpu.endian" value="little"/>
+    <property name="sun.io.unicode.encoding" value="UnicodeBig"/>
+    <property name="socksNonProxyHosts" value="local|*.local|169.254/16|*.169.254/16"/>
+    <property name="ftp.nonProxyHosts" value="local|*.local|169.254/16|*.169.254/16"/>
+    <property name="sun.cpu.isalist" value=""/>
+  </properties>
+  <testcase name="testMask" classname="test.general.PartitionUtilsTest" time="0"/>
+  <testcase name="testPartitions" classname="test.general.PartitionUtilsTest" time="0.012"/>
+  <testcase name="testPartitionBits" classname="test.general.PartitionUtilsTest" time="0"/>
+</testsuite>
\ No newline at end of file

http://git-wip-us.apache.org/repos/asf/incubator-pirk/blob/fee5ae3f/target/surefire-reports/TEST-test.general.QueryParserUtilsTest.xml
----------------------------------------------------------------------
diff --git a/target/surefire-reports/TEST-test.general.QueryParserUtilsTest.xml b/target/surefire-reports/TEST-test.general.QueryParserUtilsTest.xml
new file mode 100644
index 0000000..a1febe3
--- /dev/null
+++ b/target/surefire-reports/TEST-test.general.QueryParserUtilsTest.xml
@@ -0,0 +1,73 @@
+<?xml version="1.0" encoding="UTF-8"?>
+<testsuite name="test.general.QueryParserUtilsTest" time="0.116" tests="9" errors="0" skipped="0" failures="0">
+  <properties>
+    <property name="java.runtime.name" value="Java(TM) SE Runtime Environment"/>
+    <property name="sun.boot.library.path" value="/Library/Java/JavaVirtualMachines/jdk1.7.0_80.jdk/Contents/Home/jre/lib"/>
+    <property name="java.vm.version" value="24.80-b11"/>
+    <property name="gopherProxySet" value="false"/>
+    <property name="java.vm.vendor" value="Oracle Corporation"/>
+    <property name="maven.multiModuleProjectDirectory" value="/Users/voyager/apachePirk/incubator-pirk"/>
+    <property name="java.vendor.url" value="http://java.oracle.com/"/>
+    <property name="path.separator" value=":"/>
+    <property name="guice.disable.misplaced.annotation.check" value="true"/>
+    <property name="java.vm.name" value="Java HotSpot(TM) 64-Bit Server VM"/>
+    <property name="file.encoding.pkg" value="sun.io"/>
+    <property name="user.country" value="US"/>
+    <property name="sun.java.launcher" value="SUN_STANDARD"/>
+    <property name="sun.os.patch.level" value="unknown"/>
+    <property name="java.vm.specification.name" value="Java Virtual Machine Specification"/>
+    <property name="user.dir" value="/Users/voyager/apachePirk/incubator-pirk"/>
+    <property name="java.runtime.version" value="1.7.0_80-b15"/>
+    <property name="java.awt.graphicsenv" value="sun.awt.CGraphicsEnvironment"/>
+    <property name="java.endorsed.dirs" value="/Library/Java/JavaVirtualMachines/jdk1.7.0_80.jdk/Contents/Home/jre/lib/endorsed"/>
+    <property name="os.arch" value="x86_64"/>
+    <property name="java.io.tmpdir" value="/var/folders/83/07wq_8t55pn3mgj99512hb8c0000gn/T/"/>
+    <property name="line.separator" value="&#10;"/>
+    <property name="java.vm.specification.vendor" value="Oracle Corporation"/>
+    <property name="os.name" value="Mac OS X"/>
+    <property name="classworlds.conf" value="/usr/local/Cellar/maven/3.3.3/libexec/bin/m2.conf"/>
+    <property name="sun.jnu.encoding" value="UTF-8"/>
+    <property name="java.library.path" value="/Users/voyager/Library/Java/Extensions:/Library/Java/Extensions:/Network/Library/Java/Extensions:/System/Library/Java/Extensions:/usr/lib/java:."/>
+    <property name="java.specification.name" value="Java Platform API Specification"/>
+    <property name="java.class.version" value="51.0"/>
+    <property name="sun.management.compiler" value="HotSpot 64-Bit Tiered Compilers"/>
+    <property name="os.version" value="10.10.1"/>
+    <property name="http.nonProxyHosts" value="local|*.local|169.254/16|*.169.254/16"/>
+    <property name="user.home" value="/Users/voyager"/>
+    <property name="user.timezone" value="America/New_York"/>
+    <property name="java.awt.printerjob" value="sun.lwawt.macosx.CPrinterJob"/>
+    <property name="java.specification.version" value="1.7"/>
+    <property name="file.encoding" value="UTF-8"/>
+    <property name="user.name" value="voyager"/>
+    <property name="java.class.path" value="/usr/local/Cellar/maven/3.3.3/libexec/boot/plexus-classworlds-2.5.2.jar"/>
+    <property name="java.vm.specification.version" value="1.7"/>
+    <property name="sun.arch.data.model" value="64"/>
+    <property name="java.home" value="/Library/Java/JavaVirtualMachines/jdk1.7.0_80.jdk/Contents/Home/jre"/>
+    <property name="sun.java.command" value="org.codehaus.plexus.classworlds.launcher.Launcher package"/>
+    <property name="java.specification.vendor" value="Oracle Corporation"/>
+    <property name="user.language" value="en"/>
+    <property name="awt.toolkit" value="sun.lwawt.macosx.LWCToolkit"/>
+    <property name="java.vm.info" value="mixed mode"/>
+    <property name="java.version" value="1.7.0_80"/>
+    <property name="java.ext.dirs" value="/Users/voyager/Library/Java/Extensions:/Library/Java/JavaVirtualMachines/jdk1.7.0_80.jdk/Contents/Home/jre/lib/ext:/Library/Java/Extensions:/Network/Library/Java/Extensions:/System/Library/Java/Extensions:/usr/lib/java"/>
+    <property name="sun.boot.class.path" value="/Library/Java/JavaVirtualMachines/jdk1.7.0_80.jdk/Contents/Home/jre/lib/resources.jar:/Library/Java/JavaVirtualMachines/jdk1.7.0_80.jdk/Contents/Home/jre/lib/rt.jar:/Library/Java/JavaVirtualMachines/jdk1.7.0_80.jdk/Contents/Home/jre/lib/sunrsasign.jar:/Library/Java/JavaVirtualMachines/jdk1.7.0_80.jdk/Contents/Home/jre/lib/jsse.jar:/Library/Java/JavaVirtualMachines/jdk1.7.0_80.jdk/Contents/Home/jre/lib/jce.jar:/Library/Java/JavaVirtualMachines/jdk1.7.0_80.jdk/Contents/Home/jre/lib/charsets.jar:/Library/Java/JavaVirtualMachines/jdk1.7.0_80.jdk/Contents/Home/jre/lib/jfr.jar:/Library/Java/JavaVirtualMachines/jdk1.7.0_80.jdk/Contents/Home/jre/classes"/>
+    <property name="java.vendor" value="Oracle Corporation"/>
+    <property name="maven.home" value="/usr/local/Cellar/maven/3.3.3/libexec"/>
+    <property name="file.separator" value="/"/>
+    <property name="java.vendor.url.bug" value="http://bugreport.sun.com/bugreport/"/>
+    <property name="sun.cpu.endian" value="little"/>
+    <property name="sun.io.unicode.encoding" value="UnicodeBig"/>
+    <property name="socksNonProxyHosts" value="local|*.local|169.254/16|*.169.254/16"/>
+    <property name="ftp.nonProxyHosts" value="local|*.local|169.254/16|*.169.254/16"/>
+    <property name="sun.cpu.isalist" value=""/>
+  </properties>
+  <testcase name="testDateRangeQuery" classname="test.general.QueryParserUtilsTest" time="0.05"/>
+  <testcase name="testAllQuery" classname="test.general.QueryParserUtilsTest" time="0.001"/>
+  <testcase name="testWildcardQuery" classname="test.general.QueryParserUtilsTest" time="0.005"/>
+  <testcase name="testSingleValueRangeQuery" classname="test.general.QueryParserUtilsTest" time="0.006"/>
+  <testcase name="testIPRangeQuery" classname="test.general.QueryParserUtilsTest" time="0.027"/>
+  <testcase name="testBooleanQuery" classname="test.general.QueryParserUtilsTest" time="0.022"/>
+  <testcase name="testIgnoreCase" classname="test.general.QueryParserUtilsTest" time="0.003"/>
+  <testcase name="testSingleQuery" classname="test.general.QueryParserUtilsTest" time="0"/>
+  <testcase name="testQueryFieldDoesNotExist" classname="test.general.QueryParserUtilsTest" time="0.002"/>
+</testsuite>
\ No newline at end of file

http://git-wip-us.apache.org/repos/asf/incubator-pirk/blob/fee5ae3f/target/surefire-reports/TEST-test.schema.data.LoadDataSchemaTest.xml
----------------------------------------------------------------------
diff --git a/target/surefire-reports/TEST-test.schema.data.LoadDataSchemaTest.xml b/target/surefire-reports/TEST-test.schema.data.LoadDataSchemaTest.xml
new file mode 100644
index 0000000..6c8f9b2
--- /dev/null
+++ b/target/surefire-reports/TEST-test.schema.data.LoadDataSchemaTest.xml
@@ -0,0 +1,67 @@
+<?xml version="1.0" encoding="UTF-8"?>
+<testsuite name="test.schema.data.LoadDataSchemaTest" time="0.047" tests="3" errors="0" skipped="0" failures="0">
+  <properties>
+    <property name="java.runtime.name" value="Java(TM) SE Runtime Environment"/>
+    <property name="sun.boot.library.path" value="/Library/Java/JavaVirtualMachines/jdk1.7.0_80.jdk/Contents/Home/jre/lib"/>
+    <property name="java.vm.version" value="24.80-b11"/>
+    <property name="gopherProxySet" value="false"/>
+    <property name="java.vm.vendor" value="Oracle Corporation"/>
+    <property name="maven.multiModuleProjectDirectory" value="/Users/voyager/apachePirk/incubator-pirk"/>
+    <property name="java.vendor.url" value="http://java.oracle.com/"/>
+    <property name="path.separator" value=":"/>
+    <property name="guice.disable.misplaced.annotation.check" value="true"/>
+    <property name="java.vm.name" value="Java HotSpot(TM) 64-Bit Server VM"/>
+    <property name="file.encoding.pkg" value="sun.io"/>
+    <property name="user.country" value="US"/>
+    <property name="sun.java.launcher" value="SUN_STANDARD"/>
+    <property name="sun.os.patch.level" value="unknown"/>
+    <property name="java.vm.specification.name" value="Java Virtual Machine Specification"/>
+    <property name="user.dir" value="/Users/voyager/apachePirk/incubator-pirk"/>
+    <property name="java.runtime.version" value="1.7.0_80-b15"/>
+    <property name="java.awt.graphicsenv" value="sun.awt.CGraphicsEnvironment"/>
+    <property name="java.endorsed.dirs" value="/Library/Java/JavaVirtualMachines/jdk1.7.0_80.jdk/Contents/Home/jre/lib/endorsed"/>
+    <property name="os.arch" value="x86_64"/>
+    <property name="java.io.tmpdir" value="/var/folders/83/07wq_8t55pn3mgj99512hb8c0000gn/T/"/>
+    <property name="line.separator" value="&#10;"/>
+    <property name="java.vm.specification.vendor" value="Oracle Corporation"/>
+    <property name="os.name" value="Mac OS X"/>
+    <property name="classworlds.conf" value="/usr/local/Cellar/maven/3.3.3/libexec/bin/m2.conf"/>
+    <property name="sun.jnu.encoding" value="UTF-8"/>
+    <property name="java.library.path" value="/Users/voyager/Library/Java/Extensions:/Library/Java/Extensions:/Network/Library/Java/Extensions:/System/Library/Java/Extensions:/usr/lib/java:."/>
+    <property name="java.specification.name" value="Java Platform API Specification"/>
+    <property name="java.class.version" value="51.0"/>
+    <property name="sun.management.compiler" value="HotSpot 64-Bit Tiered Compilers"/>
+    <property name="os.version" value="10.10.1"/>
+    <property name="http.nonProxyHosts" value="local|*.local|169.254/16|*.169.254/16"/>
+    <property name="user.home" value="/Users/voyager"/>
+    <property name="user.timezone" value="America/New_York"/>
+    <property name="java.awt.printerjob" value="sun.lwawt.macosx.CPrinterJob"/>
+    <property name="java.specification.version" value="1.7"/>
+    <property name="file.encoding" value="UTF-8"/>
+    <property name="user.name" value="voyager"/>
+    <property name="java.class.path" value="/usr/local/Cellar/maven/3.3.3/libexec/boot/plexus-classworlds-2.5.2.jar"/>
+    <property name="java.vm.specification.version" value="1.7"/>
+    <property name="sun.arch.data.model" value="64"/>
+    <property name="java.home" value="/Library/Java/JavaVirtualMachines/jdk1.7.0_80.jdk/Contents/Home/jre"/>
+    <property name="sun.java.command" value="org.codehaus.plexus.classworlds.launcher.Launcher package"/>
+    <property name="java.specification.vendor" value="Oracle Corporation"/>
+    <property name="user.language" value="en"/>
+    <property name="awt.toolkit" value="sun.lwawt.macosx.LWCToolkit"/>
+    <property name="java.vm.info" value="mixed mode"/>
+    <property name="java.version" value="1.7.0_80"/>
+    <property name="java.ext.dirs" value="/Users/voyager/Library/Java/Extensions:/Library/Java/JavaVirtualMachines/jdk1.7.0_80.jdk/Contents/Home/jre/lib/ext:/Library/Java/Extensions:/Network/Library/Java/Extensions:/System/Library/Java/Extensions:/usr/lib/java"/>
+    <property name="sun.boot.class.path" value="/Library/Java/JavaVirtualMachines/jdk1.7.0_80.jdk/Contents/Home/jre/lib/resources.jar:/Library/Java/JavaVirtualMachines/jdk1.7.0_80.jdk/Contents/Home/jre/lib/rt.jar:/Library/Java/JavaVirtualMachines/jdk1.7.0_80.jdk/Contents/Home/jre/lib/sunrsasign.jar:/Library/Java/JavaVirtualMachines/jdk1.7.0_80.jdk/Contents/Home/jre/lib/jsse.jar:/Library/Java/JavaVirtualMachines/jdk1.7.0_80.jdk/Contents/Home/jre/lib/jce.jar:/Library/Java/JavaVirtualMachines/jdk1.7.0_80.jdk/Contents/Home/jre/lib/charsets.jar:/Library/Java/JavaVirtualMachines/jdk1.7.0_80.jdk/Contents/Home/jre/lib/jfr.jar:/Library/Java/JavaVirtualMachines/jdk1.7.0_80.jdk/Contents/Home/jre/classes"/>
+    <property name="java.vendor" value="Oracle Corporation"/>
+    <property name="maven.home" value="/usr/local/Cellar/maven/3.3.3/libexec"/>
+    <property name="file.separator" value="/"/>
+    <property name="java.vendor.url.bug" value="http://bugreport.sun.com/bugreport/"/>
+    <property name="sun.cpu.endian" value="little"/>
+    <property name="sun.io.unicode.encoding" value="UnicodeBig"/>
+    <property name="socksNonProxyHosts" value="local|*.local|169.254/16|*.169.254/16"/>
+    <property name="ftp.nonProxyHosts" value="local|*.local|169.254/16|*.169.254/16"/>
+    <property name="sun.cpu.isalist" value=""/>
+  </properties>
+  <testcase name="testUnknownPartitioner" classname="test.schema.data.LoadDataSchemaTest" time="0.016"/>
+  <testcase name="testGeneralSchemaLoad" classname="test.schema.data.LoadDataSchemaTest" time="0.016"/>
+  <testcase name="testIncorrectJavaType" classname="test.schema.data.LoadDataSchemaTest" time="0.015"/>
+</testsuite>
\ No newline at end of file

http://git-wip-us.apache.org/repos/asf/incubator-pirk/blob/fee5ae3f/target/surefire-reports/TEST-test.schema.query.LoadQuerySchemaTest.xml
----------------------------------------------------------------------
diff --git a/target/surefire-reports/TEST-test.schema.query.LoadQuerySchemaTest.xml b/target/surefire-reports/TEST-test.schema.query.LoadQuerySchemaTest.xml
new file mode 100644
index 0000000..275a057
--- /dev/null
+++ b/target/surefire-reports/TEST-test.schema.query.LoadQuerySchemaTest.xml
@@ -0,0 +1,68 @@
+<?xml version="1.0" encoding="UTF-8"?>
+<testsuite name="test.schema.query.LoadQuerySchemaTest" time="12.788" tests="4" errors="0" skipped="0" failures="0">
+  <properties>
+    <property name="java.runtime.name" value="Java(TM) SE Runtime Environment"/>
+    <property name="sun.boot.library.path" value="/Library/Java/JavaVirtualMachines/jdk1.7.0_80.jdk/Contents/Home/jre/lib"/>
+    <property name="java.vm.version" value="24.80-b11"/>
+    <property name="gopherProxySet" value="false"/>
+    <property name="java.vm.vendor" value="Oracle Corporation"/>
+    <property name="maven.multiModuleProjectDirectory" value="/Users/voyager/apachePirk/incubator-pirk"/>
+    <property name="java.vendor.url" value="http://java.oracle.com/"/>
+    <property name="path.separator" value=":"/>
+    <property name="guice.disable.misplaced.annotation.check" value="true"/>
+    <property name="java.vm.name" value="Java HotSpot(TM) 64-Bit Server VM"/>
+    <property name="file.encoding.pkg" value="sun.io"/>
+    <property name="user.country" value="US"/>
+    <property name="sun.java.launcher" value="SUN_STANDARD"/>
+    <property name="sun.os.patch.level" value="unknown"/>
+    <property name="java.vm.specification.name" value="Java Virtual Machine Specification"/>
+    <property name="user.dir" value="/Users/voyager/apachePirk/incubator-pirk"/>
+    <property name="java.runtime.version" value="1.7.0_80-b15"/>
+    <property name="java.awt.graphicsenv" value="sun.awt.CGraphicsEnvironment"/>
+    <property name="java.endorsed.dirs" value="/Library/Java/JavaVirtualMachines/jdk1.7.0_80.jdk/Contents/Home/jre/lib/endorsed"/>
+    <property name="os.arch" value="x86_64"/>
+    <property name="java.io.tmpdir" value="/var/folders/83/07wq_8t55pn3mgj99512hb8c0000gn/T/"/>
+    <property name="line.separator" value="&#10;"/>
+    <property name="java.vm.specification.vendor" value="Oracle Corporation"/>
+    <property name="os.name" value="Mac OS X"/>
+    <property name="classworlds.conf" value="/usr/local/Cellar/maven/3.3.3/libexec/bin/m2.conf"/>
+    <property name="sun.jnu.encoding" value="UTF-8"/>
+    <property name="java.library.path" value="/Users/voyager/Library/Java/Extensions:/Library/Java/Extensions:/Network/Library/Java/Extensions:/System/Library/Java/Extensions:/usr/lib/java:."/>
+    <property name="java.specification.name" value="Java Platform API Specification"/>
+    <property name="java.class.version" value="51.0"/>
+    <property name="sun.management.compiler" value="HotSpot 64-Bit Tiered Compilers"/>
+    <property name="os.version" value="10.10.1"/>
+    <property name="http.nonProxyHosts" value="local|*.local|169.254/16|*.169.254/16"/>
+    <property name="user.home" value="/Users/voyager"/>
+    <property name="user.timezone" value="America/New_York"/>
+    <property name="java.awt.printerjob" value="sun.lwawt.macosx.CPrinterJob"/>
+    <property name="java.specification.version" value="1.7"/>
+    <property name="file.encoding" value="UTF-8"/>
+    <property name="user.name" value="voyager"/>
+    <property name="java.class.path" value="/usr/local/Cellar/maven/3.3.3/libexec/boot/plexus-classworlds-2.5.2.jar"/>
+    <property name="java.vm.specification.version" value="1.7"/>
+    <property name="sun.arch.data.model" value="64"/>
+    <property name="java.home" value="/Library/Java/JavaVirtualMachines/jdk1.7.0_80.jdk/Contents/Home/jre"/>
+    <property name="sun.java.command" value="org.codehaus.plexus.classworlds.launcher.Launcher package"/>
+    <property name="java.specification.vendor" value="Oracle Corporation"/>
+    <property name="user.language" value="en"/>
+    <property name="awt.toolkit" value="sun.lwawt.macosx.LWCToolkit"/>
+    <property name="java.vm.info" value="mixed mode"/>
+    <property name="java.version" value="1.7.0_80"/>
+    <property name="java.ext.dirs" value="/Users/voyager/Library/Java/Extensions:/Library/Java/JavaVirtualMachines/jdk1.7.0_80.jdk/Contents/Home/jre/lib/ext:/Library/Java/Extensions:/Network/Library/Java/Extensions:/System/Library/Java/Extensions:/usr/lib/java"/>
+    <property name="sun.boot.class.path" value="/Library/Java/JavaVirtualMachines/jdk1.7.0_80.jdk/Contents/Home/jre/lib/resources.jar:/Library/Java/JavaVirtualMachines/jdk1.7.0_80.jdk/Contents/Home/jre/lib/rt.jar:/Library/Java/JavaVirtualMachines/jdk1.7.0_80.jdk/Contents/Home/jre/lib/sunrsasign.jar:/Library/Java/JavaVirtualMachines/jdk1.7.0_80.jdk/Contents/Home/jre/lib/jsse.jar:/Library/Java/JavaVirtualMachines/jdk1.7.0_80.jdk/Contents/Home/jre/lib/jce.jar:/Library/Java/JavaVirtualMachines/jdk1.7.0_80.jdk/Contents/Home/jre/lib/charsets.jar:/Library/Java/JavaVirtualMachines/jdk1.7.0_80.jdk/Contents/Home/jre/lib/jfr.jar:/Library/Java/JavaVirtualMachines/jdk1.7.0_80.jdk/Contents/Home/jre/classes"/>
+    <property name="java.vendor" value="Oracle Corporation"/>
+    <property name="maven.home" value="/usr/local/Cellar/maven/3.3.3/libexec"/>
+    <property name="file.separator" value="/"/>
+    <property name="java.vendor.url.bug" value="http://bugreport.sun.com/bugreport/"/>
+    <property name="sun.cpu.endian" value="little"/>
+    <property name="sun.io.unicode.encoding" value="UnicodeBig"/>
+    <property name="socksNonProxyHosts" value="local|*.local|169.254/16|*.169.254/16"/>
+    <property name="ftp.nonProxyHosts" value="local|*.local|169.254/16|*.169.254/16"/>
+    <property name="sun.cpu.isalist" value=""/>
+  </properties>
+  <testcase name="testDataSchemaDoesNotExist" classname="test.schema.query.LoadQuerySchemaTest" time="0.511"/>
+  <testcase name="testGeneralSchemaLoad" classname="test.schema.query.LoadQuerySchemaTest" time="11.656"/>
+  <testcase name="testSelectorDoesNotExistInDataSchema" classname="test.schema.query.LoadQuerySchemaTest" time="0.318"/>
+  <testcase name="testUnknownFilterClass" classname="test.schema.query.LoadQuerySchemaTest" time="0.303"/>
+</testsuite>
\ No newline at end of file

http://git-wip-us.apache.org/repos/asf/incubator-pirk/blob/fee5ae3f/target/surefire-reports/TEST-test.wideskies.standalone.StandaloneTest.xml
----------------------------------------------------------------------
diff --git a/target/surefire-reports/TEST-test.wideskies.standalone.StandaloneTest.xml b/target/surefire-reports/TEST-test.wideskies.standalone.StandaloneTest.xml
new file mode 100644
index 0000000..2857dab
--- /dev/null
+++ b/target/surefire-reports/TEST-test.wideskies.standalone.StandaloneTest.xml
@@ -0,0 +1,65 @@
+<?xml version="1.0" encoding="UTF-8"?>
+<testsuite name="test.wideskies.standalone.StandaloneTest" time="9.683" tests="1" errors="0" skipped="0" failures="0">
+  <properties>
+    <property name="java.runtime.name" value="Java(TM) SE Runtime Environment"/>
+    <property name="sun.boot.library.path" value="/Library/Java/JavaVirtualMachines/jdk1.7.0_80.jdk/Contents/Home/jre/lib"/>
+    <property name="java.vm.version" value="24.80-b11"/>
+    <property name="gopherProxySet" value="false"/>
+    <property name="java.vm.vendor" value="Oracle Corporation"/>
+    <property name="maven.multiModuleProjectDirectory" value="/Users/voyager/apachePirk/incubator-pirk"/>
+    <property name="java.vendor.url" value="http://java.oracle.com/"/>
+    <property name="path.separator" value=":"/>
+    <property name="guice.disable.misplaced.annotation.check" value="true"/>
+    <property name="java.vm.name" value="Java HotSpot(TM) 64-Bit Server VM"/>
+    <property name="file.encoding.pkg" value="sun.io"/>
+    <property name="user.country" value="US"/>
+    <property name="sun.java.launcher" value="SUN_STANDARD"/>
+    <property name="sun.os.patch.level" value="unknown"/>
+    <property name="java.vm.specification.name" value="Java Virtual Machine Specification"/>
+    <property name="user.dir" value="/Users/voyager/apachePirk/incubator-pirk"/>
+    <property name="java.runtime.version" value="1.7.0_80-b15"/>
+    <property name="java.awt.graphicsenv" value="sun.awt.CGraphicsEnvironment"/>
+    <property name="java.endorsed.dirs" value="/Library/Java/JavaVirtualMachines/jdk1.7.0_80.jdk/Contents/Home/jre/lib/endorsed"/>
+    <property name="os.arch" value="x86_64"/>
+    <property name="java.io.tmpdir" value="/var/folders/83/07wq_8t55pn3mgj99512hb8c0000gn/T/"/>
+    <property name="line.separator" value="&#10;"/>
+    <property name="java.vm.specification.vendor" value="Oracle Corporation"/>
+    <property name="os.name" value="Mac OS X"/>
+    <property name="classworlds.conf" value="/usr/local/Cellar/maven/3.3.3/libexec/bin/m2.conf"/>
+    <property name="sun.jnu.encoding" value="UTF-8"/>
+    <property name="java.library.path" value="/Users/voyager/Library/Java/Extensions:/Library/Java/Extensions:/Network/Library/Java/Extensions:/System/Library/Java/Extensions:/usr/lib/java:."/>
+    <property name="java.specification.name" value="Java Platform API Specification"/>
+    <property name="java.class.version" value="51.0"/>
+    <property name="sun.management.compiler" value="HotSpot 64-Bit Tiered Compilers"/>
+    <property name="os.version" value="10.10.1"/>
+    <property name="http.nonProxyHosts" value="local|*.local|169.254/16|*.169.254/16"/>
+    <property name="user.home" value="/Users/voyager"/>
+    <property name="user.timezone" value="America/New_York"/>
+    <property name="java.awt.printerjob" value="sun.lwawt.macosx.CPrinterJob"/>
+    <property name="java.specification.version" value="1.7"/>
+    <property name="file.encoding" value="UTF-8"/>
+    <property name="user.name" value="voyager"/>
+    <property name="java.class.path" value="/usr/local/Cellar/maven/3.3.3/libexec/boot/plexus-classworlds-2.5.2.jar"/>
+    <property name="java.vm.specification.version" value="1.7"/>
+    <property name="sun.arch.data.model" value="64"/>
+    <property name="java.home" value="/Library/Java/JavaVirtualMachines/jdk1.7.0_80.jdk/Contents/Home/jre"/>
+    <property name="sun.java.command" value="org.codehaus.plexus.classworlds.launcher.Launcher package"/>
+    <property name="java.specification.vendor" value="Oracle Corporation"/>
+    <property name="user.language" value="en"/>
+    <property name="awt.toolkit" value="sun.lwawt.macosx.LWCToolkit"/>
+    <property name="java.vm.info" value="mixed mode"/>
+    <property name="java.version" value="1.7.0_80"/>
+    <property name="java.ext.dirs" value="/Users/voyager/Library/Java/Extensions:/Library/Java/JavaVirtualMachines/jdk1.7.0_80.jdk/Contents/Home/jre/lib/ext:/Library/Java/Extensions:/Network/Library/Java/Extensions:/System/Library/Java/Extensions:/usr/lib/java"/>
+    <property name="sun.boot.class.path" value="/Library/Java/JavaVirtualMachines/jdk1.7.0_80.jdk/Contents/Home/jre/lib/resources.jar:/Library/Java/JavaVirtualMachines/jdk1.7.0_80.jdk/Contents/Home/jre/lib/rt.jar:/Library/Java/JavaVirtualMachines/jdk1.7.0_80.jdk/Contents/Home/jre/lib/sunrsasign.jar:/Library/Java/JavaVirtualMachines/jdk1.7.0_80.jdk/Contents/Home/jre/lib/jsse.jar:/Library/Java/JavaVirtualMachines/jdk1.7.0_80.jdk/Contents/Home/jre/lib/jce.jar:/Library/Java/JavaVirtualMachines/jdk1.7.0_80.jdk/Contents/Home/jre/lib/charsets.jar:/Library/Java/JavaVirtualMachines/jdk1.7.0_80.jdk/Contents/Home/jre/lib/jfr.jar:/Library/Java/JavaVirtualMachines/jdk1.7.0_80.jdk/Contents/Home/jre/classes"/>
+    <property name="java.vendor" value="Oracle Corporation"/>
+    <property name="maven.home" value="/usr/local/Cellar/maven/3.3.3/libexec"/>
+    <property name="file.separator" value="/"/>
+    <property name="java.vendor.url.bug" value="http://bugreport.sun.com/bugreport/"/>
+    <property name="sun.cpu.endian" value="little"/>
+    <property name="sun.io.unicode.encoding" value="UnicodeBig"/>
+    <property name="socksNonProxyHosts" value="local|*.local|169.254/16|*.169.254/16"/>
+    <property name="ftp.nonProxyHosts" value="local|*.local|169.254/16|*.169.254/16"/>
+    <property name="sun.cpu.isalist" value=""/>
+  </properties>
+  <testcase name="runTests" classname="test.wideskies.standalone.StandaloneTest" time="9.683"/>
+</testsuite>
\ No newline at end of file

http://git-wip-us.apache.org/repos/asf/incubator-pirk/blob/fee5ae3f/target/surefire-reports/test.general.ISO8601DateParserTest-output.txt
----------------------------------------------------------------------
diff --git a/target/surefire-reports/test.general.ISO8601DateParserTest-output.txt b/target/surefire-reports/test.general.ISO8601DateParserTest-output.txt
new file mode 100644
index 0000000..5c17099
--- /dev/null
+++ b/target/surefire-reports/test.general.ISO8601DateParserTest-output.txt
@@ -0,0 +1,6 @@
+ INFO [main] 2016-07-12 12:11:49,183 (SystemConfiguration.java:89) - Loading default properties file 'pirk.properties'
+ INFO [main] 2016-07-12 12:11:49,202 (LoadDataSchemas.java:77) - Loading data schemas: 
+ INFO [main] 2016-07-12 12:11:49,204 (LoadQuerySchemas.java:75) - Loading query schemas: 
+Loading log4j properties file: 'logging/log4j.properties'
+ INFO [main] 2016-07-12 12:11:49,214 (ISO8601DateParserTest.java:40) - Starting testDateParsing: 
+ INFO [main] 2016-07-12 12:11:49,225 (ISO8601DateParserTest.java:48) - Successfully completed testDateParsing

http://git-wip-us.apache.org/repos/asf/incubator-pirk/blob/fee5ae3f/target/surefire-reports/test.general.ISO8601DateParserTest.txt
----------------------------------------------------------------------
diff --git a/target/surefire-reports/test.general.ISO8601DateParserTest.txt b/target/surefire-reports/test.general.ISO8601DateParserTest.txt
new file mode 100644
index 0000000..cff1acf
--- /dev/null
+++ b/target/surefire-reports/test.general.ISO8601DateParserTest.txt
@@ -0,0 +1,4 @@
+-------------------------------------------------------------------------------
+Test set: test.general.ISO8601DateParserTest
+-------------------------------------------------------------------------------
+Tests run: 1, Failures: 0, Errors: 0, Skipped: 0, Time elapsed: 0.174 sec - in test.general.ISO8601DateParserTest

http://git-wip-us.apache.org/repos/asf/incubator-pirk/blob/fee5ae3f/target/surefire-reports/test.general.KeyedHashTest-output.txt
----------------------------------------------------------------------
diff --git a/target/surefire-reports/test.general.KeyedHashTest-output.txt b/target/surefire-reports/test.general.KeyedHashTest-output.txt
new file mode 100644
index 0000000..87793e5
--- /dev/null
+++ b/target/surefire-reports/test.general.KeyedHashTest-output.txt
@@ -0,0 +1,28 @@
+ INFO [main] 2016-07-12 12:11:49,232 (KeyedHashTest.java:39) - Starting testKeyedHash: 
+ INFO [main] 2016-07-12 12:11:49,235 (KeyedHashTest.java:42) - hash1 = 3381 hash1 = 110100110101
+ INFO [main] 2016-07-12 12:11:49,235 (KeyedHashTest.java:45) - hash2 = 507510069 hash2 = 11110001111111111110100110101
+ INFO [main] 2016-07-12 12:11:49,235 (KeyedHashTest.java:48) - hash3 = 507510069 hash3 = 11110001111111111110100110101
+ INFO [main] 2016-07-12 12:11:49,236 (KeyedHashTest.java:53) - Successfully completed testKeyedHash
+ INFO [main] 2016-07-12 12:11:49,237 (KeyedHashTest.java:67) - Starting testKeyedHashType with type: MD5
+ INFO [main] 2016-07-12 12:11:49,252 (KeyedHashTest.java:70) - hash1 = 26 hash1 = 11010
+ INFO [main] 2016-07-12 12:11:49,252 (KeyedHashTest.java:73) - hash2 = 2047168538 hash2 = 1111010000001010101000000011010
+ INFO [main] 2016-07-12 12:11:49,253 (KeyedHashTest.java:76) - hash3 = 2047168538 hash3 = 1111010000001010101000000011010
+ INFO [main] 2016-07-12 12:11:49,253 (KeyedHashTest.java:81) - Successfully completed testKeyedHashType with type: MD5
+ INFO [main] 2016-07-12 12:11:49,253 (KeyedHashTest.java:67) - Starting testKeyedHashType with type: SHA-1
+ INFO [main] 2016-07-12 12:11:49,255 (KeyedHashTest.java:70) - hash1 = 1116 hash1 = 10001011100
+ INFO [main] 2016-07-12 12:11:49,256 (KeyedHashTest.java:73) - hash2 = 1614103644 hash2 = 1100000001101010100010001011100
+ INFO [main] 2016-07-12 12:11:49,256 (KeyedHashTest.java:76) - hash3 = 1614103644 hash3 = 1100000001101010100010001011100
+ INFO [main] 2016-07-12 12:11:49,256 (KeyedHashTest.java:81) - Successfully completed testKeyedHashType with type: SHA-1
+ INFO [main] 2016-07-12 12:11:49,256 (KeyedHashTest.java:67) - Starting testKeyedHashType with type: SHA-256
+ INFO [main] 2016-07-12 12:11:49,257 (KeyedHashTest.java:70) - hash1 = 2100 hash1 = 100000110100
+ INFO [main] 2016-07-12 12:11:49,257 (KeyedHashTest.java:73) - hash2 = 1097439284 hash2 = 1000001011010011001100000110100
+ INFO [main] 2016-07-12 12:11:49,257 (KeyedHashTest.java:76) - hash3 = 1097439284 hash3 = 1000001011010011001100000110100
+ INFO [main] 2016-07-12 12:11:49,257 (KeyedHashTest.java:81) - Successfully completed testKeyedHashType with type: SHA-256
+ INFO [main] 2016-07-12 12:11:49,257 (KeyedHashTest.java:67) - Starting testKeyedHashType with type: FAKE-HASH-TYPE
+ INFO [main] 2016-07-12 12:11:49,325 (KeyedHash.java:80) - java.security.NoSuchAlgorithmException: FAKE-HASH-TYPE MessageDigest not available
+ INFO [main] 2016-07-12 12:11:49,325 (KeyedHashTest.java:70) - hash1 = 3381 hash1 = 110100110101
+ INFO [main] 2016-07-12 12:11:49,326 (KeyedHash.java:80) - java.security.NoSuchAlgorithmException: FAKE-HASH-TYPE MessageDigest not available
+ INFO [main] 2016-07-12 12:11:49,326 (KeyedHashTest.java:73) - hash2 = 507510069 hash2 = 11110001111111111110100110101
+ INFO [main] 2016-07-12 12:11:49,326 (KeyedHash.java:80) - java.security.NoSuchAlgorithmException: FAKE-HASH-TYPE MessageDigest not available
+ INFO [main] 2016-07-12 12:11:49,326 (KeyedHashTest.java:76) - hash3 = 507510069 hash3 = 11110001111111111110100110101
+ INFO [main] 2016-07-12 12:11:49,327 (KeyedHashTest.java:81) - Successfully completed testKeyedHashType with type: FAKE-HASH-TYPE

http://git-wip-us.apache.org/repos/asf/incubator-pirk/blob/fee5ae3f/target/surefire-reports/test.general.KeyedHashTest.txt
----------------------------------------------------------------------
diff --git a/target/surefire-reports/test.general.KeyedHashTest.txt b/target/surefire-reports/test.general.KeyedHashTest.txt
new file mode 100644
index 0000000..1cd84f9
--- /dev/null
+++ b/target/surefire-reports/test.general.KeyedHashTest.txt
@@ -0,0 +1,4 @@
+-------------------------------------------------------------------------------
+Test set: test.general.KeyedHashTest
+-------------------------------------------------------------------------------
+Tests run: 2, Failures: 0, Errors: 0, Skipped: 0, Time elapsed: 0.088 sec - in test.general.KeyedHashTest


Mime
View raw message