pig-dev mailing list archives

Site index · List index
Message view « Date » · « Thread »
Top « Date » · « Thread »
From Apache Jenkins Server <jenk...@builds.apache.org>
Subject Build failed in Jenkins: Pig-trunk-commit #2591
Date Tue, 12 Mar 2019 05:20:19 GMT
See <https://builds.apache.org/job/Pig-trunk-commit/2591/display/redirect?page=changes>

Changes:

[knoguchi] PIG-5382: Log the name when POStore fails on write (knoguchi)

[knoguchi] PIG-5383: OrcStorage fails when "bytearray" represents unknown type (knoguchi)

------------------------------------------
[...truncated 195.76 KB...]
jar:
     [echo] Compiling against Spark 2
Trying to override old definition of task propertycopy
Trying to override old definition of task propertycopy

clean-deps:
Trying to override old definition of task propertycopy
Trying to override old definition of task propertycopy

ivy-download:
      [get] Getting: http://repo2.maven.org/maven2/org/apache/ivy/ivy/2.2.0/ivy-2.2.0.jar
      [get] To: <https://builds.apache.org/job/Pig-trunk-commit/ws/trunk/ivy/ivy-2.2.0.jar>

ivy-init-dirs:
    [mkdir] Created dir: <https://builds.apache.org/job/Pig-trunk-commit/ws/trunk/build/ivy>
    [mkdir] Created dir: <https://builds.apache.org/job/Pig-trunk-commit/ws/trunk/build/ivy/lib>
    [mkdir] Created dir: <https://builds.apache.org/job/Pig-trunk-commit/ws/trunk/build/ivy/report>
    [mkdir] Created dir: <https://builds.apache.org/job/Pig-trunk-commit/ws/trunk/build/ivy/maven>

ivy-probe-antlib:

ivy-init-antlib:

ivy-init:
[ivy:configure] :: Ivy 2.2.0 - 20100923230623 :: http://ant.apache.org/ivy/ ::
[ivy:configure] :: loading settings :: file = <https://builds.apache.org/job/Pig-trunk-commit/ws/trunk/ivy/ivysettings.xml>

ivy-resolve:
     [echo] *** Ivy resolve with Hadoop 2, Spark 2 and HBase 1 ***
[ivy:report] DEPRECATED: 'ivy.conf.file' is deprecated, use 'ivy.settings.file' instead
[ivy:report] :: loading settings :: file = <https://builds.apache.org/job/Pig-trunk-commit/ws/trunk/ivy/ivysettings.xml>
[ivy:report] Processing /home/jenkins/.ivy2/cache/org.apache.pig-pig-compile.xml to <https://builds.apache.org/job/Pig-trunk-commit/ws/trunk/build/ivy/report/org.apache.pig-pig-compile.html>
[ivy:report] Processing /home/jenkins/.ivy2/cache/org.apache.pig-pig-compile.xml to <https://builds.apache.org/job/Pig-trunk-commit/ws/trunk/build/ivy/report/org.apache.pig-pig-compile.graphml>

ivy-compile:
[ivy:cachepath] :: resolving dependencies :: org.apache.pig#pig;0.18.0-SNAPSHOT
[ivy:cachepath] 	confs: [compile]
[ivy:cachepath] 	found com.sun.jersey#jersey-bundle;1.8 in maven2
[ivy:cachepath] 	found com.sun.jersey#jersey-server;1.8 in maven2
[ivy:cachepath] 	found com.sun.jersey.contribs#jersey-guice;1.8 in maven2
[ivy:cachepath] 	found commons-codec#commons-codec;1.4 in fs
[ivy:cachepath] 	found commons-configuration#commons-configuration;1.6 in fs
[ivy:cachepath] 	found commons-collections#commons-collections;3.2.1 in fs
[ivy:cachepath] 	found javax.servlet#servlet-api;2.5 in fs
[ivy:cachepath] 	found javax.ws.rs#jsr311-api;1.1.1 in fs
[ivy:cachepath] 	found com.google.protobuf#protobuf-java;2.5.0 in fs
[ivy:cachepath] 	found javax.inject#javax.inject;1 in fs
[ivy:cachepath] 	found javax.xml.bind#jaxb-api;2.2.2 in fs
[ivy:cachepath] 	found com.sun.xml.bind#jaxb-impl;2.2.3-1 in fs
[ivy:cachepath] 	found com.google.inject#guice;3.0 in fs
[ivy:cachepath] 	found com.google.inject.extensions#guice-servlet;3.0 in fs
[ivy:cachepath] 	found aopalliance#aopalliance;1.0 in fs
[ivy:cachepath] 	found org.glassfish#javax.el;3.0.1-b08 in maven2
[ivy:cachepath] 	found org.apache.hadoop#hadoop-annotations;2.7.3 in maven2
[ivy:cachepath] 	found org.apache.hadoop#hadoop-auth;2.7.3 in maven2
[ivy:cachepath] 	found org.apache.hadoop#hadoop-common;2.7.3 in maven2
[ivy:cachepath] 	found org.apache.hadoop#hadoop-hdfs;2.7.3 in maven2
[ivy:cachepath] 	found org.apache.hadoop#hadoop-mapreduce-client-core;2.7.3 in maven2
[ivy:cachepath] 	found org.apache.hadoop#hadoop-mapreduce-client-jobclient;2.7.3 in maven2
[ivy:cachepath] 	found org.apache.hadoop#hadoop-yarn-server-tests;2.7.3 in maven2
[ivy:cachepath] 	found org.apache.hadoop#hadoop-mapreduce-client-app;2.7.3 in maven2
[ivy:cachepath] 	found org.apache.hadoop#hadoop-mapreduce-client-shuffle;2.7.3 in maven2
[ivy:cachepath] 	found org.apache.hadoop#hadoop-mapreduce-client-common;2.7.3 in maven2
[ivy:cachepath] 	found org.apache.hadoop#hadoop-yarn-api;2.7.3 in maven2
[ivy:cachepath] 	found org.apache.hadoop#hadoop-yarn-common;2.7.3 in maven2
[ivy:cachepath] 	found org.apache.hadoop#hadoop-yarn-server;2.7.3 in maven2
[ivy:cachepath] 	found org.apache.hadoop#hadoop-yarn-server-web-proxy;2.7.3 in maven2
[ivy:cachepath] 	found org.apache.hadoop#hadoop-yarn-server-common;2.7.3 in maven2
[ivy:cachepath] 	found org.apache.hadoop#hadoop-yarn-server-nodemanager;2.7.3 in maven2
[ivy:cachepath] 	found org.apache.hadoop#hadoop-yarn-server-resourcemanager;2.7.3 in maven2
[ivy:cachepath] 	found org.apache.hadoop#hadoop-yarn-client;2.7.3 in maven2
[ivy:cachepath] 	found org.apache.hadoop#hadoop-yarn-server-applicationhistoryservice;2.7.3
in maven2
[ivy:cachepath] 	found org.apache.hadoop#hadoop-mapreduce-client-hs;2.7.3 in maven2
[ivy:cachepath] 	found org.apache.avro#avro-mapred;1.7.5 in maven2
[ivy:cachepath] 	found org.apache.avro#avro-ipc;1.7.5 in maven2
[ivy:cachepath] 	found org.apache.avro#avro;1.7.5 in fs
[ivy:cachepath] 	found com.thoughtworks.paranamer#paranamer;2.3 in fs
[ivy:cachepath] 	found org.xerial.snappy#snappy-java;1.0.5 in fs
[ivy:cachepath] 	found org.apache.commons#commons-compress;1.4.1 in fs
[ivy:cachepath] 	found org.tukaani#xz;1.0 in fs
[ivy:cachepath] 	found org.slf4j#slf4j-api;1.6.4 in fs
[ivy:cachepath] 	found org.mortbay.jetty#jetty;6.1.26 in fs
[ivy:cachepath] 	found org.mortbay.jetty#jetty-util;6.1.26 in fs
[ivy:cachepath] 	found org.mortbay.jetty#servlet-api;2.5-20081211 in fs
[ivy:cachepath] 	found org.apache.velocity#velocity;1.7 in fs
[ivy:cachepath] 	found commons-lang#commons-lang;2.4 in fs
[ivy:cachepath] 	found org.htrace#htrace-core;3.0.4 in fs
[ivy:cachepath] 	found org.apache.htrace#htrace-core;3.1.0-incubating in fs
[ivy:cachepath] 	found org.fusesource.leveldbjni#leveldbjni-all;1.8 in fs
[ivy:cachepath] 	found org.apache.hive.shims#hive-shims-0.23;1.2.1 in fs
[ivy:cachepath] 	found org.apache.tez#tez;0.7.0 in maven2
[ivy:cachepath] 	found org.apache.tez#tez-common;0.7.0 in maven2
[ivy:cachepath] 	found org.apache.tez#tez-api;0.7.0 in maven2
[ivy:cachepath] 	found org.apache.tez#tez-dag;0.7.0 in maven2
[ivy:cachepath] 	found org.apache.tez#tez-runtime-internals;0.7.0 in maven2
[ivy:cachepath] 	found org.apache.tez#tez-runtime-library;0.7.0 in maven2
[ivy:cachepath] 	found org.apache.tez#tez-mapreduce;0.7.0 in maven2
[ivy:cachepath] 	found org.apache.tez#tez-yarn-timeline-history-with-acls;0.7.0 in maven2
[ivy:cachepath] 	found org.apache.commons#commons-collections4;4.0 in maven2
[ivy:cachepath] 	found org.codehaus.jettison#jettison;1.3.4 in maven2
[ivy:cachepath] 	found org.apache.commons#commons-math3;3.1.1 in fs
[ivy:cachepath] 	found org.apache.curator#curator-framework;2.6.0 in maven2
[ivy:cachepath] 	found org.apache.curator#curator-client;2.6.0 in maven2
[ivy:cachepath] 	found org.apache.hbase#hbase-client;1.2.4 in maven2
[ivy:cachepath] 	found org.apache.hbase#hbase-common;1.2.4 in maven2
[ivy:cachepath] 	found org.apache.hbase#hbase-server;1.2.4 in maven2
[ivy:cachepath] 	found org.apache.hbase#hbase-protocol;1.2.4 in maven2
[ivy:cachepath] 	found org.apache.hbase#hbase-hadoop-compat;1.2.4 in maven2
[ivy:cachepath] 	found org.apache.hbase#hbase-hadoop2-compat;1.2.4 in maven2
[ivy:cachepath] 	found com.lmax#disruptor;3.3.0 in fs
[ivy:cachepath] 	found org.cloudera.htrace#htrace-core;2.00 in maven2
[ivy:cachepath] 	found commons-el#commons-el;1.0 in fs
[ivy:cachepath] 	found commons-io#commons-io;2.3 in maven2
[ivy:cachepath] 	found org.apache.httpcomponents#httpclient;4.4 in maven2
[ivy:cachepath] 	found org.apache.httpcomponents#httpcore;4.4 in fs
[ivy:cachepath] 	found nl.basjes.parse.httpdlog#httpdlog-pigloader;5.0 in maven2
[ivy:cachepath] 	found log4j#log4j;1.2.16 in maven2
[ivy:cachepath] 	found commons-logging#commons-logging;1.2 in fs
[ivy:cachepath] 	found org.slf4j#slf4j-log4j12;1.6.1 in maven2
[ivy:cachepath] 	found commons-cli#commons-cli;1.2 in fs
[ivy:cachepath] 	found org.apache.avro#trevni-core;1.7.5 in maven2
[ivy:cachepath] 	found org.apache.avro#trevni-avro;1.7.5 in maven2
[ivy:cachepath] 	found org.xerial.snappy#snappy-java;1.1.1.3 in maven2
[ivy:cachepath] 	found com.googlecode.json-simple#json-simple;1.1 in maven2
[ivy:cachepath] 	found jline#jline;2.11 in fs
[ivy:cachepath] 	found net.java.dev.javacc#javacc;4.2 in maven2
[ivy:cachepath] 	found org.codehaus.groovy#groovy-all;2.4.5 in maven2
[ivy:cachepath] 	found org.apache.ivy#ivy;2.2.0 in maven2
[ivy:cachepath] 	found org.codehaus.jackson#jackson-mapper-asl;1.9.13 in fs
[ivy:cachepath] 	found org.codehaus.jackson#jackson-core-asl;1.9.13 in fs
[ivy:cachepath] 	found org.fusesource.jansi#jansi;1.9 in maven2
[ivy:cachepath] 	found joda-time#joda-time;2.9.9 in fs
[ivy:cachepath] 	found com.google.guava#guava;11.0 in maven2
[ivy:cachepath] 	found org.python#jython-standalone;2.7.1 in maven2
[ivy:cachepath] 	found rhino#js;1.7R2 in maven2
[ivy:cachepath] 	found org.antlr#antlr;3.4 in maven2
[ivy:cachepath] 	found org.antlr#antlr-runtime;3.4 in fs
[ivy:cachepath] 	found org.antlr#stringtemplate;3.2.1 in fs
[ivy:cachepath] 	found antlr#antlr;2.7.7 in fs
[ivy:cachepath] 	found org.antlr#ST4;4.0.4 in fs
[ivy:cachepath] 	found org.apache.zookeeper#zookeeper;3.4.5 in maven2
[ivy:cachepath] 	found dk.brics.automaton#automaton;1.11-8 in maven2
[ivy:cachepath] 	found org.jruby#jruby-complete;1.7.26 in maven2
[ivy:cachepath] 	found asm#asm;3.3.1 in fs
[ivy:cachepath] 	found org.roaringbitmap#RoaringBitmap;0.7.14 in maven2
[ivy:cachepath] 	found org.apache.accumulo#accumulo-core;1.5.0 in maven2
[ivy:cachepath] 	found com.beust#jcommander;1.30 in maven2
[ivy:cachepath] 	found org.apache.accumulo#accumulo-fate;1.5.0 in maven2
[ivy:cachepath] 	found org.apache.accumulo#accumulo-start;1.5.0 in maven2
[ivy:cachepath] 	found org.apache.commons#commons-vfs2;2.0 in maven2
[ivy:cachepath] 	found org.apache.maven.scm#maven-scm-api;1.4 in fs
[ivy:cachepath] 	found org.codehaus.plexus#plexus-utils;1.5.6 in fs
[ivy:cachepath] 	found org.apache.maven.scm#maven-scm-provider-svnexe;1.4 in fs
[ivy:cachepath] 	found org.apache.maven.scm#maven-scm-provider-svn-commons;1.4 in fs
[ivy:cachepath] 	found regexp#regexp;1.3 in fs
[ivy:cachepath] 	found org.apache.accumulo#accumulo-trace;1.5.0 in maven2
[ivy:cachepath] 	found org.apache.thrift#libthrift;0.9.0 in fs
[ivy:cachepath] 	found org.apache.accumulo#accumulo-minicluster;1.5.0 in maven2
[ivy:cachepath] 	found org.apache.accumulo#accumulo-server;1.5.0 in maven2
[ivy:cachepath] 	found com.google.code.gson#gson;2.2.2 in maven2
[ivy:cachepath] 	found org.apache.hive#hive-exec;1.2.1 in fs
[ivy:cachepath] 	found org.apache.hive#hive-serde;1.2.1 in fs
[ivy:cachepath] 	found org.apache.hive#hive-common;1.2.1 in fs
[ivy:cachepath] 	found org.apache.hive.shims#hive-shims-common;1.2.1 in fs
[ivy:cachepath] 	found com.esotericsoftware.kryo#kryo;2.22 in fs
[ivy:cachepath] 	found org.apache.commons#commons-lang3;3.6 in maven2
[ivy:cachepath] 	found org.vafer#jdeb;0.8 in maven2
[ivy:cachepath] 	found org.apache.parquet#parquet-pig-bundle;1.9.0 in maven2
[ivy:cachepath] :: resolution report :: resolve 1006ms :: artifacts dl 42ms
[ivy:cachepath] 	:: evicted modules:
[ivy:cachepath] 	org.xerial.snappy#snappy-java;1.0.5 by [org.xerial.snappy#snappy-java;1.1.1.3]
in [compile]
[ivy:cachepath] 	org.antlr#antlr-runtime;3.3 by [org.antlr#antlr-runtime;3.4] in [compile]
[ivy:cachepath] 	org.apache.httpcomponents#httpclient;4.1.3 by [org.apache.httpcomponents#httpclient;4.4]
in [compile]
[ivy:cachepath] 	commons-logging#commons-logging;1.1.1 by [commons-logging#commons-logging;1.2]
in [compile]
[ivy:cachepath] 	org.apache.httpcomponents#httpcore;4.1.3 by [org.apache.httpcomponents#httpcore;4.4]
in [compile]
	---------------------------------------------------------------------
	|                  |            modules            ||   artifacts   |
	|       conf       | number| search|dwnlded|evicted|| number|dwnlded|
	---------------------------------------------------------------------
	|      compile     |  135  |   53  |   0   |   5   ||  139  |   0   |
	---------------------------------------------------------------------

BUILD FAILED
<https://builds.apache.org/job/Pig-trunk-commit/ws/trunk/build.xml>:812: The following
error occurred while executing this line:
<https://builds.apache.org/job/Pig-trunk-commit/ws/trunk/build.xml>:1721: Execute failed:
java.io.IOException: Cannot run program "mvn" (in directory "<https://builds.apache.org/job/Pig-trunk-commit/ws/trunk/shade/roaringbitmap")>:
error=2, No such file or directory
	at java.lang.ProcessBuilder.start(ProcessBuilder.java:1048)
	at java.lang.Runtime.exec(Runtime.java:620)
	at org.apache.tools.ant.taskdefs.launcher.Java13CommandLauncher.exec(Java13CommandLauncher.java:58)
	at org.apache.tools.ant.taskdefs.Execute.launch(Execute.java:424)
	at org.apache.tools.ant.taskdefs.Execute.execute(Execute.java:438)
	at org.apache.tools.ant.taskdefs.ExecTask.runExecute(ExecTask.java:630)
	at org.apache.tools.ant.taskdefs.ExecTask.runExec(ExecTask.java:669)
	at org.apache.tools.ant.taskdefs.ExecTask.execute(ExecTask.java:497)
	at org.apache.tools.ant.UnknownElement.execute(UnknownElement.java:292)
	at sun.reflect.GeneratedMethodAccessor4.invoke(Unknown Source)
	at sun.reflect.DelegatingMethodAccessorImpl.invoke(DelegatingMethodAccessorImpl.java:43)
	at java.lang.reflect.Method.invoke(Method.java:498)
	at org.apache.tools.ant.dispatch.DispatchUtils.execute(DispatchUtils.java:99)
	at org.apache.tools.ant.Task.perform(Task.java:350)
	at org.apache.tools.ant.Target.execute(Target.java:449)
	at org.apache.tools.ant.Target.performTasks(Target.java:470)
	at org.apache.tools.ant.Project.executeSortedTargets(Project.java:1388)
	at org.apache.tools.ant.helper.SingleCheckExecutor.executeTargets(SingleCheckExecutor.java:36)
	at org.apache.tools.ant.Project.executeTargets(Project.java:1251)
	at org.apache.tools.ant.taskdefs.Ant.execute(Ant.java:437)
	at org.apache.tools.ant.taskdefs.CallTarget.execute(CallTarget.java:105)
	at org.apache.tools.ant.UnknownElement.execute(UnknownElement.java:292)
	at sun.reflect.GeneratedMethodAccessor4.invoke(Unknown Source)
	at sun.reflect.DelegatingMethodAccessorImpl.invoke(DelegatingMethodAccessorImpl.java:43)
	at java.lang.reflect.Method.invoke(Method.java:498)
	at org.apache.tools.ant.dispatch.DispatchUtils.execute(DispatchUtils.java:99)
	at org.apache.tools.ant.Task.perform(Task.java:350)
	at org.apache.tools.ant.Target.execute(Target.java:449)
	at org.apache.tools.ant.Target.performTasks(Target.java:470)
	at org.apache.tools.ant.Project.executeSortedTargets(Project.java:1388)
	at org.apache.tools.ant.Project.executeTarget(Project.java:1361)
	at org.apache.tools.ant.helper.DefaultExecutor.executeTargets(DefaultExecutor.java:41)
	at org.apache.tools.ant.Project.executeTargets(Project.java:1251)
	at org.apache.tools.ant.Main.runBuild(Main.java:834)
	at org.apache.tools.ant.Main.startAnt(Main.java:223)
	at org.apache.tools.ant.launch.Launcher.run(Launcher.java:284)
	at org.apache.tools.ant.launch.Launcher.main(Launcher.java:101)
Caused by: java.io.IOException: error=2, No such file or directory
	at java.lang.UNIXProcess.forkAndExec(Native Method)
	at java.lang.UNIXProcess.<init>(UNIXProcess.java:247)
	at java.lang.ProcessImpl.start(ProcessImpl.java:134)
	at java.lang.ProcessBuilder.start(ProcessBuilder.java:1029)
	... 36 more

Total time: 27 seconds


======================================================================
======================================================================
STORE: saving artifacts
======================================================================
======================================================================


mv: cannot stat 'build/*.tar.gz': No such file or directory
mv: cannot stat 'build/*.jar': No such file or directory
mv: cannot stat 'build/test/findbugs': No such file or directory
mv: cannot stat 'build/docs/api': No such file or directory
Build Failed
Will be killing below processes. For details refer TEZ-1766
Recording test results
ERROR: Step ?Publish JUnit test result report? failed: No test report files were found. Configuration
error?
Publishing Javadoc
Recording fingerprints

Mime
View raw message