pig-dev mailing list archives

Site index · List index
Message view « Date » · « Thread »
Top « Date » · « Thread »
From Apache Jenkins Server <jenk...@builds.apache.org>
Subject Build failed in Jenkins: Pig-trunk #2089
Date Fri, 12 Oct 2018 22:07:11 GMT
See <https://builds.apache.org/job/Pig-trunk/2089/display/redirect?page=changes>

Changes:

[rohini] PIG-5362: Parameter substitution of shell cmd results doesn't handle backslash (wlauer
via rohini)

[rohini] Fix test failure for PIG-5359

[rohini] PIG-5255: Improvements to bloom join (satishsaley via rohini)

------------------------------------------
[...truncated 263.69 KB...]
[ivy:retrieve] 	impossible to put metadata file in cache: /home/jenkins/.m2/repository/oro/oro/2.0.8/oro-2.0.8.pom
(2.0.8). java.io.FileNotFoundException: /home/jenkins/.ivy2/cache/oro/oro/ivy-2.0.8.xml (Permission
denied)
[ivy:retrieve] 	impossible to put metadata file in cache: /home/jenkins/.m2/repository/org/apache/apache/7/apache-7.pom
(7). java.io.FileNotFoundException: /home/jenkins/.ivy2/cache/org.apache/apache/ivy-7.xml
(Permission denied)
[ivy:retrieve] 	impossible to put metadata file in cache: /home/jenkins/.m2/repository/org/apache/commons/commons-parent/17/commons-parent-17.pom
(17). java.io.FileNotFoundException: /home/jenkins/.ivy2/cache/org.apache.commons/commons-parent/ivy-17.xml
(Permission denied)
[ivy:retrieve] 	impossible to put metadata file in cache: /home/jenkins/.m2/repository/commons-lang/commons-lang/2.6/commons-lang-2.6.pom
(2.6). java.io.FileNotFoundException: /home/jenkins/.ivy2/cache/commons-lang/commons-lang/ivy-2.6.xml
(Permission denied)
[ivy:retrieve] 	impossible to put metadata file in cache: /home/jenkins/.m2/repository/org/apache/apache/9/apache-9.pom
(9). java.io.FileNotFoundException: /home/jenkins/.ivy2/cache/org.apache/apache/ivy-9.xml
(Permission denied)
[ivy:retrieve] 	impossible to put metadata file in cache: /home/jenkins/.m2/repository/org/apache/commons/commons-parent/25/commons-parent-25.pom
(25). java.io.FileNotFoundException: /home/jenkins/.ivy2/cache/org.apache.commons/commons-parent/ivy-25.xml
(Permission denied)
[ivy:retrieve] 	impossible to put metadata file in cache: /home/jenkins/.m2/repository/commons-io/commons-io/2.4/commons-io-2.4.pom
(2.4). java.io.FileNotFoundException: /home/jenkins/.ivy2/cache/commons-io/commons-io/ivy-2.4.xml
(Permission denied)
[ivy:retrieve] 	impossible to put metadata file in cache: /home/jenkins/.m2/repository/net/java/jvnet-parent/1/jvnet-parent-1.pom
(1). java.io.FileNotFoundException: /home/jenkins/.ivy2/cache/net.java/jvnet-parent/ivy-1.xml
(Permission denied)
[ivy:retrieve] 
[ivy:retrieve] :: USE VERBOSE OR DEBUG MESSAGE LEVEL FOR MORE DETAILS
[ivy:cachepath] :: resolving dependencies :: org.apache.pig#pig;0.18.0-SNAPSHOT
[ivy:cachepath] 	confs: [compile]
[ivy:cachepath] 	found com.sun.jersey#jersey-bundle;1.8 in maven2
[ivy:cachepath] 	found com.sun.jersey#jersey-server;1.8 in default
[ivy:cachepath] 	found com.sun.jersey.contribs#jersey-guice;1.8 in maven2
[ivy:cachepath] 	found commons-codec#commons-codec;1.4 in fs
[ivy:cachepath] 	found commons-configuration#commons-configuration;1.6 in fs
[ivy:cachepath] 	found commons-collections#commons-collections;3.2.1 in fs
[ivy:cachepath] 	found javax.servlet#servlet-api;2.5 in fs
[ivy:cachepath] 	found javax.ws.rs#jsr311-api;1.1.1 in fs
[ivy:cachepath] 	found com.google.protobuf#protobuf-java;2.5.0 in fs
[ivy:cachepath] 	found javax.inject#javax.inject;1 in fs
[ivy:cachepath] 	found javax.xml.bind#jaxb-api;2.2.2 in fs
[ivy:cachepath] 	found com.sun.xml.bind#jaxb-impl;2.2.3-1 in fs
[ivy:cachepath] 	found com.google.inject#guice;3.0 in fs
[ivy:cachepath] 	found com.google.inject.extensions#guice-servlet;3.0 in fs
[ivy:cachepath] 	found aopalliance#aopalliance;1.0 in fs
[ivy:cachepath] 	found org.glassfish#javax.el;3.0.1-b08 in fs
[ivy:cachepath] 	found org.apache.hadoop#hadoop-annotations;2.7.3 in fs
[ivy:cachepath] 	found org.apache.hadoop#hadoop-auth;2.7.3 in fs
[ivy:cachepath] 	found org.apache.hadoop#hadoop-common;2.7.3 in fs
[ivy:cachepath] 	found org.apache.hadoop#hadoop-hdfs;2.7.3 in fs
[ivy:cachepath] 	found org.apache.hadoop#hadoop-mapreduce-client-core;2.7.3 in fs
[ivy:cachepath] 	found org.apache.hadoop#hadoop-mapreduce-client-jobclient;2.7.3 in fs
[ivy:cachepath] 	found org.apache.hadoop#hadoop-yarn-server-tests;2.7.3 in fs
[ivy:cachepath] 	found org.apache.hadoop#hadoop-mapreduce-client-app;2.7.3 in fs
[ivy:cachepath] 	found org.apache.hadoop#hadoop-mapreduce-client-shuffle;2.7.3 in fs
[ivy:cachepath] 	found org.apache.hadoop#hadoop-mapreduce-client-common;2.7.3 in fs
[ivy:cachepath] 	found org.apache.hadoop#hadoop-yarn-api;2.7.3 in fs
[ivy:cachepath] 	found org.apache.hadoop#hadoop-yarn-common;2.7.3 in fs
[ivy:cachepath] 	found org.apache.hadoop#hadoop-yarn-server;2.7.3 in fs
[ivy:cachepath] 	found org.apache.hadoop#hadoop-yarn-server-web-proxy;2.7.3 in fs
[ivy:cachepath] 	found org.apache.hadoop#hadoop-yarn-server-common;2.7.3 in fs
[ivy:cachepath] 	found org.apache.hadoop#hadoop-yarn-server-nodemanager;2.7.3 in fs
[ivy:cachepath] 	found org.apache.hadoop#hadoop-yarn-server-resourcemanager;2.7.3 in fs
[ivy:cachepath] 	found org.apache.hadoop#hadoop-yarn-client;2.7.3 in fs
[ivy:cachepath] 	found org.apache.hadoop#hadoop-yarn-server-applicationhistoryservice;2.7.3
in fs
[ivy:cachepath] 	found org.apache.hadoop#hadoop-mapreduce-client-hs;2.7.3 in fs
[ivy:cachepath] 	found org.apache.avro#avro-mapred;1.7.5 in maven2
[ivy:cachepath] 	found org.apache.avro#avro-ipc;1.7.5 in maven2
[ivy:cachepath] 	found org.apache.avro#avro;1.7.5 in fs
[ivy:cachepath] 	found com.thoughtworks.paranamer#paranamer;2.3 in fs
[ivy:cachepath] 	found org.xerial.snappy#snappy-java;1.0.5 in fs
[ivy:cachepath] 	found org.apache.commons#commons-compress;1.4.1 in fs
[ivy:cachepath] 	found org.tukaani#xz;1.0 in fs
[ivy:cachepath] 	found org.slf4j#slf4j-api;1.6.4 in fs
[ivy:cachepath] 	found org.mortbay.jetty#jetty;6.1.26 in fs
[ivy:cachepath] 	found org.mortbay.jetty#jetty-util;6.1.26 in fs
[ivy:cachepath] 	found org.mortbay.jetty#servlet-api;2.5-20081211 in fs
[ivy:cachepath] 	found org.apache.velocity#velocity;1.7 in fs
[ivy:cachepath] 	found commons-lang#commons-lang;2.4 in fs
[ivy:cachepath] 	found org.htrace#htrace-core;3.0.4 in fs
[ivy:cachepath] 	found org.apache.htrace#htrace-core;3.1.0-incubating in fs
[ivy:cachepath] 	found org.fusesource.leveldbjni#leveldbjni-all;1.8 in fs
[ivy:cachepath] 	found org.apache.hive.shims#hive-shims-0.23;1.2.1 in maven2
[ivy:cachepath] 	found org.apache.tez#tez;0.7.0 in maven2
[ivy:cachepath] 	found org.apache.tez#tez-common;0.7.0 in maven2
[ivy:cachepath] 	found org.apache.tez#tez-api;0.7.0 in maven2
[ivy:cachepath] 	found org.apache.tez#tez-dag;0.7.0 in maven2
[ivy:cachepath] 	found org.apache.tez#tez-runtime-internals;0.7.0 in maven2
[ivy:cachepath] 	found org.apache.tez#tez-runtime-library;0.7.0 in maven2
[ivy:cachepath] 	found org.apache.tez#tez-mapreduce;0.7.0 in maven2
[ivy:cachepath] 	found org.apache.tez#tez-yarn-timeline-history-with-acls;0.7.0 in maven2
[ivy:cachepath] 	found org.apache.commons#commons-collections4;4.0 in fs
[ivy:cachepath] 	found org.codehaus.jettison#jettison;1.3.4 in fs
[ivy:cachepath] 	found org.apache.commons#commons-math3;3.1.1 in fs
[ivy:cachepath] 	found org.apache.curator#curator-framework;2.6.0 in fs
[ivy:cachepath] 	found org.apache.curator#curator-client;2.6.0 in fs
[ivy:cachepath] 	found org.apache.hbase#hbase-client;1.2.4 in maven2
[ivy:cachepath] 	found org.apache.hbase#hbase-common;1.2.4 in maven2
[ivy:cachepath] 	found org.apache.hbase#hbase-server;1.2.4 in maven2
[ivy:cachepath] 	found org.apache.hbase#hbase-protocol;1.2.4 in maven2
[ivy:cachepath] 	found org.apache.hbase#hbase-hadoop-compat;1.2.4 in maven2
[ivy:cachepath] 	found org.apache.hbase#hbase-hadoop2-compat;1.2.4 in maven2
[ivy:cachepath] 	found com.lmax#disruptor;3.3.0 in fs
[ivy:cachepath] 	found org.cloudera.htrace#htrace-core;2.00 in maven2
[ivy:cachepath] 	found commons-el#commons-el;1.0 in fs
[ivy:cachepath] 	found commons-io#commons-io;2.3 in fs
[ivy:cachepath] 	found org.apache.httpcomponents#httpclient;4.4 in fs
[ivy:cachepath] 	found org.apache.httpcomponents#httpcore;4.4 in fs
[ivy:cachepath] 	found nl.basjes.parse.httpdlog#httpdlog-pigloader;5.0 in maven2
[ivy:cachepath] 	found log4j#log4j;1.2.16 in fs
[ivy:cachepath] 	found commons-logging#commons-logging;1.2 in fs
[ivy:cachepath] 	found org.slf4j#slf4j-log4j12;1.6.1 in fs
[ivy:cachepath] 	found commons-cli#commons-cli;1.2 in fs
[ivy:cachepath] 	found org.apache.avro#trevni-core;1.7.5 in maven2
[ivy:cachepath] 	found org.apache.avro#trevni-avro;1.7.5 in maven2
[ivy:cachepath] 	found org.xerial.snappy#snappy-java;1.1.1.3 in fs
[ivy:cachepath] 	found com.googlecode.json-simple#json-simple;1.1 in fs
[ivy:cachepath] 	found jline#jline;2.11 in fs
[ivy:cachepath] 	found net.java.dev.javacc#javacc;4.2 in maven2
[ivy:cachepath] 	found org.codehaus.groovy#groovy-all;2.4.5 in maven2
[ivy:cachepath] 	found org.apache.ivy#ivy;2.2.0 in maven2
[ivy:cachepath] 	found org.codehaus.jackson#jackson-mapper-asl;1.9.13 in fs
[ivy:cachepath] 	found org.codehaus.jackson#jackson-core-asl;1.9.13 in fs
[ivy:cachepath] 	found org.fusesource.jansi#jansi;1.9 in fs
[ivy:cachepath] 	found joda-time#joda-time;2.9.9 in fs
[ivy:cachepath] 	found com.google.guava#guava;11.0 in maven2
[ivy:cachepath] 	found org.python#jython-standalone;2.7.1 in maven2
[ivy:cachepath] 	found rhino#js;1.7R2 in fs
[ivy:cachepath] 	found org.antlr#antlr;3.4 in fs
[ivy:cachepath] 	found org.antlr#antlr-runtime;3.4 in fs
[ivy:cachepath] 	found org.antlr#stringtemplate;3.2.1 in fs
[ivy:cachepath] 	found antlr#antlr;2.7.7 in fs
[ivy:cachepath] 	found org.antlr#ST4;4.0.4 in fs
[ivy:cachepath] 	found org.apache.zookeeper#zookeeper;3.4.5 in fs
[ivy:cachepath] 	found dk.brics.automaton#automaton;1.11-8 in fs
[ivy:cachepath] 	found org.jruby#jruby-complete;1.7.26 in fs
[ivy:cachepath] 	found asm#asm;3.3.1 in fs
[ivy:cachepath] 	found org.roaringbitmap#RoaringBitmap;0.7.14 in maven2
[ivy:cachepath] 	found org.apache.accumulo#accumulo-core;1.5.0 in maven2
[ivy:cachepath] 	found com.beust#jcommander;1.30 in maven2
[ivy:cachepath] 	found org.apache.accumulo#accumulo-fate;1.5.0 in maven2
[ivy:cachepath] 	found org.apache.accumulo#accumulo-start;1.5.0 in maven2
[ivy:cachepath] 	found org.apache.commons#commons-vfs2;2.0 in maven2
[ivy:cachepath] 	found org.apache.maven.scm#maven-scm-api;1.4 in default
[ivy:cachepath] 	found org.codehaus.plexus#plexus-utils;1.5.6 in fs
[ivy:cachepath] 	found org.apache.maven.scm#maven-scm-provider-svnexe;1.4 in default
[ivy:cachepath] 	found org.apache.maven.scm#maven-scm-provider-svn-commons;1.4 in default
[ivy:cachepath] 	found regexp#regexp;1.3 in fs
[ivy:cachepath] 	found org.apache.accumulo#accumulo-trace;1.5.0 in maven2
[ivy:cachepath] 	found org.apache.thrift#libthrift;0.9.0 in fs
[ivy:cachepath] 	found org.apache.accumulo#accumulo-minicluster;1.5.0 in maven2
[ivy:cachepath] 	found org.apache.accumulo#accumulo-server;1.5.0 in maven2
[ivy:cachepath] 	found com.google.code.gson#gson;2.2.2 in fs
[ivy:cachepath] 	found org.apache.hive#hive-exec;1.2.1 in maven2
[ivy:cachepath] 	found org.apache.hive#hive-serde;1.2.1 in maven2
[ivy:cachepath] 	found org.apache.hive#hive-common;1.2.1 in maven2
[ivy:cachepath] 	found org.apache.hive.shims#hive-shims-common;1.2.1 in maven2
[ivy:cachepath] 	found com.esotericsoftware.kryo#kryo;2.22 in maven2
[ivy:cachepath] 	found org.apache.commons#commons-lang3;3.6 in fs
[ivy:cachepath] 	found org.vafer#jdeb;0.8 in fs
[ivy:cachepath] 	found org.apache.parquet#parquet-pig-bundle;1.9.0 in maven2
[ivy:cachepath] :: resolution report :: resolve 6680ms :: artifacts dl 50ms
[ivy:cachepath] 	:: evicted modules:
[ivy:cachepath] 	org.xerial.snappy#snappy-java;1.0.5 by [org.xerial.snappy#snappy-java;1.1.1.3]
in [compile]
[ivy:cachepath] 	org.antlr#antlr-runtime;3.3 by [org.antlr#antlr-runtime;3.4] in [compile]
[ivy:cachepath] 	org.apache.httpcomponents#httpclient;4.1.3 by [org.apache.httpcomponents#httpclient;4.4]
in [compile]
[ivy:cachepath] 	commons-logging#commons-logging;1.1.1 by [commons-logging#commons-logging;1.2]
in [compile]
[ivy:cachepath] 	org.apache.httpcomponents#httpcore;4.1.3 by [org.apache.httpcomponents#httpcore;4.4]
in [compile]
	---------------------------------------------------------------------
	|                  |            modules            ||   artifacts   |
	|       conf       | number| search|dwnlded|evicted|| number|dwnlded|
	---------------------------------------------------------------------
	|      compile     |  135  |   54  |   24  |   5   ||  139  |   0   |
	---------------------------------------------------------------------
[ivy:cachepath] 
[ivy:cachepath] :: problems summary ::
[ivy:cachepath] :::: WARNINGS
[ivy:cachepath] 	impossible to put metadata file in cache: /home/jenkins/.m2/repository/org/apache/apache/4/apache-4.pom
(4). java.io.FileNotFoundException: /home/jenkins/.ivy2/cache/org.apache/apache/ivy-4.xml
(Permission denied)
[ivy:cachepath] 	impossible to put metadata file in cache: /home/jenkins/.m2/repository/org/apache/commons/commons-parent/11/commons-parent-11.pom
(11). java.io.FileNotFoundException: /home/jenkins/.ivy2/cache/org.apache.commons/commons-parent/ivy-11.xml
(Permission denied)
[ivy:cachepath] 	impossible to put metadata file in cache: /home/jenkins/.m2/repository/commons-codec/commons-codec/1.4/commons-codec-1.4.pom
(1.4). java.io.FileNotFoundException: /home/jenkins/.ivy2/cache/commons-codec/commons-codec/ivy-1.4.xml
(Permission denied)
[ivy:cachepath] 	impossible to put metadata file in cache: /home/jenkins/.m2/repository/commons-configuration/commons-configuration/1.6/commons-configuration-1.6.pom
(1.6). java.io.FileNotFoundException: /home/jenkins/.ivy2/cache/commons-configuration/commons-configuration/ivy-1.6.xml
(Permission denied)
[ivy:cachepath] 	impossible to put metadata file in cache: /home/jenkins/.m2/repository/org/apache/apache/4/apache-4.pom
(4). java.io.FileNotFoundException: /home/jenkins/.ivy2/cache/org.apache/apache/ivy-4.xml
(Permission denied)
[ivy:cachepath] 	impossible to put metadata file in cache: /home/jenkins/.m2/repository/org/apache/commons/commons-parent/9/commons-parent-9.pom
(9). java.io.FileNotFoundException: /home/jenkins/.ivy2/cache/org.apache.commons/commons-parent/ivy-9.xml
(Permission denied)
[ivy:cachepath] 	impossible to put metadata file in cache: /home/jenkins/.m2/repository/commons-collections/commons-collections/3.2.1/commons-collections-3.2.1.pom
(3.2.1). java.io.FileNotFoundException: /home/jenkins/.ivy2/cache/commons-collections/commons-collections/ivy-3.2.1.xml
(Permission denied)
[ivy:cachepath] 	impossible to put metadata file in cache: /home/jenkins/.m2/repository/javax/servlet/servlet-api/2.5/servlet-api-2.5.pom
(2.5). java.io.FileNotFoundException: /home/jenkins/.ivy2/cache/javax.servlet/servlet-api/ivy-2.5.xml
(Permission denied)
[ivy:cachepath] 	impossible to put metadata file in cache: /home/jenkins/.m2/repository/com/google/google/1/google-1.pom
(1). java.io.FileNotFoundException: /home/jenkins/.ivy2/cache/com.google/google/ivy-1.xml
(Permission denied)
[ivy:cachepath] 	impossible to put metadata file in cache: /home/jenkins/.m2/repository/com/google/protobuf/protobuf-java/2.5.0/protobuf-java-2.5.0.pom
(2.5.0). java.io.FileNotFoundException: /home/jenkins/.ivy2/cache/com.google.protobuf/protobuf-java/ivy-2.5.0.xml
(Permission denied)
[ivy:cachepath] 	impossible to put metadata file in cache: /home/jenkins/.m2/repository/javax/inject/javax.inject/1/javax.inject-1.pom
(1). java.io.FileNotFoundException: /home/jenkins/.ivy2/cache/javax.inject/javax.inject/ivy-1.xml
(Permission denied)
[ivy:cachepath] 	impossible to put metadata file in cache: /home/jenkins/.m2/repository/javax/xml/bind/jaxb-api/2.2.2/jaxb-api-2.2.2.pom
(2.2.2). java.io.FileNotFoundException: /home/jenkins/.ivy2/cache/javax.xml.bind/jaxb-api/ivy-2.2.2.xml
(Permission denied)
[ivy:cachepath] 	impossible to put metadata file in cache: /home/jenkins/.m2/repository/com/sun/xml/bind/jaxb-impl/2.2.3-1/jaxb-impl-2.2.3-1.pom
(2.2.3-1). java.io.FileNotFoundException: /home/jenkins/.ivy2/cache/com.sun.xml.bind/jaxb-impl/ivy-2.2.3-1.xml
(Permission denied)
[ivy:cachepath] 	impossible to put metadata file in cache: /home/jenkins/.m2/repository/com/google/google/5/google-5.pom
(5). java.io.FileNotFoundException: /home/jenkins/.ivy2/cache/com.google/google/ivy-5.xml
(Permission denied)
[ivy:cachepath] 	impossible to put metadata file in cache: /home/jenkins/.m2/repository/com/google/inject/guice-parent/3.0/guice-parent-3.0.pom
(3.0). java.io.FileNotFoundException: /home/jenkins/.ivy2/cache/com.google.inject/guice-parent/ivy-3.0.xml
(Permission denied)
[ivy:cachepath] 	impossible to put metadata file in cache: /home/jenkins/.m2/repository/com/google/inject/guice/3.0/guice-3.0.pom
(3.0). java.io.FileNotFoundException: /home/jenkins/.ivy2/cache/com.google.inject/guice/ivy-3.0.xml
(Permission denied)
[ivy:cachepath] 	impossible to put metadata file in cache: /home/jenkins/.m2/repository/aopalliance/aopalliance/1.0/aopalliance-1.0.pom
(1.0). java.io.FileNotFoundException: /home/jenkins/.ivy2/cache/aopalliance/aopalliance/ivy-1.0.xml
(Permission denied)
[ivy:cachepath] 	impossible to put metadata file in cache: /home/jenkins/.m2/repository/org/codehaus/codehaus-parent/1/codehaus-parent-1.pom
(1). java.io.FileNotFoundException: /home/jenkins/.ivy2/cache/org.codehaus/codehaus-parent/ivy-1.xml
(Permission denied)
[ivy:cachepath] 	impossible to put metadata file in cache: /home/jenkins/.m2/repository/com/thoughtworks/paranamer/paranamer-parent/2.3/paranamer-parent-2.3.pom
(2.3). java.io.FileNotFoundException: /home/jenkins/.ivy2/cache/com.thoughtworks.paranamer/paranamer-parent/ivy-2.3.xml
(Permission denied)
[ivy:cachepath] 	impossible to put metadata file in cache: /home/jenkins/.m2/repository/com/thoughtworks/paranamer/paranamer/2.3/paranamer-2.3.pom
(2.3). java.io.FileNotFoundException: /home/jenkins/.ivy2/cache/com.thoughtworks.paranamer/paranamer/ivy-2.3.xml
(Permission denied)
[ivy:cachepath] 	impossible to put metadata file in cache: /home/jenkins/.m2/repository/org/apache/apache/9/apache-9.pom
(9). java.io.FileNotFoundException: /home/jenkins/.ivy2/cache/org.apache/apache/ivy-9.xml
(Permission denied)
[ivy:cachepath] 	impossible to put metadata file in cache: /home/jenkins/.m2/repository/org/apache/commons/commons-parent/24/commons-parent-24.pom
(24). java.io.FileNotFoundException: /home/jenkins/.ivy2/cache/org.apache.commons/commons-parent/ivy-24.xml
(Permission denied)
[ivy:cachepath] 	impossible to put metadata file in cache: /home/jenkins/.m2/repository/org/apache/commons/commons-compress/1.4.1/commons-compress-1.4.1.pom
(1.4.1). java.io.FileNotFoundException: /home/jenkins/.ivy2/cache/org.apache.commons/commons-compress/ivy-1.4.1.xml
(Permission denied)
[ivy:cachepath] 	impossible to put metadata file in cache: /home/jenkins/.m2/repository/org/tukaani/xz/1.0/xz-1.0.pom
(1.0). java.io.FileNotFoundException: /home/jenkins/.ivy2/cache/org.tukaani/xz/ivy-1.0.xml
(Permission denied)
[ivy:cachepath] 	impossible to put metadata file in cache: /home/jenkins/.m2/repository/org/eclipse/jetty/jetty-parent/14/jetty-parent-14.pom
(14). java.io.FileNotFoundException: /home/jenkins/.ivy2/cache/org.eclipse.jetty/jetty-parent/ivy-14.xml
(Permission denied)
[ivy:cachepath] 	impossible to put metadata file in cache: /home/jenkins/.m2/repository/org/mortbay/jetty/jetty-parent/10/jetty-parent-10.pom
(10). java.io.FileNotFoundException: /home/jenkins/.ivy2/cache/org.mortbay.jetty/jetty-parent/ivy-10.xml
(Permission denied)
[ivy:cachepath] 	impossible to put metadata file in cache: /home/jenkins/.m2/repository/org/mortbay/jetty/project/6.1.26/project-6.1.26.pom
(6.1.26). java.io.FileNotFoundException: /home/jenkins/.ivy2/cache/org.mortbay.jetty/project/ivy-6.1.26.xml
(Permission denied)
[ivy:cachepath] 	impossible to put metadata file in cache: /home/jenkins/.m2/repository/org/mortbay/jetty/jetty/6.1.26/jetty-6.1.26.pom
(6.1.26). java.io.FileNotFoundException: /home/jenkins/.ivy2/cache/org.mortbay.jetty/jetty/ivy-6.1.26.xml
(Permission denied)
[ivy:cachepath] 	impossible to put metadata file in cache: /home/jenkins/.m2/repository/org/eclipse/jetty/jetty-parent/14/jetty-parent-14.pom
(14). java.io.FileNotFoundException: /home/jenkins/.ivy2/cache/org.eclipse.jetty/jetty-parent/ivy-14.xml
(Permission denied)
[ivy:cachepath] 	impossible to put metadata file in cache: /home/jenkins/.m2/repository/org/mortbay/jetty/jetty-parent/10/jetty-parent-10.pom
(10). java.io.FileNotFoundException: /home/jenkins/.ivy2/cache/org.mortbay.jetty/jetty-parent/ivy-10.xml
(Permission denied)
[ivy:cachepath] 	impossible to put metadata file in cache: /home/jenkins/.m2/repository/org/mortbay/jetty/project/6.1.26/project-6.1.26.pom
(6.1.26). java.io.FileNotFoundException: /home/jenkins/.ivy2/cache/org.mortbay.jetty/project/ivy-6.1.26.xml
(Permission denied)
[ivy:cachepath] 	impossible to put metadata file in cache: /home/jenkins/.m2/repository/org/mortbay/jetty/jetty-util/6.1.26/jetty-util-6.1.26.pom
(6.1.26). java.io.FileNotFoundException: /home/jenkins/.ivy2/cache/org.mortbay.jetty/jetty-util/ivy-6.1.26.xml
(Permission denied)
[ivy:cachepath] 	impossible to put metadata file in cache: /home/jenkins/.m2/repository/org/mortbay/jetty/jetty-parent/7/jetty-parent-7.pom
(7). java.io.FileNotFoundException: /home/jenkins/.ivy2/cache/org.mortbay.jetty/jetty-parent/ivy-7.xml
(Permission denied)
[ivy:cachepath] 	impossible to put metadata file in cache: /home/jenkins/.m2/repository/org/mortbay/jetty/servlet-api/2.5-20081211/servlet-api-2.5-20081211.pom
(2.5-20081211). java.io.FileNotFoundException: /home/jenkins/.ivy2/cache/org.mortbay.jetty/servlet-api/ivy-2.5-20081211.xml
(Permission denied)
[ivy:cachepath] 	impossible to put metadata file in cache: /home/jenkins/.m2/repository/org/fusesource/fusesource-pom/1.9/fusesource-pom-1.9.pom
(1.9). java.io.FileNotFoundException: /home/jenkins/.ivy2/cache/org.fusesource/fusesource-pom/ivy-1.9.xml
(Permission denied)
[ivy:cachepath] 	impossible to put metadata file in cache: /home/jenkins/.m2/repository/org/fusesource/leveldbjni/leveldbjni-project/1.8/leveldbjni-project-1.8.pom
(1.8). java.io.FileNotFoundException: /home/jenkins/.ivy2/cache/org.fusesource.leveldbjni/leveldbjni-project/ivy-1.8.xml
(Permission denied)
[ivy:cachepath] 	impossible to put metadata file in cache: /home/jenkins/.m2/repository/org/fusesource/leveldbjni/leveldbjni-all/1.8/leveldbjni-all-1.8.pom
(1.8). java.io.FileNotFoundException: /home/jenkins/.ivy2/cache/org.fusesource.leveldbjni/leveldbjni-all/ivy-1.8.xml
(Permission denied)
[ivy:cachepath] 	impossible to put metadata file in cache: /home/jenkins/.m2/repository/org/apache/apache/9/apache-9.pom
(9). java.io.FileNotFoundException: /home/jenkins/.ivy2/cache/org.apache/apache/ivy-9.xml
(Permission denied)
[ivy:cachepath] 	impossible to put metadata file in cache: /home/jenkins/.m2/repository/org/apache/commons/commons-parent/24/commons-parent-24.pom
(24). java.io.FileNotFoundException: /home/jenkins/.ivy2/cache/org.apache.commons/commons-parent/ivy-24.xml
(Permission denied)
[ivy:cachepath] 	impossible to put metadata file in cache: /home/jenkins/.m2/repository/org/apache/commons/commons-math3/3.1.1/commons-math3-3.1.1.pom
(3.1.1). java.io.FileNotFoundException: /home/jenkins/.ivy2/cache/org.apache.commons/commons-math3/ivy-3.1.1.xml
(Permission denied)
[ivy:cachepath] 	impossible to put metadata file in cache: /home/jenkins/.m2/repository/org/apache/apache/13/apache-13.pom
(13). java.io.FileNotFoundException: /home/jenkins/.ivy2/cache/org.apache/apache/ivy-13.xml
(Permission denied)
[ivy:cachepath] 	impossible to put metadata file in cache: /home/jenkins/.m2/repository/org/apache/commons/commons-parent/34/commons-parent-34.pom
(34). java.io.FileNotFoundException: /home/jenkins/.ivy2/cache/org.apache.commons/commons-parent/ivy-34.xml
(Permission denied)
[ivy:cachepath] 	impossible to put metadata file in cache: /home/jenkins/.m2/repository/commons-logging/commons-logging/1.2/commons-logging-1.2.pom
(1.2). java.io.FileNotFoundException: /home/jenkins/.ivy2/cache/commons-logging/commons-logging/ivy-1.2.xml
(Permission denied)
[ivy:cachepath] 	impossible to put metadata file in cache: /home/jenkins/.m2/repository/org/apache/apache/4/apache-4.pom
(4). java.io.FileNotFoundException: /home/jenkins/.ivy2/cache/org.apache/apache/ivy-4.xml
(Permission denied)
[ivy:cachepath] 	impossible to put metadata file in cache: /home/jenkins/.m2/repository/org/apache/commons/commons-parent/11/commons-parent-11.pom
(11). java.io.FileNotFoundException: /home/jenkins/.ivy2/cache/org.apache.commons/commons-parent/ivy-11.xml
(Permission denied)
[ivy:cachepath] 	impossible to put metadata file in cache: /home/jenkins/.m2/repository/commons-cli/commons-cli/1.2/commons-cli-1.2.pom
(1.2). java.io.FileNotFoundException: /home/jenkins/.ivy2/cache/commons-cli/commons-cli/ivy-1.2.xml
(Permission denied)
[ivy:cachepath] 	impossible to put metadata file in cache: /home/jenkins/.m2/repository/org/codehaus/jackson/jackson-mapper-asl/1.9.13/jackson-mapper-asl-1.9.13.pom
(1.9.13). java.io.FileNotFoundException: /home/jenkins/.ivy2/cache/org.codehaus.jackson/jackson-mapper-asl/ivy-1.9.13.xml
(Permission denied)
[ivy:cachepath] 	impossible to put metadata file in cache: /home/jenkins/.m2/repository/org/codehaus/jackson/jackson-core-asl/1.9.13/jackson-core-asl-1.9.13.pom
(1.9.13). java.io.FileNotFoundException: /home/jenkins/.ivy2/cache/org.codehaus.jackson/jackson-core-asl/ivy-1.9.13.xml
(Permission denied)
[ivy:cachepath] 	impossible to put metadata file in cache: /home/jenkins/.m2/repository/joda-time/joda-time/2.9.9/joda-time-2.9.9.pom
(2.9.9). java.io.FileNotFoundException: /home/jenkins/.ivy2/cache/joda-time/joda-time/ivy-2.9.9.xml
(Permission denied)
[ivy:cachepath] 	impossible to put metadata file in cache: /home/jenkins/.m2/repository/org/apache/zookeeper/zookeeper/3.4.5/zookeeper-3.4.5.pom
(3.4.5). java.io.FileNotFoundException: /home/jenkins/.ivy2/cache/org.apache.zookeeper/zookeeper/ivy-3.4.5.xml
(Permission denied)
[ivy:cachepath] 
[ivy:cachepath] :: USE VERBOSE OR DEBUG MESSAGE LEVEL FOR MORE DETAILS

BUILD FAILED
<https://builds.apache.org/job/Pig-trunk/ws/build.xml>:1721: Execute failed: java.io.IOException:
Cannot run program "mvn" (in directory "<https://builds.apache.org/job/Pig-trunk/ws/shade/roaringbitmap")>:
error=2, No such file or directory
	at java.lang.ProcessBuilder.start(ProcessBuilder.java:1048)
	at java.lang.Runtime.exec(Runtime.java:620)
	at org.apache.tools.ant.taskdefs.Execute$Java13CommandLauncher.exec(Execute.java:862)
	at org.apache.tools.ant.taskdefs.Execute.launch(Execute.java:481)
	at org.apache.tools.ant.taskdefs.Execute.execute(Execute.java:495)
	at org.apache.tools.ant.taskdefs.ExecTask.runExecute(ExecTask.java:631)
	at org.apache.tools.ant.taskdefs.ExecTask.runExec(ExecTask.java:672)
	at org.apache.tools.ant.taskdefs.ExecTask.execute(ExecTask.java:498)
	at org.apache.tools.ant.UnknownElement.execute(UnknownElement.java:291)
	at sun.reflect.GeneratedMethodAccessor4.invoke(Unknown Source)
	at sun.reflect.DelegatingMethodAccessorImpl.invoke(DelegatingMethodAccessorImpl.java:43)
	at java.lang.reflect.Method.invoke(Method.java:498)
	at org.apache.tools.ant.dispatch.DispatchUtils.execute(DispatchUtils.java:106)
	at org.apache.tools.ant.Task.perform(Task.java:348)
	at org.apache.tools.ant.Target.execute(Target.java:392)
	at org.apache.tools.ant.Target.performTasks(Target.java:413)
	at org.apache.tools.ant.Project.executeSortedTargets(Project.java:1399)
	at org.apache.tools.ant.Project.executeTarget(Project.java:1368)
	at org.apache.tools.ant.helper.DefaultExecutor.executeTargets(DefaultExecutor.java:41)
	at org.apache.tools.ant.Project.executeTargets(Project.java:1251)
	at org.apache.tools.ant.Main.runBuild(Main.java:811)
	at org.apache.tools.ant.Main.startAnt(Main.java:217)
	at org.apache.tools.ant.launch.Launcher.run(Launcher.java:280)
	at org.apache.tools.ant.launch.Launcher.main(Launcher.java:109)
Caused by: java.io.IOException: error=2, No such file or directory
	at java.lang.UNIXProcess.forkAndExec(Native Method)
	at java.lang.UNIXProcess.<init>(UNIXProcess.java:247)
	at java.lang.ProcessImpl.start(ProcessImpl.java:134)
	at java.lang.ProcessBuilder.start(ProcessBuilder.java:1029)
	... 23 more

Total time: 54 seconds
Build step 'Invoke Ant' marked build as failure
Recording test results
ERROR: Step ?Publish JUnit test result report? failed: No test report files were found. Configuration
error?

Mime
View raw message