pig-dev mailing list archives

Site index · List index
Message view « Date » · « Thread »
Top « Date » · « Thread »
From Apache Jenkins Server <jenk...@builds.apache.org>
Subject Build failed in Jenkins: Pig-trunk #2084
Date Fri, 05 Oct 2018 10:06:55 GMT
See <https://builds.apache.org/job/Pig-trunk/2084/display/redirect?page=changes>

Changes:

[rohini] Commit missing file for PIG-5342

------------------------------------------
[...truncated 58.34 KB...]
[ivy:cachepath] 	found org.apache.httpcomponents#httpcore;4.4 in fs
[ivy:cachepath] 	found nl.basjes.parse.httpdlog#httpdlog-pigloader;5.0 in maven2
[ivy:cachepath] 	found log4j#log4j;1.2.16 in fs
[ivy:cachepath] 	found commons-logging#commons-logging;1.2 in fs
[ivy:cachepath] 	found org.slf4j#slf4j-log4j12;1.6.1 in fs
[ivy:cachepath] 	found commons-cli#commons-cli;1.2 in fs
[ivy:cachepath] 	found org.apache.avro#trevni-core;1.7.5 in maven2
[ivy:cachepath] 	found org.apache.avro#trevni-avro;1.7.5 in maven2
[ivy:cachepath] 	found org.xerial.snappy#snappy-java;1.1.1.3 in fs
[ivy:cachepath] 	found com.googlecode.json-simple#json-simple;1.1 in fs
[ivy:cachepath] 	found jline#jline;2.11 in fs
[ivy:cachepath] 	found net.java.dev.javacc#javacc;4.2 in maven2
[ivy:cachepath] 	found org.codehaus.groovy#groovy-all;2.4.5 in maven2
[ivy:cachepath] 	found org.apache.ivy#ivy;2.2.0 in maven2
[ivy:cachepath] 	found org.codehaus.jackson#jackson-mapper-asl;1.9.13 in fs
[ivy:cachepath] 	found org.codehaus.jackson#jackson-core-asl;1.9.13 in fs
[ivy:cachepath] 	found org.fusesource.jansi#jansi;1.9 in fs
[ivy:cachepath] 	found joda-time#joda-time;2.9.9 in fs
[ivy:cachepath] 	found com.google.guava#guava;11.0 in maven2
[ivy:cachepath] 	found org.python#jython-standalone;2.7.1 in maven2
[ivy:cachepath] 	found rhino#js;1.7R2 in fs
[ivy:cachepath] 	found org.antlr#antlr;3.4 in fs
[ivy:cachepath] 	found org.antlr#antlr-runtime;3.4 in fs
[ivy:cachepath] 	found org.antlr#stringtemplate;3.2.1 in fs
[ivy:cachepath] 	found antlr#antlr;2.7.7 in fs
[ivy:cachepath] 	found org.antlr#ST4;4.0.4 in fs
[ivy:cachepath] 	found org.apache.zookeeper#zookeeper;3.4.5 in fs
[ivy:cachepath] 	found dk.brics.automaton#automaton;1.11-8 in fs
[ivy:cachepath] 	found org.jruby#jruby-complete;1.7.26 in fs
[ivy:cachepath] 	found asm#asm;3.3.1 in fs
[ivy:cachepath] 	found org.apache.accumulo#accumulo-core;1.5.0 in maven2
[ivy:cachepath] 	found com.beust#jcommander;1.30 in maven2
[ivy:cachepath] 	found org.apache.accumulo#accumulo-fate;1.5.0 in maven2
[ivy:cachepath] 	found org.apache.accumulo#accumulo-start;1.5.0 in maven2
[ivy:cachepath] 	found org.apache.commons#commons-vfs2;2.0 in maven2
[ivy:cachepath] 	found org.apache.maven.scm#maven-scm-api;1.4 in default
[ivy:cachepath] 	found org.codehaus.plexus#plexus-utils;1.5.6 in fs
[ivy:cachepath] 	found org.apache.maven.scm#maven-scm-provider-svnexe;1.4 in default
[ivy:cachepath] 	found org.apache.maven.scm#maven-scm-provider-svn-commons;1.4 in default
[ivy:cachepath] 	found regexp#regexp;1.3 in fs
[ivy:cachepath] 	found org.apache.accumulo#accumulo-trace;1.5.0 in maven2
[ivy:cachepath] 	found org.apache.thrift#libthrift;0.9.0 in fs
[ivy:cachepath] 	found org.apache.accumulo#accumulo-minicluster;1.5.0 in maven2
[ivy:cachepath] 	found org.apache.accumulo#accumulo-server;1.5.0 in maven2
[ivy:cachepath] 	found com.google.code.gson#gson;2.2.2 in fs
[ivy:cachepath] 	found org.apache.hive#hive-exec;1.2.1 in maven2
[ivy:cachepath] 	found org.apache.hive#hive-serde;1.2.1 in maven2
[ivy:cachepath] 	found org.apache.hive#hive-common;1.2.1 in maven2
[ivy:cachepath] 	found org.apache.hive.shims#hive-shims-common;1.2.1 in maven2
[ivy:cachepath] 	found com.esotericsoftware.kryo#kryo;2.22 in maven2
[ivy:cachepath] 	found org.apache.commons#commons-lang3;3.6 in fs
[ivy:cachepath] 	found org.vafer#jdeb;0.8 in fs
[ivy:cachepath] 	found org.apache.parquet#parquet-pig-bundle;1.9.0 in maven2
[ivy:cachepath] :: resolution report :: resolve 8524ms :: artifacts dl 48ms
[ivy:cachepath] 	:: evicted modules:
[ivy:cachepath] 	org.xerial.snappy#snappy-java;1.0.5 by [org.xerial.snappy#snappy-java;1.1.1.3]
in [compile]
[ivy:cachepath] 	org.antlr#antlr-runtime;3.3 by [org.antlr#antlr-runtime;3.4] in [compile]
[ivy:cachepath] 	org.apache.httpcomponents#httpclient;4.1.3 by [org.apache.httpcomponents#httpclient;4.4]
in [compile]
[ivy:cachepath] 	commons-logging#commons-logging;1.1.1 by [commons-logging#commons-logging;1.2]
in [compile]
[ivy:cachepath] 	org.apache.httpcomponents#httpcore;4.1.3 by [org.apache.httpcomponents#httpcore;4.4]
in [compile]
	---------------------------------------------------------------------
	|                  |            modules            ||   artifacts   |
	|       conf       | number| search|dwnlded|evicted|| number|dwnlded|
	---------------------------------------------------------------------
	|      compile     |  134  |   68  |   28  |   5   ||  138  |   0   |
	---------------------------------------------------------------------
[ivy:cachepath] 
[ivy:cachepath] :: problems summary ::
[ivy:cachepath] :::: WARNINGS
[ivy:cachepath] 	impossible to put metadata file in cache: /home/jenkins/.m2/repository/org/apache/apache/4/apache-4.pom
(4). java.io.FileNotFoundException: /home/jenkins/.ivy2/cache/org.apache/apache/ivy-4.xml
(Permission denied)
[ivy:cachepath] 	impossible to put metadata file in cache: /home/jenkins/.m2/repository/org/apache/commons/commons-parent/11/commons-parent-11.pom
(11). java.io.FileNotFoundException: /home/jenkins/.ivy2/cache/org.apache.commons/commons-parent/ivy-11.xml
(Permission denied)
[ivy:cachepath] 	impossible to put metadata file in cache: /home/jenkins/.m2/repository/commons-codec/commons-codec/1.4/commons-codec-1.4.pom
(1.4). java.io.FileNotFoundException: /home/jenkins/.ivy2/cache/commons-codec/commons-codec/ivy-1.4.xml
(Permission denied)
[ivy:cachepath] 	impossible to put metadata file in cache: /home/jenkins/.m2/repository/commons-configuration/commons-configuration/1.6/commons-configuration-1.6.pom
(1.6). java.io.FileNotFoundException: /home/jenkins/.ivy2/cache/commons-configuration/commons-configuration/ivy-1.6.xml
(Permission denied)
[ivy:cachepath] 	impossible to put metadata file in cache: /home/jenkins/.m2/repository/org/apache/apache/4/apache-4.pom
(4). java.io.FileNotFoundException: /home/jenkins/.ivy2/cache/org.apache/apache/ivy-4.xml
(Permission denied)
[ivy:cachepath] 	impossible to put metadata file in cache: /home/jenkins/.m2/repository/org/apache/commons/commons-parent/9/commons-parent-9.pom
(9). java.io.FileNotFoundException: /home/jenkins/.ivy2/cache/org.apache.commons/commons-parent/ivy-9.xml
(Permission denied)
[ivy:cachepath] 	impossible to put metadata file in cache: /home/jenkins/.m2/repository/commons-collections/commons-collections/3.2.1/commons-collections-3.2.1.pom
(3.2.1). java.io.FileNotFoundException: /home/jenkins/.ivy2/cache/commons-collections/commons-collections/ivy-3.2.1.xml
(Permission denied)
[ivy:cachepath] 	impossible to put metadata file in cache: /home/jenkins/.m2/repository/javax/servlet/servlet-api/2.5/servlet-api-2.5.pom
(2.5). java.io.FileNotFoundException: /home/jenkins/.ivy2/cache/javax.servlet/servlet-api/ivy-2.5.xml
(Permission denied)
[ivy:cachepath] 	impossible to put metadata file in cache: /home/jenkins/.m2/repository/com/google/google/1/google-1.pom
(1). java.io.FileNotFoundException: /home/jenkins/.ivy2/cache/com.google/google/ivy-1.xml
(Permission denied)
[ivy:cachepath] 	impossible to put metadata file in cache: /home/jenkins/.m2/repository/com/google/protobuf/protobuf-java/2.5.0/protobuf-java-2.5.0.pom
(2.5.0). java.io.FileNotFoundException: /home/jenkins/.ivy2/cache/com.google.protobuf/protobuf-java/ivy-2.5.0.xml
(Permission denied)
[ivy:cachepath] 	impossible to put metadata file in cache: /home/jenkins/.m2/repository/javax/inject/javax.inject/1/javax.inject-1.pom
(1). java.io.FileNotFoundException: /home/jenkins/.ivy2/cache/javax.inject/javax.inject/ivy-1.xml
(Permission denied)
[ivy:cachepath] 	impossible to put metadata file in cache: /home/jenkins/.m2/repository/javax/xml/bind/jaxb-api/2.2.2/jaxb-api-2.2.2.pom
(2.2.2). java.io.FileNotFoundException: /home/jenkins/.ivy2/cache/javax.xml.bind/jaxb-api/ivy-2.2.2.xml
(Permission denied)
[ivy:cachepath] 	impossible to put metadata file in cache: /home/jenkins/.m2/repository/com/sun/xml/bind/jaxb-impl/2.2.3-1/jaxb-impl-2.2.3-1.pom
(2.2.3-1). java.io.FileNotFoundException: /home/jenkins/.ivy2/cache/com.sun.xml.bind/jaxb-impl/ivy-2.2.3-1.xml
(Permission denied)
[ivy:cachepath] 	impossible to put metadata file in cache: /home/jenkins/.m2/repository/com/google/google/5/google-5.pom
(5). java.io.FileNotFoundException: /home/jenkins/.ivy2/cache/com.google/google/ivy-5.xml
(Permission denied)
[ivy:cachepath] 	impossible to put metadata file in cache: /home/jenkins/.m2/repository/com/google/inject/guice-parent/3.0/guice-parent-3.0.pom
(3.0). java.io.FileNotFoundException: /home/jenkins/.ivy2/cache/com.google.inject/guice-parent/ivy-3.0.xml
(Permission denied)
[ivy:cachepath] 	impossible to put metadata file in cache: /home/jenkins/.m2/repository/com/google/inject/guice/3.0/guice-3.0.pom
(3.0). java.io.FileNotFoundException: /home/jenkins/.ivy2/cache/com.google.inject/guice/ivy-3.0.xml
(Permission denied)
[ivy:cachepath] 	impossible to put metadata file in cache: /home/jenkins/.m2/repository/aopalliance/aopalliance/1.0/aopalliance-1.0.pom
(1.0). java.io.FileNotFoundException: /home/jenkins/.ivy2/cache/aopalliance/aopalliance/ivy-1.0.xml
(Permission denied)
[ivy:cachepath] 	impossible to put metadata file in cache: /home/jenkins/.m2/repository/org/codehaus/codehaus-parent/1/codehaus-parent-1.pom
(1). java.io.FileNotFoundException: /home/jenkins/.ivy2/cache/org.codehaus/codehaus-parent/ivy-1.xml
(Permission denied)
[ivy:cachepath] 	impossible to put metadata file in cache: /home/jenkins/.m2/repository/com/thoughtworks/paranamer/paranamer-parent/2.3/paranamer-parent-2.3.pom
(2.3). java.io.FileNotFoundException: /home/jenkins/.ivy2/cache/com.thoughtworks.paranamer/paranamer-parent/ivy-2.3.xml
(Permission denied)
[ivy:cachepath] 	impossible to put metadata file in cache: /home/jenkins/.m2/repository/com/thoughtworks/paranamer/paranamer/2.3/paranamer-2.3.pom
(2.3). java.io.FileNotFoundException: /home/jenkins/.ivy2/cache/com.thoughtworks.paranamer/paranamer/ivy-2.3.xml
(Permission denied)
[ivy:cachepath] 	impossible to put metadata file in cache: /home/jenkins/.m2/repository/org/apache/apache/9/apache-9.pom
(9). java.io.FileNotFoundException: /home/jenkins/.ivy2/cache/org.apache/apache/ivy-9.xml
(Permission denied)
[ivy:cachepath] 	impossible to put metadata file in cache: /home/jenkins/.m2/repository/org/apache/commons/commons-parent/24/commons-parent-24.pom
(24). java.io.FileNotFoundException: /home/jenkins/.ivy2/cache/org.apache.commons/commons-parent/ivy-24.xml
(Permission denied)
[ivy:cachepath] 	impossible to put metadata file in cache: /home/jenkins/.m2/repository/org/apache/commons/commons-compress/1.4.1/commons-compress-1.4.1.pom
(1.4.1). java.io.FileNotFoundException: /home/jenkins/.ivy2/cache/org.apache.commons/commons-compress/ivy-1.4.1.xml
(Permission denied)
[ivy:cachepath] 	impossible to put metadata file in cache: /home/jenkins/.m2/repository/org/tukaani/xz/1.0/xz-1.0.pom
(1.0). java.io.FileNotFoundException: /home/jenkins/.ivy2/cache/org.tukaani/xz/ivy-1.0.xml
(Permission denied)
[ivy:cachepath] 	impossible to put metadata file in cache: /home/jenkins/.m2/repository/org/eclipse/jetty/jetty-parent/14/jetty-parent-14.pom
(14). java.io.FileNotFoundException: /home/jenkins/.ivy2/cache/org.eclipse.jetty/jetty-parent/ivy-14.xml
(Permission denied)
[ivy:cachepath] 	impossible to put metadata file in cache: /home/jenkins/.m2/repository/org/mortbay/jetty/jetty-parent/10/jetty-parent-10.pom
(10). java.io.FileNotFoundException: /home/jenkins/.ivy2/cache/org.mortbay.jetty/jetty-parent/ivy-10.xml
(Permission denied)
[ivy:cachepath] 	impossible to put metadata file in cache: /home/jenkins/.m2/repository/org/mortbay/jetty/project/6.1.26/project-6.1.26.pom
(6.1.26). java.io.FileNotFoundException: /home/jenkins/.ivy2/cache/org.mortbay.jetty/project/ivy-6.1.26.xml
(Permission denied)
[ivy:cachepath] 	impossible to put metadata file in cache: /home/jenkins/.m2/repository/org/mortbay/jetty/jetty/6.1.26/jetty-6.1.26.pom
(6.1.26). java.io.FileNotFoundException: /home/jenkins/.ivy2/cache/org.mortbay.jetty/jetty/ivy-6.1.26.xml
(Permission denied)
[ivy:cachepath] 	impossible to put metadata file in cache: /home/jenkins/.m2/repository/org/eclipse/jetty/jetty-parent/14/jetty-parent-14.pom
(14). java.io.FileNotFoundException: /home/jenkins/.ivy2/cache/org.eclipse.jetty/jetty-parent/ivy-14.xml
(Permission denied)
[ivy:cachepath] 	impossible to put metadata file in cache: /home/jenkins/.m2/repository/org/mortbay/jetty/jetty-parent/10/jetty-parent-10.pom
(10). java.io.FileNotFoundException: /home/jenkins/.ivy2/cache/org.mortbay.jetty/jetty-parent/ivy-10.xml
(Permission denied)
[ivy:cachepath] 	impossible to put metadata file in cache: /home/jenkins/.m2/repository/org/mortbay/jetty/project/6.1.26/project-6.1.26.pom
(6.1.26). java.io.FileNotFoundException: /home/jenkins/.ivy2/cache/org.mortbay.jetty/project/ivy-6.1.26.xml
(Permission denied)
[ivy:cachepath] 	impossible to put metadata file in cache: /home/jenkins/.m2/repository/org/mortbay/jetty/jetty-util/6.1.26/jetty-util-6.1.26.pom
(6.1.26). java.io.FileNotFoundException: /home/jenkins/.ivy2/cache/org.mortbay.jetty/jetty-util/ivy-6.1.26.xml
(Permission denied)
[ivy:cachepath] 	impossible to put metadata file in cache: /home/jenkins/.m2/repository/org/mortbay/jetty/jetty-parent/7/jetty-parent-7.pom
(7). java.io.FileNotFoundException: /home/jenkins/.ivy2/cache/org.mortbay.jetty/jetty-parent/ivy-7.xml
(Permission denied)
[ivy:cachepath] 	impossible to put metadata file in cache: /home/jenkins/.m2/repository/org/mortbay/jetty/servlet-api/2.5-20081211/servlet-api-2.5-20081211.pom
(2.5-20081211). java.io.FileNotFoundException: /home/jenkins/.ivy2/cache/org.mortbay.jetty/servlet-api/ivy-2.5-20081211.xml
(Permission denied)
[ivy:cachepath] 	impossible to put metadata file in cache: /home/jenkins/.m2/repository/org/sonatype/oss/oss-parent/7/oss-parent-7.pom
(7). java.io.FileNotFoundException: /home/jenkins/.ivy2/cache/org.sonatype.oss/oss-parent/ivy-7.xml
(Permission denied)
[ivy:cachepath] 	impossible to put metadata file in cache: /home/jenkins/.m2/repository/org/htrace/htrace/3.0.4/htrace-3.0.4.pom
(3.0.4). java.io.FileNotFoundException: /home/jenkins/.ivy2/cache/org.htrace/htrace/ivy-3.0.4.xml
(Permission denied)
[ivy:cachepath] 	impossible to put metadata file in cache: /home/jenkins/.m2/repository/org/htrace/htrace-core/3.0.4/htrace-core-3.0.4.pom
(3.0.4). java.io.FileNotFoundException: /home/jenkins/.ivy2/cache/org.htrace/htrace-core/ivy-3.0.4.xml
(Permission denied)
[ivy:cachepath] 	impossible to put metadata file in cache: /home/jenkins/.m2/repository/org/fusesource/fusesource-pom/1.9/fusesource-pom-1.9.pom
(1.9). java.io.FileNotFoundException: /home/jenkins/.ivy2/cache/org.fusesource/fusesource-pom/ivy-1.9.xml
(Permission denied)
[ivy:cachepath] 	impossible to put metadata file in cache: /home/jenkins/.m2/repository/org/fusesource/leveldbjni/leveldbjni-project/1.8/leveldbjni-project-1.8.pom
(1.8). java.io.FileNotFoundException: /home/jenkins/.ivy2/cache/org.fusesource.leveldbjni/leveldbjni-project/ivy-1.8.xml
(Permission denied)
[ivy:cachepath] 	impossible to put metadata file in cache: /home/jenkins/.m2/repository/org/fusesource/leveldbjni/leveldbjni-all/1.8/leveldbjni-all-1.8.pom
(1.8). java.io.FileNotFoundException: /home/jenkins/.ivy2/cache/org.fusesource.leveldbjni/leveldbjni-all/ivy-1.8.xml
(Permission denied)
[ivy:cachepath] 	impossible to put metadata file in cache: /home/jenkins/.m2/repository/org/apache/apache/9/apache-9.pom
(9). java.io.FileNotFoundException: /home/jenkins/.ivy2/cache/org.apache/apache/ivy-9.xml
(Permission denied)
[ivy:cachepath] 	impossible to put metadata file in cache: /home/jenkins/.m2/repository/org/apache/commons/commons-parent/24/commons-parent-24.pom
(24). java.io.FileNotFoundException: /home/jenkins/.ivy2/cache/org.apache.commons/commons-parent/ivy-24.xml
(Permission denied)
[ivy:cachepath] 	impossible to put metadata file in cache: /home/jenkins/.m2/repository/org/apache/commons/commons-math3/3.1.1/commons-math3-3.1.1.pom
(3.1.1). java.io.FileNotFoundException: /home/jenkins/.ivy2/cache/org.apache.commons/commons-math3/ivy-3.1.1.xml
(Permission denied)
[ivy:cachepath] 	impossible to put metadata file in cache: /home/jenkins/.m2/repository/org/apache/apache/14/apache-14.pom
(14). java.io.FileNotFoundException: /home/jenkins/.ivy2/cache/org.apache/apache/ivy-14.xml
(Permission denied)
[ivy:cachepath] 	impossible to put metadata file in cache: /home/jenkins/.m2/repository/org/apache/curator/apache-curator/2.6.0/apache-curator-2.6.0.pom
(2.6.0). java.io.FileNotFoundException: /home/jenkins/.ivy2/cache/org.apache.curator/apache-curator/ivy-2.6.0.xml
(Permission denied)
[ivy:cachepath] 	impossible to put metadata file in cache: /home/jenkins/.m2/repository/org/apache/curator/curator-framework/2.6.0/curator-framework-2.6.0.pom
(2.6.0). java.io.FileNotFoundException: /home/jenkins/.ivy2/cache/org.apache.curator/curator-framework/ivy-2.6.0.xml
(Permission denied)
[ivy:cachepath] 	impossible to put metadata file in cache: /home/jenkins/.m2/repository/org/apache/apache/14/apache-14.pom
(14). java.io.FileNotFoundException: /home/jenkins/.ivy2/cache/org.apache/apache/ivy-14.xml
(Permission denied)
[ivy:cachepath] 	impossible to put metadata file in cache: /home/jenkins/.m2/repository/org/apache/curator/apache-curator/2.6.0/apache-curator-2.6.0.pom
(2.6.0). java.io.FileNotFoundException: /home/jenkins/.ivy2/cache/org.apache.curator/apache-curator/ivy-2.6.0.xml
(Permission denied)
[ivy:cachepath] 	impossible to put metadata file in cache: /home/jenkins/.m2/repository/org/apache/curator/curator-client/2.6.0/curator-client-2.6.0.pom
(2.6.0). java.io.FileNotFoundException: /home/jenkins/.ivy2/cache/org.apache.curator/curator-client/ivy-2.6.0.xml
(Permission denied)
[ivy:cachepath] 	impossible to put metadata file in cache: /home/jenkins/.m2/repository/commons-el/commons-el/1.0/commons-el-1.0.pom
(1.0). java.io.FileNotFoundException: /home/jenkins/.ivy2/cache/commons-el/commons-el/ivy-1.0.xml
(Permission denied)
[ivy:cachepath] 	impossible to put metadata file in cache: /home/jenkins/.m2/repository/org/apache/apache/13/apache-13.pom
(13). java.io.FileNotFoundException: /home/jenkins/.ivy2/cache/org.apache/apache/ivy-13.xml
(Permission denied)
[ivy:cachepath] 	impossible to put metadata file in cache: /home/jenkins/.m2/repository/org/apache/commons/commons-parent/34/commons-parent-34.pom
(34). java.io.FileNotFoundException: /home/jenkins/.ivy2/cache/org.apache.commons/commons-parent/ivy-34.xml
(Permission denied)
[ivy:cachepath] 	impossible to put metadata file in cache: /home/jenkins/.m2/repository/commons-logging/commons-logging/1.2/commons-logging-1.2.pom
(1.2). java.io.FileNotFoundException: /home/jenkins/.ivy2/cache/commons-logging/commons-logging/ivy-1.2.xml
(Permission denied)
[ivy:cachepath] 	impossible to put metadata file in cache: /home/jenkins/.m2/repository/org/apache/apache/4/apache-4.pom
(4). java.io.FileNotFoundException: /home/jenkins/.ivy2/cache/org.apache/apache/ivy-4.xml
(Permission denied)
[ivy:cachepath] 	impossible to put metadata file in cache: /home/jenkins/.m2/repository/org/apache/commons/commons-parent/11/commons-parent-11.pom
(11). java.io.FileNotFoundException: /home/jenkins/.ivy2/cache/org.apache.commons/commons-parent/ivy-11.xml
(Permission denied)
[ivy:cachepath] 	impossible to put metadata file in cache: /home/jenkins/.m2/repository/commons-cli/commons-cli/1.2/commons-cli-1.2.pom
(1.2). java.io.FileNotFoundException: /home/jenkins/.ivy2/cache/commons-cli/commons-cli/ivy-1.2.xml
(Permission denied)
[ivy:cachepath] 	impossible to put metadata file in cache: /home/jenkins/.m2/repository/org/codehaus/jackson/jackson-mapper-asl/1.9.13/jackson-mapper-asl-1.9.13.pom
(1.9.13). java.io.FileNotFoundException: /home/jenkins/.ivy2/cache/org.codehaus.jackson/jackson-mapper-asl/ivy-1.9.13.xml
(Permission denied)
[ivy:cachepath] 	impossible to put metadata file in cache: /home/jenkins/.m2/repository/org/codehaus/jackson/jackson-core-asl/1.9.13/jackson-core-asl-1.9.13.pom
(1.9.13). java.io.FileNotFoundException: /home/jenkins/.ivy2/cache/org.codehaus.jackson/jackson-core-asl/ivy-1.9.13.xml
(Permission denied)
[ivy:cachepath] 	impossible to put metadata file in cache: /home/jenkins/.m2/repository/joda-time/joda-time/2.9.9/joda-time-2.9.9.pom
(2.9.9). java.io.FileNotFoundException: /home/jenkins/.ivy2/cache/joda-time/joda-time/ivy-2.9.9.xml
(Permission denied)
[ivy:cachepath] 	impossible to put metadata file in cache: /home/jenkins/.m2/repository/org/apache/zookeeper/zookeeper/3.4.5/zookeeper-3.4.5.pom
(3.4.5). java.io.FileNotFoundException: /home/jenkins/.ivy2/cache/org.apache.zookeeper/zookeeper/ivy-3.4.5.xml
(Permission denied)
[ivy:cachepath] 
[ivy:cachepath] :: USE VERBOSE OR DEBUG MESSAGE LEVEL FOR MORE DETAILS

init:
    [mkdir] Created dir: <https://builds.apache.org/job/Pig-trunk/ws/src-gen/org/apache/pig/impl/logicalLayer/parser>
    [mkdir] Created dir: <https://builds.apache.org/job/Pig-trunk/ws/src-gen/org/apache/pig/tools/pigscript/parser>
    [mkdir] Created dir: <https://builds.apache.org/job/Pig-trunk/ws/src-gen/org/apache/pig/tools/parameters>
    [mkdir] Created dir: <https://builds.apache.org/job/Pig-trunk/ws/build/classes>
    [mkdir] Created dir: <https://builds.apache.org/job/Pig-trunk/ws/build/test/classes>
    [mkdir] Created dir: <https://builds.apache.org/job/Pig-trunk/ws/test/org/apache/pig/test/utils/dotGraph/parser>
    [mkdir] Created dir: <https://builds.apache.org/job/Pig-trunk/ws/src-gen/org/apache/pig/data/parser>

cc-compile:
     [move] Moving 1 file to <https://builds.apache.org/job/Pig-trunk/ws/build/ivy/lib/Pig>
   [javacc] Java Compiler Compiler Version 4.2 (Parser Generator)
   [javacc] (type "javacc" with no arguments for help)
   [javacc] Reading from file <https://builds.apache.org/job/Pig-trunk/ws/src/org/apache/pig/tools/pigscript/parser/PigScriptParser.jj>
. . .
   [javacc] File "TokenMgrError.java" does not exist.  Will create one.
   [javacc] File "ParseException.java" does not exist.  Will create one.
   [javacc] File "Token.java" does not exist.  Will create one.
   [javacc] File "JavaCharStream.java" does not exist.  Will create one.
   [javacc] Parser generated successfully.
   [javacc] Java Compiler Compiler Version 4.2 (Parser Generator)
   [javacc] (type "javacc" with no arguments for help)
   [javacc] Reading from file <https://builds.apache.org/job/Pig-trunk/ws/src/org/apache/pig/tools/parameters/PigFileParser.jj>
. . .
   [javacc] Warning: Lookahead adequacy checking not being performed since option LOOKAHEAD
is more than 1.  Set option FORCE_LA_CHECK to true to force checking.
   [javacc] File "TokenMgrError.java" does not exist.  Will create one.
   [javacc] File "ParseException.java" does not exist.  Will create one.
   [javacc] File "Token.java" does not exist.  Will create one.
   [javacc] File "JavaCharStream.java" does not exist.  Will create one.
   [javacc] Parser generated with 0 errors and 1 warnings.
   [javacc] Java Compiler Compiler Version 4.2 (Parser Generator)
   [javacc] (type "javacc" with no arguments for help)
   [javacc] Reading from file <https://builds.apache.org/job/Pig-trunk/ws/src/org/apache/pig/tools/parameters/ParamLoader.jj>
. . .
   [javacc] File "TokenMgrError.java" is being rebuilt.
   [javacc] File "ParseException.java" is being rebuilt.
   [javacc] File "Token.java" is being rebuilt.
   [javacc] File "JavaCharStream.java" is being rebuilt.
   [javacc] Parser generated successfully.
   [jjtree] Java Compiler Compiler Version 4.2 (Tree Builder)
   [jjtree] (type "jjtree" with no arguments for help)
   [jjtree] Reading from file <https://builds.apache.org/job/Pig-trunk/ws/test/org/apache/pig/test/utils/dotGraph/DOTParser.jjt>
. . .
   [jjtree] File "Node.java" does not exist.  Will create one.
   [jjtree] File "SimpleNode.java" does not exist.  Will create one.
   [jjtree] File "DOTParserTreeConstants.java" does not exist.  Will create one.
   [jjtree] File "JJTDOTParserState.java" does not exist.  Will create one.
   [jjtree] Annotated grammar generated successfully in <https://builds.apache.org/job/Pig-trunk/ws/test/org/apache/pig/test/utils/dotGraph/parser/DOTParser.jj>
   [javacc] Java Compiler Compiler Version 4.2 (Parser Generator)
   [javacc] (type "javacc" with no arguments for help)
   [javacc] Reading from file <https://builds.apache.org/job/Pig-trunk/ws/test/org/apache/pig/test/utils/dotGraph/parser/DOTParser.jj>
. . .
   [javacc] File "TokenMgrError.java" does not exist.  Will create one.
   [javacc] File "ParseException.java" does not exist.  Will create one.
   [javacc] File "Token.java" does not exist.  Will create one.
   [javacc] File "SimpleCharStream.java" does not exist.  Will create one.
   [javacc] Parser generated successfully.
     [move] Moving 1 file to <https://builds.apache.org/job/Pig-trunk/ws/build/ivy/lib/Pig>

prepare:
    [mkdir] Created dir: <https://builds.apache.org/job/Pig-trunk/ws/src-gen/org/apache/pig/parser>

genLexer:

genParser:

genTreeParser:

gen:

compile:
     [echo] *** Building Main Sources ***
     [echo] *** To compile with all warnings enabled, supply -Dall.warnings=1 on command line
***
     [echo] *** Else, you will only be warned about deprecations ***
     [echo] *** Hadoop version used: 2 ; HBase version used: 1 ; Spark version used: 1 ***
    [javac] Compiling 1107 source files to <https://builds.apache.org/job/Pig-trunk/ws/build/classes>
    [javac] <https://builds.apache.org/job/Pig-trunk/ws/src/org/apache/pig/StoreFuncInterface.java>:167:
error: illegal start of type
    [javac]     default void addCredentials(Credentials credentials, Configuration conf) {
    [javac]     ^
    [javac] <https://builds.apache.org/job/Pig-trunk/ws/src/org/apache/pig/StoreFuncInterface.java>:167:
error: = expected
    [javac]     default void addCredentials(Credentials credentials, Configuration conf) {
    [javac]             ^
    [javac] <https://builds.apache.org/job/Pig-trunk/ws/src/org/apache/pig/StoreFuncInterface.java>:167:
error: ';' expected
    [javac]     default void addCredentials(Credentials credentials, Configuration conf) {
    [javac]                 ^
    [javac] <https://builds.apache.org/job/Pig-trunk/ws/src/org/apache/pig/StoreFuncInterface.java>:167:
error: illegal start of type
    [javac]     default void addCredentials(Credentials credentials, Configuration conf) {
    [javac]                                ^
    [javac] <https://builds.apache.org/job/Pig-trunk/ws/src/org/apache/pig/StoreFuncInterface.java>:167:
error: = expected
    [javac]     default void addCredentials(Credentials credentials, Configuration conf) {
    [javac]                                             ^
    [javac] <https://builds.apache.org/job/Pig-trunk/ws/src/org/apache/pig/StoreFuncInterface.java>:167:
error: illegal start of type
    [javac]     default void addCredentials(Credentials credentials, Configuration conf) {
    [javac]                                                        ^
    [javac] <https://builds.apache.org/job/Pig-trunk/ws/src/org/apache/pig/StoreFuncInterface.java>:167:
error: = expected
    [javac]     default void addCredentials(Credentials credentials, Configuration conf) {
    [javac]                                                                        ^
    [javac] <https://builds.apache.org/job/Pig-trunk/ws/src/org/apache/pig/StoreFuncInterface.java>:167:
error: illegal start of type
    [javac]     default void addCredentials(Credentials credentials, Configuration conf) {
    [javac]                                                                            ^
    [javac] <https://builds.apache.org/job/Pig-trunk/ws/src/org/apache/pig/StoreFuncInterface.java>:167:
error: <identifier> expected
    [javac]     default void addCredentials(Credentials credentials, Configuration conf) {
    [javac]                                                                             ^
    [javac] <https://builds.apache.org/job/Pig-trunk/ws/src/org/apache/pig/StoreFuncInterface.java>:168:
error: = expected
    [javac]     }
    [javac]     ^
    [javac] <https://builds.apache.org/job/Pig-trunk/ws/src/org/apache/pig/StoreFuncInterface.java>:168:
error: ';' expected
    [javac]     }
    [javac]      ^
    [javac] <https://builds.apache.org/job/Pig-trunk/ws/src/org/apache/pig/StoreFuncInterface.java>:169:
error: reached end of file while parsing
    [javac] }
    [javac]  ^
    [javac] 12 errors

BUILD FAILED
<https://builds.apache.org/job/Pig-trunk/ws/build.xml>:571: The following error occurred
while executing this line:
<https://builds.apache.org/job/Pig-trunk/ws/build.xml>:612: Compile failed; see the
compiler error output for details.

Total time: 1 minute 26 seconds
Build step 'Invoke Ant' marked build as failure
Recording test results
ERROR: Step ?Publish JUnit test result report? failed: No test report files were found. Configuration
error?

Mime
View raw message