pig-dev mailing list archives

Site index · List index
Message view « Date » · « Thread »
Top « Date » · « Thread »
From Apache Jenkins Server <jenk...@builds.apache.org>
Subject Build failed in Jenkins: Pig-trunk #2066
Date Sun, 31 Dec 2017 10:26:46 GMT
See <https://builds.apache.org/job/Pig-trunk/2066/display/redirect?page=changes>

Changes:

[rohini] PIG-5311: POReservoirSample fails for more than Integer.MAX_VALUE records (rohini)

------------------------------------------
[...truncated 19.44 KB...]
   [javacc] File "Token.java" does not exist.  Will create one.
   [javacc] File "SimpleCharStream.java" does not exist.  Will create one.
   [javacc] Parser generated successfully.
     [move] Moving 1 file to <https://builds.apache.org/job/Pig-trunk/ws/build/ivy/lib/Pig>

prepare:
    [mkdir] Created dir: <https://builds.apache.org/job/Pig-trunk/ws/src-gen/org/apache/pig/parser>

genLexer:

genParser:

genTreeParser:

gen:

compile:
     [echo] *** Building Main Sources ***
     [echo] *** To compile with all warnings enabled, supply -Dall.warnings=1 on command line
***
     [echo] *** Else, you will only be warned about deprecations ***
     [echo] *** Hadoop version used: 2 ; HBase version used: 1 ; Spark version used: 1 ***
    [javac] Compiling 1106 source files to <https://builds.apache.org/job/Pig-trunk/ws/build/classes>
    [javac] Note: Some input files use or override a deprecated API.
    [javac] Note: Recompile with -Xlint:deprecation for details.
    [javac] Note: Some input files use unchecked or unsafe operations.
    [javac] Note: Recompile with -Xlint:unchecked for details.
     [copy] Copying 1 file to <https://builds.apache.org/job/Pig-trunk/ws/build/classes/org/apache/pig/tools/grunt>
     [copy] Copying 1 file to <https://builds.apache.org/job/Pig-trunk/ws/build/classes/org/apache/pig/tools/grunt>
     [copy] Copying 2 files to <https://builds.apache.org/job/Pig-trunk/ws/build/classes/python>
     [copy] Copying 1 file to <https://builds.apache.org/job/Pig-trunk/ws/build/classes/META-INF>

ivy-buildJar:

jar-simple:
     [echo] svnString 1819722
      [jar] Building jar: <https://builds.apache.org/job/Pig-trunk/ws/build/pig-0.18.0-SNAPSHOT.jar>
     [echo] svnString 1819722
      [jar] Building jar: <https://builds.apache.org/job/Pig-trunk/ws/build/pig-0.18.0-SNAPSHOT-withouthadoop.jar>
      [jar] META-INF/native/linux32/libjansi.so already added, skipping
      [jar] META-INF/native/linux64/libjansi.so already added, skipping
      [jar] META-INF/native/osx/libjansi.jnilib already added, skipping
      [jar] META-INF/native/windows32/jansi.dll already added, skipping
      [jar] META-INF/native/windows64/jansi.dll already added, skipping
      [jar] org/fusesource/hawtjni/runtime/Callback.class already added, skipping
      [jar] org/fusesource/hawtjni/runtime/Library.class already added, skipping
      [jar] org/fusesource/hawtjni/runtime/PointerMath.class already added, skipping
      [jar] org/fusesource/jansi/Ansi$1.class already added, skipping
      [jar] org/fusesource/jansi/Ansi$2.class already added, skipping
      [jar] org/fusesource/jansi/Ansi$Attribute.class already added, skipping
      [jar] org/fusesource/jansi/Ansi$Color.class already added, skipping
      [jar] org/fusesource/jansi/Ansi$Erase.class already added, skipping
      [jar] org/fusesource/jansi/Ansi$NoAnsi.class already added, skipping
      [jar] org/fusesource/jansi/Ansi.class already added, skipping
      [jar] org/fusesource/jansi/AnsiConsole$1.class already added, skipping
      [jar] org/fusesource/jansi/AnsiConsole.class already added, skipping
      [jar] org/fusesource/jansi/AnsiOutputStream.class already added, skipping
      [jar] org/fusesource/jansi/AnsiRenderWriter.class already added, skipping
      [jar] org/fusesource/jansi/AnsiRenderer$Code.class already added, skipping
      [jar] org/fusesource/jansi/AnsiRenderer.class already added, skipping
      [jar] org/fusesource/jansi/AnsiString.class already added, skipping
      [jar] org/fusesource/jansi/HtmlAnsiOutputStream.class already added, skipping
      [jar] org/fusesource/jansi/WindowsAnsiOutputStream.class already added, skipping
      [jar] org/fusesource/jansi/internal/CLibrary.class already added, skipping
      [jar] org/fusesource/jansi/internal/Kernel32$CONSOLE_SCREEN_BUFFER_INFO.class already
added, skipping
      [jar] org/fusesource/jansi/internal/Kernel32$COORD.class already added, skipping
      [jar] org/fusesource/jansi/internal/Kernel32$INPUT_RECORD.class already added, skipping
      [jar] org/fusesource/jansi/internal/Kernel32$KEY_EVENT_RECORD.class already added, skipping
      [jar] org/fusesource/jansi/internal/Kernel32$SMALL_RECT.class already added, skipping
      [jar] org/fusesource/jansi/internal/Kernel32.class already added, skipping
      [jar] org/fusesource/jansi/internal/WindowsSupport.class already added, skipping
Trying to override old definition of task propertycopy
Trying to override old definition of task propertycopy

copyCommonDependencies:
    [mkdir] Created dir: <https://builds.apache.org/job/Pig-trunk/ws/lib>
     [copy] Copying 47 files to <https://builds.apache.org/job/Pig-trunk/ws/lib>
Trying to override old definition of task propertycopy
Trying to override old definition of task propertycopy

copySparkDependencies:
    [mkdir] Created dir: <https://builds.apache.org/job/Pig-trunk/ws/lib/spark>
     [copy] Copying 79 files to <https://builds.apache.org/job/Pig-trunk/ws/lib/spark>
Trying to override old definition of task propertycopy
Trying to override old definition of task propertycopy

copyh2Dependencies:
    [mkdir] Created dir: <https://builds.apache.org/job/Pig-trunk/ws/lib/h2>
     [copy] Copying 12 files to <https://builds.apache.org/job/Pig-trunk/ws/lib/h2>
     [copy] Copying 1 file to <https://builds.apache.org/job/Pig-trunk/ws/>
    [mkdir] Created dir: <https://builds.apache.org/job/Pig-trunk/ws/legacy>
     [move] Moving 1 file to <https://builds.apache.org/job/Pig-trunk/ws/legacy>
Trying to override old definition of task propertycopy
Trying to override old definition of task propertycopy

copyHadoop2LocalRuntimeDependencies:
    [mkdir] Created dir: <https://builds.apache.org/job/Pig-trunk/ws/lib/hadoop2-runtime>
     [copy] Copying 33 files to <https://builds.apache.org/job/Pig-trunk/ws/lib/hadoop2-runtime>

ivy-test:

compile-test:
     [echo] *** Building Test Sources ***
     [echo] *** To compile with all warnings enabled, supply -Dall.warnings=1 on command line
***
     [echo] *** Else, you will only be warned about deprecations ***
    [javac] Compiling 444 source files to <https://builds.apache.org/job/Pig-trunk/ws/build/test/classes>
    [javac] Note: Some input files use or override a deprecated API.
    [javac] Note: Recompile with -Xlint:deprecation for details.
    [javac] Note: Some input files use unchecked or unsafe operations.
    [javac] Note: Recompile with -Xlint:unchecked for details.
     [copy] Copying 1 file to <https://builds.apache.org/job/Pig-trunk/ws/build/test/classes>

pigtest-jar:
     [echo]  *** Creating pigtest.jar ***
      [jar] Building jar: <https://builds.apache.org/job/Pig-trunk/ws/pigtest.jar>

debugger.set:

debugger.unset:

debugger.check:

test-commit:
    [mkdir] Created dir: <https://builds.apache.org/job/Pig-trunk/ws/build/test/logs>
    [mkdir] Created dir: /tmp/pig_junit_tmp206779371
     [echo] Tests in <https://builds.apache.org/job/Pig-trunk/ws/test/excluded-tests-mr>
will be excluded
    [junit] Running org.apache.pig.builtin.TestSUBTRACT
    [junit] Tests run: 3, Failures: 0, Errors: 0, Time elapsed: 0.225 sec
    [junit] Running org.apache.pig.test.TestAdd
    [junit] Tests run: 1, Failures: 0, Errors: 0, Time elapsed: 0.388 sec
    [junit] Running org.apache.pig.test.TestBagFormat
    [junit] Tests run: 1, Failures: 0, Errors: 0, Time elapsed: 0.323 sec
    [junit] Running org.apache.pig.test.TestBoolean
    [junit] Tests run: 13, Failures: 0, Errors: 0, Time elapsed: 0.421 sec
    [junit] Running org.apache.pig.test.TestBuiltin
    [junit] Tests run: 75, Failures: 0, Errors: 11, Time elapsed: 145.8 sec
    [junit] Test org.apache.pig.test.TestBuiltin FAILED
    [junit] Running org.apache.pig.test.TestCase
    [junit] Tests run: 10, Failures: 0, Errors: 6, Time elapsed: 5.746 sec
    [junit] Test org.apache.pig.test.TestCase FAILED
    [junit] Running org.apache.pig.test.TestCmdLineParser
    [junit] Tests run: 17, Failures: 0, Errors: 0, Time elapsed: 0.388 sec
    [junit] Running org.apache.pig.test.TestCommit
    [junit] Tests run: 2, Failures: 0, Errors: 2, Time elapsed: 3.867 sec
    [junit] Test org.apache.pig.test.TestCommit FAILED
    [junit] Running org.apache.pig.test.TestConstExpr
    [junit] Tests run: 10, Failures: 0, Errors: 0, Time elapsed: 0.47 sec
    [junit] Running org.apache.pig.test.TestConversions
    [junit] Tests run: 23, Failures: 0, Errors: 0, Time elapsed: 1.2 sec
    [junit] Running org.apache.pig.test.TestDataBag
    [junit] Tests run: 33, Failures: 0, Errors: 0, Time elapsed: 1.369 sec
    [junit] Running org.apache.pig.test.TestDataModel
    [junit] Tests run: 27, Failures: 0, Errors: 0, Time elapsed: 0.753 sec
    [junit] Running org.apache.pig.test.TestDeleteOnFail
    [junit] Tests run: 5, Failures: 0, Errors: 0, Time elapsed: 0.277 sec
    [junit] Running org.apache.pig.test.TestDivide
    [junit] Tests run: 1, Failures: 0, Errors: 0, Time elapsed: 0.392 sec
    [junit] Running org.apache.pig.test.TestEqualTo
    [junit] Tests run: 28, Failures: 0, Errors: 0, Time elapsed: 0.625 sec
    [junit] Running org.apache.pig.test.TestExampleGenerator
    [junit] Tests run: 26, Failures: 0, Errors: 0, Time elapsed: 13.221 sec
    [junit] Running org.apache.pig.test.TestForEach
    [junit] Tests run: 1, Failures: 0, Errors: 0, Time elapsed: 0.344 sec
    [junit] Running org.apache.pig.test.TestFuncSpec
    [junit] Tests run: 4, Failures: 0, Errors: 0, Time elapsed: 0.333 sec
    [junit] Running org.apache.pig.test.TestGTOrEqual
    [junit] Tests run: 28, Failures: 0, Errors: 0, Time elapsed: 0.614 sec
    [junit] Running org.apache.pig.test.TestGreaterThan
    [junit] Tests run: 28, Failures: 0, Errors: 0, Time elapsed: 0.602 sec
    [junit] Running org.apache.pig.test.TestIn
    [junit] Tests run: 5, Failures: 0, Errors: 4, Time elapsed: 4.86 sec
    [junit] Test org.apache.pig.test.TestIn FAILED
    [junit] Running org.apache.pig.test.TestInputOutputFileValidator
    [junit] Tests run: 4, Failures: 0, Errors: 1, Time elapsed: 3.773 sec
    [junit] Test org.apache.pig.test.TestInputOutputFileValidator FAILED
    [junit] Running org.apache.pig.test.TestInstantiateFunc
    [junit] Tests run: 5, Failures: 0, Errors: 0, Time elapsed: 0.338 sec
    [junit] Running org.apache.pig.test.TestLOLoadDeterminedSchema
    [junit] Tests run: 1, Failures: 0, Errors: 1, Time elapsed: 2.818 sec
    [junit] Test org.apache.pig.test.TestLOLoadDeterminedSchema FAILED
    [junit] Running org.apache.pig.test.TestLTOrEqual
    [junit] Tests run: 28, Failures: 0, Errors: 0, Time elapsed: 0.751 sec
    [junit] Running org.apache.pig.test.TestLessThan
    [junit] Tests run: 28, Failures: 0, Errors: 0, Time elapsed: 0.72 sec
    [junit] Running org.apache.pig.test.TestLoad
    [junit] Tests run: 15, Failures: 0, Errors: 0, Time elapsed: 98.802 sec
    [junit] Running org.apache.pig.test.TestLocalRearrange
    [junit] Tests run: 3, Failures: 0, Errors: 0, Time elapsed: 70.993 sec
    [junit] Running org.apache.pig.test.TestLogToPhyCompiler
    [junit] Tests run: 19, Failures: 0, Errors: 0, Time elapsed: 5.202 sec
    [junit] Running org.apache.pig.test.TestLogicalPlanBuilder
    [junit] Tests run: 156, Failures: 0, Errors: 0, Time elapsed: 20.32 sec
    [junit] Running org.apache.pig.test.TestMRCompiler
    [junit] Tests run: 32, Failures: 0, Errors: 0, Time elapsed: 31.489 sec
    [junit] Running org.apache.pig.test.TestMod
    [junit] Tests run: 1, Failures: 0, Errors: 0, Time elapsed: 0.391 sec
    [junit] Running org.apache.pig.test.TestMultiQueryLocal
    [junit] Tests run: 16, Failures: 4, Errors: 2, Time elapsed: 9.931 sec
    [junit] Test org.apache.pig.test.TestMultiQueryLocal FAILED
    [junit] Running org.apache.pig.test.TestMultiply
    [junit] Tests run: 1, Failures: 0, Errors: 0, Time elapsed: 0.388 sec
    [junit] Running org.apache.pig.test.TestNotEqualTo
    [junit] Tests run: 28, Failures: 0, Errors: 0, Time elapsed: 0.602 sec
    [junit] Running org.apache.pig.test.TestNull
    [junit] Tests run: 2, Failures: 0, Errors: 0, Time elapsed: 0.417 sec
    [junit] Running org.apache.pig.test.TestPOBinCond
    [junit] Tests run: 10, Failures: 0, Errors: 0, Time elapsed: 0.506 sec
    [junit] Running org.apache.pig.test.TestPOCast
    [junit] Tests run: 14, Failures: 0, Errors: 0, Time elapsed: 0.979 sec
    [junit] Running org.apache.pig.test.TestPODistinct
    [junit] Tests run: 6, Failures: 0, Errors: 0, Time elapsed: 0.4 sec
    [junit] Running org.apache.pig.test.TestPOGenerate
    [junit] Tests run: 4, Failures: 0, Errors: 0, Time elapsed: 0.36 sec
    [junit] Running org.apache.pig.test.TestPOMapLookUp
    [junit] Tests run: 1, Failures: 0, Errors: 0, Time elapsed: 0.324 sec
    [junit] Running org.apache.pig.test.TestPOSort
    [junit] Tests run: 15, Failures: 0, Errors: 0, Time elapsed: 0.484 sec
    [junit] Running org.apache.pig.test.TestPOUserFunc
    [junit] Tests run: 6, Failures: 0, Errors: 0, Time elapsed: 0.43 sec
    [junit] Running org.apache.pig.test.TestParamSubPreproc
    [junit] Tests run: 44, Failures: 4, Errors: 2, Time elapsed: 8.63 sec
    [junit] Test org.apache.pig.test.TestParamSubPreproc FAILED
    [junit] Running org.apache.pig.test.TestPhyOp
    [junit] Tests run: 1, Failures: 0, Errors: 0, Time elapsed: 0.41 sec
    [junit] Running org.apache.pig.test.TestPigScriptParser
    [junit] Tests run: 7, Failures: 0, Errors: 4, Time elapsed: 5.238 sec
    [junit] Test org.apache.pig.test.TestPigScriptParser FAILED
    [junit] Running org.apache.pig.test.TestPigServer
    [junit] Tests run: 32, Failures: 0, Errors: 0, Time elapsed: 87.983 sec
    [junit] Running org.apache.pig.test.TestPoissonSampleLoader
    [junit] Tests run: 1, Failures: 0, Errors: 1, Time elapsed: 2.799 sec
    [junit] Test org.apache.pig.test.TestPoissonSampleLoader FAILED
    [junit] Running org.apache.pig.test.TestRegexp
    [junit] Tests run: 2, Failures: 0, Errors: 0, Time elapsed: 0.318 sec
    [junit] Running org.apache.pig.test.TestSchema
    [junit] Tests run: 34, Failures: 0, Errors: 0, Time elapsed: 196.075 sec
    [junit] Running org.apache.pig.test.TestSchemaUtil
    [junit] Tests run: 2, Failures: 0, Errors: 0, Time elapsed: 0.31 sec
    [junit] Running org.apache.pig.test.TestStore
    [junit] Tests run: 18, Failures: 0, Errors: 0, Time elapsed: 360.107 sec
    [junit] Running org.apache.pig.test.TestStringUDFs
    [junit] Tests run: 17, Failures: 0, Errors: 0, Time elapsed: 0.367 sec
   [delete] Deleting directory /tmp/pig_junit_tmp206779371

BUILD FAILED
<https://builds.apache.org/job/Pig-trunk/ws/build.xml>:903: Tests failed!

Total time: 21 minutes 14 seconds
Build step 'Invoke Ant' marked build as failure
Recording test results

Mime
View raw message