pig-dev mailing list archives

Site index · List index
Message view « Date » · « Thread »
Top « Date » · « Thread »
From Apache Jenkins Server <jenk...@builds.apache.org>
Subject Build failed in Jenkins: Pig-trunk #1922
Date Wed, 15 Jun 2016 03:52:43 GMT
See <https://builds.apache.org/job/Pig-trunk/1922/changes>

Changes:

[knoguchi] PIG-2315: Make as clause work in generate (daijy via knoguchi)

[rohini] Fix unit tests for PIG-2768

------------------------------------------
[...truncated 52 lines...]
[ivy:configure] :: loading settings :: file = <https://builds.apache.org/job/Pig-trunk/ws/ivy/ivysettings.xml>

ivy-resolve:

ivy-compile:
[ivy:cachepath] DEPRECATED: 'ivy.conf.file' is deprecated, use 'ivy.settings.file' instead
[ivy:cachepath] :: loading settings :: file = <https://builds.apache.org/job/Pig-trunk/ws/ivy/ivysettings.xml>

init:
    [mkdir] Created dir: <https://builds.apache.org/job/Pig-trunk/ws/src-gen/org/apache/pig/impl/logicalLayer/parser>
    [mkdir] Created dir: <https://builds.apache.org/job/Pig-trunk/ws/src-gen/org/apache/pig/tools/pigscript/parser>
    [mkdir] Created dir: <https://builds.apache.org/job/Pig-trunk/ws/src-gen/org/apache/pig/tools/parameters>
    [mkdir] Created dir: <https://builds.apache.org/job/Pig-trunk/ws/build/classes>
    [mkdir] Created dir: <https://builds.apache.org/job/Pig-trunk/ws/build/test/classes>
    [mkdir] Created dir: <https://builds.apache.org/job/Pig-trunk/ws/test/org/apache/pig/test/utils/dotGraph/parser>
    [mkdir] Created dir: <https://builds.apache.org/job/Pig-trunk/ws/src-gen/org/apache/pig/data/parser>
     [move] Moving 1 file to <https://builds.apache.org/job/Pig-trunk/ws/build/ivy/lib/Pig>

cc-compile:
   [javacc] Java Compiler Compiler Version 4.2 (Parser Generator)
   [javacc] (type "javacc" with no arguments for help)
   [javacc] Reading from file <https://builds.apache.org/job/Pig-trunk/ws/src/org/apache/pig/tools/pigscript/parser/PigScriptParser.jj>
. . .
   [javacc] File "TokenMgrError.java" does not exist.  Will create one.
   [javacc] File "ParseException.java" does not exist.  Will create one.
   [javacc] File "Token.java" does not exist.  Will create one.
   [javacc] File "JavaCharStream.java" does not exist.  Will create one.
   [javacc] Parser generated successfully.
   [javacc] Java Compiler Compiler Version 4.2 (Parser Generator)
   [javacc] (type "javacc" with no arguments for help)
   [javacc] Reading from file <https://builds.apache.org/job/Pig-trunk/ws/src/org/apache/pig/tools/parameters/PigFileParser.jj>
. . .
   [javacc] Warning: Lookahead adequacy checking not being performed since option LOOKAHEAD
is more than 1.  Set option FORCE_LA_CHECK to true to force checking.
   [javacc] File "TokenMgrError.java" does not exist.  Will create one.
   [javacc] File "ParseException.java" does not exist.  Will create one.
   [javacc] File "Token.java" does not exist.  Will create one.
   [javacc] File "JavaCharStream.java" does not exist.  Will create one.
   [javacc] Parser generated with 0 errors and 1 warnings.
   [javacc] Java Compiler Compiler Version 4.2 (Parser Generator)
   [javacc] (type "javacc" with no arguments for help)
   [javacc] Reading from file <https://builds.apache.org/job/Pig-trunk/ws/src/org/apache/pig/tools/parameters/ParamLoader.jj>
. . .
   [javacc] File "TokenMgrError.java" is being rebuilt.
   [javacc] File "ParseException.java" is being rebuilt.
   [javacc] File "Token.java" is being rebuilt.
   [javacc] File "JavaCharStream.java" is being rebuilt.
   [javacc] Parser generated successfully.
   [jjtree] Java Compiler Compiler Version 4.2 (Tree Builder)
   [jjtree] (type "jjtree" with no arguments for help)
   [jjtree] Reading from file <https://builds.apache.org/job/Pig-trunk/ws/test/org/apache/pig/test/utils/dotGraph/DOTParser.jjt>
. . .
   [jjtree] File "Node.java" does not exist.  Will create one.
   [jjtree] File "SimpleNode.java" does not exist.  Will create one.
   [jjtree] File "DOTParserTreeConstants.java" does not exist.  Will create one.
   [jjtree] File "JJTDOTParserState.java" does not exist.  Will create one.
   [jjtree] Annotated grammar generated successfully in <https://builds.apache.org/job/Pig-trunk/ws/test/org/apache/pig/test/utils/dotGraph/parser/DOTParser.jj>
   [javacc] Java Compiler Compiler Version 4.2 (Parser Generator)
   [javacc] (type "javacc" with no arguments for help)
   [javacc] Reading from file <https://builds.apache.org/job/Pig-trunk/ws/test/org/apache/pig/test/utils/dotGraph/parser/DOTParser.jj>
. . .
   [javacc] File "TokenMgrError.java" does not exist.  Will create one.
   [javacc] File "ParseException.java" does not exist.  Will create one.
   [javacc] File "Token.java" does not exist.  Will create one.
   [javacc] File "SimpleCharStream.java" does not exist.  Will create one.
   [javacc] Parser generated successfully.

prepare:
    [mkdir] Created dir: <https://builds.apache.org/job/Pig-trunk/ws/src-gen/org/apache/pig/parser>

genLexer:

genParser:

genTreeParser:

gen:

compile:
     [echo] *** Building Main Sources ***
     [echo] *** To compile with all warnings enabled, supply -Dall.warnings=1 on command line
***
     [echo] *** Else, you will only be warned about deprecations ***
    [javac] Compiling 1012 source files to <https://builds.apache.org/job/Pig-trunk/ws/build/classes>
    [javac] /home/jenkins/.ivy2/cache/org.apache.hbase/hbase-common/jars/hbase-common-0.98.12-hadoop2.jar(org/apache/hadoop/hbase/io/ImmutableBytesWritable.class):
warning: Cannot find annotation method 'value()' in type 'SuppressWarnings': class file for
edu.umd.cs.findbugs.annotations.SuppressWarnings not found
    [javac] /home/jenkins/.ivy2/cache/org.apache.hbase/hbase-common/jars/hbase-common-0.98.12-hadoop2.jar(org/apache/hadoop/hbase/io/ImmutableBytesWritable.class):
warning: Cannot find annotation method 'justification()' in type 'SuppressWarnings'
    [javac] Note: Some input files use or override a deprecated API.
    [javac] Note: Recompile with -Xlint:deprecation for details.
    [javac] Note: Some input files use unchecked or unsafe operations.
    [javac] Note: Recompile with -Xlint:unchecked for details.
    [javac] 2 warnings
     [copy] Copying 1 file to <https://builds.apache.org/job/Pig-trunk/ws/build/classes/org/apache/pig/tools/grunt>
     [copy] Copying 1 file to <https://builds.apache.org/job/Pig-trunk/ws/build/classes/org/apache/pig/tools/grunt>
     [copy] Copying 2 files to <https://builds.apache.org/job/Pig-trunk/ws/build/classes/python>
     [copy] Copying 2 files to <https://builds.apache.org/job/Pig-trunk/ws/build/classes/META-INF>

ivy-buildJar:

jar:
     [echo] svnString 1748484
      [jar] Building jar: <https://builds.apache.org/job/Pig-trunk/ws/build/pig-0.17.0-SNAPSHOT.jar>
     [echo] svnString 1748484
      [jar] Building jar: <https://builds.apache.org/job/Pig-trunk/ws/build/pig-0.17.0-SNAPSHOT-withouthadoop.jar>

copyCommonDependencies:
    [mkdir] Created dir: <https://builds.apache.org/job/Pig-trunk/ws/lib>
     [copy] Copying 37 files to <https://builds.apache.org/job/Pig-trunk/ws/lib>

copyh1Dependencies:

copyh2Dependencies:
    [mkdir] Created dir: <https://builds.apache.org/job/Pig-trunk/ws/lib/h2>
     [copy] Copying 16 files to <https://builds.apache.org/job/Pig-trunk/ws/lib/h2>
     [copy] Copying 1 file to <https://builds.apache.org/job/Pig-trunk/ws/>
    [mkdir] Created dir: <https://builds.apache.org/job/Pig-trunk/ws/legacy>
     [move] Moving 1 file to <https://builds.apache.org/job/Pig-trunk/ws/legacy>

ivy-test:

compile-test:
     [echo] *** Building Test Sources ***
     [echo] *** To compile with all warnings enabled, supply -Dall.warnings=1 on command line
***
     [echo] *** Else, you will only be warned about deprecations ***
    [javac] Compiling 433 source files to <https://builds.apache.org/job/Pig-trunk/ws/build/test/classes>
    [javac] Note: Some input files use or override a deprecated API.
    [javac] Note: Recompile with -Xlint:deprecation for details.
    [javac] Note: Some input files use unchecked or unsafe operations.
    [javac] Note: Recompile with -Xlint:unchecked for details.
     [copy] Copying 1 file to <https://builds.apache.org/job/Pig-trunk/ws/build/test/classes>

debugger.set:

debugger.unset:

debugger.check:

test-commit:
    [mkdir] Created dir: <https://builds.apache.org/job/Pig-trunk/ws/build/test/logs>
    [mkdir] Created dir: /tmp/pig_junit_tmp1648382007
     [echo] Tests in <https://builds.apache.org/job/Pig-trunk/ws/test/excluded-tests-mr>
will be excluded
    [junit] Running org.apache.pig.builtin.TestSUBTRACT
    [junit] Tests run: 3, Failures: 0, Errors: 0, Time elapsed: 0.353 sec
    [junit] Running org.apache.pig.test.TestAdd
    [junit] Tests run: 1, Failures: 0, Errors: 0, Time elapsed: 0.548 sec
    [junit] Running org.apache.pig.test.TestBagFormat
    [junit] Tests run: 1, Failures: 0, Errors: 0, Time elapsed: 0.415 sec
    [junit] Running org.apache.pig.test.TestBoolean
    [junit] Tests run: 13, Failures: 0, Errors: 0, Time elapsed: 0.58 sec
    [junit] Running org.apache.pig.test.TestBuiltin
    [junit] Tests run: 75, Failures: 0, Errors: 0, Time elapsed: 154.146 sec
    [junit] Running org.apache.pig.test.TestCase
    [junit] Tests run: 10, Failures: 0, Errors: 0, Time elapsed: 9.594 sec
    [junit] Running org.apache.pig.test.TestCmdLineParser
    [junit] Tests run: 17, Failures: 0, Errors: 0, Time elapsed: 0.499 sec
    [junit] Running org.apache.pig.test.TestCommit
    [junit] Tests run: 2, Failures: 0, Errors: 0, Time elapsed: 10.738 sec
    [junit] Running org.apache.pig.test.TestConstExpr
    [junit] Tests run: 10, Failures: 0, Errors: 0, Time elapsed: 0.67 sec
    [junit] Running org.apache.pig.test.TestConversions
    [junit] Tests run: 23, Failures: 0, Errors: 0, Time elapsed: 1.473 sec
    [junit] Running org.apache.pig.test.TestDataBag
    [junit] Tests run: 28, Failures: 0, Errors: 0, Time elapsed: 1.267 sec
    [junit] Running org.apache.pig.test.TestDataModel
    [junit] Tests run: 25, Failures: 0, Errors: 0, Time elapsed: 0.678 sec
    [junit] Running org.apache.pig.test.TestDeleteOnFail
    [junit] Tests run: 5, Failures: 0, Errors: 0, Time elapsed: 0.349 sec
    [junit] Running org.apache.pig.test.TestDivide
    [junit] Tests run: 1, Failures: 0, Errors: 0, Time elapsed: 0.505 sec
    [junit] Running org.apache.pig.test.TestEqualTo
    [junit] Tests run: 28, Failures: 0, Errors: 0, Time elapsed: 0.89 sec
    [junit] Running org.apache.pig.test.TestExampleGenerator
    [junit] Tests run: 26, Failures: 0, Errors: 0, Time elapsed: 17.402 sec
    [junit] Running org.apache.pig.test.TestForEach
    [junit] Tests run: 1, Failures: 0, Errors: 0, Time elapsed: 0.504 sec
    [junit] Running org.apache.pig.test.TestFuncSpec
    [junit] Tests run: 4, Failures: 0, Errors: 0, Time elapsed: 0.482 sec
    [junit] Running org.apache.pig.test.TestGTOrEqual
    [junit] Tests run: 28, Failures: 0, Errors: 0, Time elapsed: 0.826 sec
    [junit] Running org.apache.pig.test.TestGreaterThan
    [junit] Tests run: 28, Failures: 0, Errors: 0, Time elapsed: 0.803 sec
    [junit] Running org.apache.pig.test.TestIn
    [junit] Tests run: 5, Failures: 0, Errors: 0, Time elapsed: 7.8 sec
    [junit] Running org.apache.pig.test.TestInputOutputFileValidator
    [junit] Tests run: 4, Failures: 0, Errors: 0, Time elapsed: 5.925 sec
    [junit] Running org.apache.pig.test.TestInstantiateFunc
    [junit] Tests run: 5, Failures: 0, Errors: 0, Time elapsed: 0.451 sec
    [junit] Running org.apache.pig.test.TestLOLoadDeterminedSchema
    [junit] Tests run: 1, Failures: 0, Errors: 0, Time elapsed: 4.854 sec
    [junit] Running org.apache.pig.test.TestLTOrEqual
    [junit] Tests run: 28, Failures: 0, Errors: 0, Time elapsed: 0.806 sec
    [junit] Running org.apache.pig.test.TestLessThan
    [junit] Tests run: 28, Failures: 0, Errors: 0, Time elapsed: 0.786 sec
    [junit] Running org.apache.pig.test.TestLoad
    [junit] Tests run: 15, Failures: 0, Errors: 2, Time elapsed: 112.441 sec
    [junit] Test org.apache.pig.test.TestLoad FAILED
    [junit] Running org.apache.pig.test.TestLocalRearrange
    [junit] Tests run: 3, Failures: 0, Errors: 0, Time elapsed: 61.802 sec
    [junit] Running org.apache.pig.test.TestLogToPhyCompiler
    [junit] Tests run: 19, Failures: 0, Errors: 0, Time elapsed: 6.857 sec
    [junit] Running org.apache.pig.test.TestLogicalPlanBuilder
    [junit] Tests run: 154, Failures: 1, Errors: 0, Time elapsed: 26.485 sec
    [junit] Test org.apache.pig.test.TestLogicalPlanBuilder FAILED
    [junit] Running org.apache.pig.test.TestMRCompiler
    [junit] Tests run: 32, Failures: 0, Errors: 0, Time elapsed: 36.79 sec
    [junit] Running org.apache.pig.test.TestMod
    [junit] Tests run: 1, Failures: 0, Errors: 0, Time elapsed: 0.516 sec
    [junit] Running org.apache.pig.test.TestMultiQueryLocal
    [junit] Tests run: 16, Failures: 0, Errors: 0, Time elapsed: 20.041 sec
    [junit] Running org.apache.pig.test.TestMultiply
    [junit] Tests run: 1, Failures: 0, Errors: 0, Time elapsed: 0.509 sec
    [junit] Running org.apache.pig.test.TestNotEqualTo
    [junit] Tests run: 28, Failures: 0, Errors: 0, Time elapsed: 0.801 sec
    [junit] Running org.apache.pig.test.TestNull
    [junit] Tests run: 2, Failures: 0, Errors: 0, Time elapsed: 0.546 sec
    [junit] Running org.apache.pig.test.TestPOBinCond
    [junit] Tests run: 10, Failures: 0, Errors: 0, Time elapsed: 0.63 sec
    [junit] Running org.apache.pig.test.TestPOCast
    [junit] Tests run: 14, Failures: 0, Errors: 0, Time elapsed: 1.108 sec
    [junit] Running org.apache.pig.test.TestPODistinct
    [junit] Tests run: 6, Failures: 0, Errors: 0, Time elapsed: 0.547 sec
    [junit] Running org.apache.pig.test.TestPOGenerate
    [junit] Tests run: 3, Failures: 0, Errors: 0, Time elapsed: 0.512 sec
    [junit] Running org.apache.pig.test.TestPOMapLookUp
    [junit] Tests run: 1, Failures: 0, Errors: 0, Time elapsed: 0.408 sec
    [junit] Running org.apache.pig.test.TestPOSort
    [junit] Tests run: 14, Failures: 0, Errors: 0, Time elapsed: 0.649 sec
    [junit] Running org.apache.pig.test.TestPOUserFunc
    [junit] Tests run: 6, Failures: 0, Errors: 0, Time elapsed: 0.542 sec
    [junit] Running org.apache.pig.test.TestParamSubPreproc
    [junit] Tests run: 38, Failures: 0, Errors: 0, Time elapsed: 6.365 sec
    [junit] Running org.apache.pig.test.TestPhyOp
    [junit] Tests run: 1, Failures: 0, Errors: 0, Time elapsed: 0.566 sec
    [junit] Running org.apache.pig.test.TestPigScriptParser
    [junit] Tests run: 7, Failures: 0, Errors: 0, Time elapsed: 7.877 sec
    [junit] Running org.apache.pig.test.TestPigServer
    [junit] Tests run: 31, Failures: 0, Errors: 0, Time elapsed: 101.389 sec
    [junit] Running org.apache.pig.test.TestPoissonSampleLoader
    [junit] Tests run: 1, Failures: 0, Errors: 0, Time elapsed: 4.69 sec
    [junit] Running org.apache.pig.test.TestRegexp
    [junit] Tests run: 2, Failures: 0, Errors: 0, Time elapsed: 0.44 sec
    [junit] Running org.apache.pig.test.TestSchema
    [junit] Tests run: 31, Failures: 0, Errors: 0, Time elapsed: 88.34 sec
    [junit] Running org.apache.pig.test.TestSchemaUtil
    [junit] Tests run: 2, Failures: 0, Errors: 0, Time elapsed: 0.415 sec
    [junit] Running org.apache.pig.test.TestStore
    [junit] Tests run: 18, Failures: 0, Errors: 0, Time elapsed: 413.896 sec
    [junit] Running org.apache.pig.test.TestStringUDFs
    [junit] Tests run: 17, Failures: 0, Errors: 0, Time elapsed: 0.493 sec
   [delete] Deleting directory /tmp/pig_junit_tmp1648382007

BUILD FAILED
<https://builds.apache.org/job/Pig-trunk/ws/build.xml>:880: Tests failed!

Total time: 22 minutes 23 seconds
Build step 'Invoke Ant' marked build as failure
Recording test results

Mime
View raw message