pig-dev mailing list archives

Site index · List index
Message view « Date » · « Thread »
Top « Date » · « Thread »
From Apache Jenkins Server <jenk...@builds.apache.org>
Subject Build failed in Jenkins: Pig-trunk-commit #2216
Date Thu, 06 Aug 2015 10:23:22 GMT
See <https://builds.apache.org/job/Pig-trunk-commit/2216/changes>

Changes:

[daijy] Rollback PIG-4623: Fixed the 'new line' character inside double-quote causing the
csv parsing failure

[daijy] PIG-4650: ant mvn-deploy target is broken

[daijy] PIG-4623: Fixed the 'new line' character inside double-quote causing the csv parsing
failure

[rohini] PIG-4649: [Pig on Tez] Union followed by HCatStorer misses some data (rohini)

[daijy] PIG-4639: Add better parser for Apache HTTPD access log

[daijy] PIG-4638: Allow TOMAP to accept dynamically sized input

[daijy] PIG-4405: Adding 'map[]' support to mock/Storage

------------------------------------------
[...truncated 4426 lines...]
    [junit] Tests run: 3, Failures: 0, Errors: 0, Skipped: 0, Time elapsed: 35.053 sec
    [junit] Running org.apache.pig.test.TestNewPlanListener
    [junit] Tests run: 4, Failures: 0, Errors: 0, Skipped: 0, Time elapsed: 0.371 sec
    [junit] Running org.apache.pig.test.TestNewPlanLogToPhyTranslationVisitor
    [junit] Tests run: 27, Failures: 0, Errors: 0, Skipped: 0, Time elapsed: 4.802 sec
    [junit] Running org.apache.pig.test.TestNewPlanLogicalOptimizer
    [junit] Tests run: 1, Failures: 0, Errors: 0, Skipped: 0, Time elapsed: 1.359 sec
    [junit] Running org.apache.pig.test.TestNewPlanOperatorPlan
    [junit] Tests run: 47, Failures: 0, Errors: 0, Skipped: 0, Time elapsed: 4.068 sec
    [junit] Running org.apache.pig.test.TestNewPlanPruneMapKeys
    [junit] Tests run: 8, Failures: 0, Errors: 0, Skipped: 0, Time elapsed: 3.028 sec
    [junit] Running org.apache.pig.test.TestNewPlanPushDownForeachFlatten
    [junit] Tests run: 45, Failures: 0, Errors: 0, Skipped: 0, Time elapsed: 7.079 sec
    [junit] Running org.apache.pig.test.TestNewPlanPushUpFilter
    [junit] Tests run: 46, Failures: 0, Errors: 0, Skipped: 0, Time elapsed: 7.024 sec
    [junit] Running org.apache.pig.test.TestNewPlanRule
    [junit] Tests run: 4, Failures: 0, Errors: 0, Skipped: 0, Time elapsed: 0.331 sec
    [junit] Running org.apache.pig.test.TestNotEqualTo
    [junit] Tests run: 28, Failures: 0, Errors: 0, Skipped: 0, Time elapsed: 0.451 sec
    [junit] Running org.apache.pig.test.TestNull
    [junit] Tests run: 2, Failures: 0, Errors: 0, Skipped: 0, Time elapsed: 0.445 sec
    [junit] Running org.apache.pig.test.TestNullConstant
    [junit] Tests run: 8, Failures: 0, Errors: 0, Skipped: 0, Time elapsed: 27.357 sec
    [junit] Running org.apache.pig.test.TestNumberOfReducers
    [junit] Tests run: 10, Failures: 0, Errors: 0, Skipped: 0, Time elapsed: 518.268 sec
    [junit] Running org.apache.pig.test.TestOptimizeLimit
    [junit] Tests run: 12, Failures: 0, Errors: 0, Skipped: 0, Time elapsed: 3.392 sec
    [junit] Running org.apache.pig.test.TestOrderBy3
    [junit] Tests run: 4, Failures: 0, Errors: 0, Skipped: 0, Time elapsed: 18.226 sec
    [junit] Running org.apache.pig.test.TestPOBinCond
    [junit] Tests run: 10, Failures: 0, Errors: 0, Skipped: 0, Time elapsed: 0.461 sec
    [junit] Running org.apache.pig.test.TestPOCast
    [junit] Tests run: 14, Failures: 0, Errors: 0, Skipped: 0, Time elapsed: 0.887 sec
    [junit] Running org.apache.pig.test.TestPODistinct
    [junit] Tests run: 6, Failures: 0, Errors: 0, Skipped: 0, Time elapsed: 0.397 sec
    [junit] Running org.apache.pig.test.TestPOGenerate
    [junit] Tests run: 3, Failures: 0, Errors: 0, Skipped: 0, Time elapsed: 0.373 sec
    [junit] Running org.apache.pig.test.TestPOMapLookUp
    [junit] Tests run: 1, Failures: 0, Errors: 0, Skipped: 0, Time elapsed: 0.353 sec
    [junit] Running org.apache.pig.test.TestPONegative
    [junit] Tests run: 9, Failures: 0, Errors: 0, Skipped: 0, Time elapsed: 5.685 sec
    [junit] Running org.apache.pig.test.TestPOPartialAgg
    [junit] Tests run: 16, Failures: 0, Errors: 0, Skipped: 0, Time elapsed: 3.91 sec
    [junit] Running org.apache.pig.test.TestPOPartialAggPlan
    [junit] Tests run: 1, Failures: 0, Errors: 0, Skipped: 1, Time elapsed: 0.241 sec
    [junit] Running org.apache.pig.test.TestPORegexp
    [junit] Tests run: 2, Failures: 0, Errors: 0, Skipped: 0, Time elapsed: 0.374 sec
    [junit] Running org.apache.pig.test.TestPOSort
    [junit] Tests run: 14, Failures: 0, Errors: 0, Skipped: 0, Time elapsed: 0.456 sec
    [junit] Running org.apache.pig.test.TestPOSplit
    [junit] Tests run: 1, Failures: 0, Errors: 0, Skipped: 0, Time elapsed: 0.369 sec
    [junit] Running org.apache.pig.test.TestPOUserFunc
    [junit] Tests run: 6, Failures: 0, Errors: 0, Skipped: 0, Time elapsed: 0.446 sec
    [junit] Running org.apache.pig.test.TestPackage
    [junit] Tests run: 1, Failures: 0, Errors: 0, Skipped: 0, Time elapsed: 7.707 sec
    [junit] Running org.apache.pig.test.TestParamSubPreproc
    [junit] Tests run: 36, Failures: 0, Errors: 0, Skipped: 0, Time elapsed: 4.329 sec
    [junit] Running org.apache.pig.test.TestParser
    [junit] Tests run: 4, Failures: 0, Errors: 0, Skipped: 0, Time elapsed: 5.011 sec
    [junit] Running org.apache.pig.test.TestPhyOp
    [junit] Tests run: 1, Failures: 0, Errors: 0, Skipped: 0, Time elapsed: 0.437 sec
    [junit] Running org.apache.pig.test.TestPhyPatternMatch
    [junit] Tests run: 4, Failures: 0, Errors: 0, Skipped: 0, Time elapsed: 0.353 sec
    [junit] Running org.apache.pig.test.TestPigContext
    [junit] Tests run: 6, Failures: 0, Errors: 0, Skipped: 0, Time elapsed: 59.654 sec
    [junit] Running org.apache.pig.test.TestPigContextClassCache
    [junit] Tests run: 1, Failures: 0, Errors: 0, Skipped: 0, Time elapsed: 0.343 sec
    [junit] Running org.apache.pig.test.TestPigException
    [junit] Tests run: 2, Failures: 0, Errors: 0, Skipped: 0, Time elapsed: 0.251 sec
    [junit] Running org.apache.pig.test.TestPigProgressReporting
    [junit] Tests run: 1, Failures: 0, Errors: 0, Skipped: 0, Time elapsed: 43.422 sec
    [junit] Running org.apache.pig.test.TestPigRunner
    [junit] Tests run: 30, Failures: 0, Errors: 0, Skipped: 1, Time elapsed: 205.128 sec
    [junit] Running org.apache.pig.test.TestPigScriptParser
    [junit] Tests run: 4, Failures: 0, Errors: 0, Skipped: 0, Time elapsed: 4.2 sec
    [junit] Running org.apache.pig.test.TestPigServer
    [junit] Tests run: 31, Failures: 0, Errors: 0, Skipped: 0, Time elapsed: 73.17 sec
    [junit] Running org.apache.pig.test.TestPigServerLocal
    [junit] Tests run: 7, Failures: 1, Errors: 0, Skipped: 0, Time elapsed: 31.395 sec
    [junit] Test org.apache.pig.test.TestPigServerLocal FAILED
    [junit] Running org.apache.pig.test.TestPigServerWithMacros
    [junit] Tests run: 2, Failures: 0, Errors: 0, Skipped: 0, Time elapsed: 8.43 sec
    [junit] Running org.apache.pig.test.TestPigServerWithMacrosRemote
    [junit] Tests run: 1, Failures: 0, Errors: 0, Skipped: 0, Time elapsed: 30.852 sec
    [junit] Running org.apache.pig.test.TestPigSplit
    [junit] Tests run: 3, Failures: 0, Errors: 1, Skipped: 0, Time elapsed: 46.211 sec
    [junit] Test org.apache.pig.test.TestPigSplit FAILED
    [junit] Running org.apache.pig.test.TestPigStats
    [junit] Tests run: 1, Failures: 0, Errors: 0, Skipped: 1, Time elapsed: 0.224 sec
    [junit] Running org.apache.pig.test.TestPigStorage
    [junit] Tests run: 20, Failures: 0, Errors: 0, Skipped: 0, Time elapsed: 66.924 sec
    [junit] Running org.apache.pig.test.TestPigStreaming
    [junit] Tests run: 13, Failures: 0, Errors: 0, Skipped: 0, Time elapsed: 0.358 sec
    [junit] Running org.apache.pig.test.TestPigTupleRawComparator
    [junit] Tests run: 16, Failures: 0, Errors: 0, Skipped: 0, Time elapsed: 1.613 sec
    [junit] Running org.apache.pig.test.TestPinOptions
    [junit] Tests run: 3, Failures: 0, Errors: 0, Skipped: 0, Time elapsed: 2.801 sec
    [junit] Running org.apache.pig.test.TestPlanGeneration
    [junit] Tests run: 10, Failures: 0, Errors: 0, Skipped: 0, Time elapsed: 2.727 sec
    [junit] Running org.apache.pig.test.TestPoissonSampleLoader
    [junit] Tests run: 1, Failures: 0, Errors: 0, Skipped: 0, Time elapsed: 5.632 sec
    [junit] Running org.apache.pig.test.TestPredeployedJar
    [junit] Tests run: 2, Failures: 0, Errors: 0, Skipped: 0, Time elapsed: 39.096 sec
    [junit] Running org.apache.pig.test.TestProject
    [junit] Tests run: 12, Failures: 0, Errors: 0, Skipped: 0, Time elapsed: 12.936 sec
    [junit] Running org.apache.pig.test.TestProjectRange
    [junit] Tests run: 23, Failures: 0, Errors: 0, Skipped: 0, Time elapsed: 128.072 sec
    [junit] Running org.apache.pig.test.TestProjectStarExpander
    [junit] Tests run: 2, Failures: 0, Errors: 0, Skipped: 0, Time elapsed: 8.204 sec
    [junit] Running org.apache.pig.test.TestProjectStarRangeInUdf
    [junit] Tests run: 15, Failures: 0, Errors: 0, Skipped: 0, Time elapsed: 9.561 sec
    [junit] Running org.apache.pig.test.TestPruneColumn
    [junit] Tests run: 71, Failures: 0, Errors: 0, Skipped: 0, Time elapsed: 163.439 sec
    [junit] Running org.apache.pig.test.TestRank1
    [junit] Tests run: 9, Failures: 0, Errors: 0, Skipped: 0, Time elapsed: 26.033 sec
    [junit] Running org.apache.pig.test.TestRank2
    [junit] Tests run: 4, Failures: 0, Errors: 0, Skipped: 0, Time elapsed: 14.912 sec
    [junit] Running org.apache.pig.test.TestRank3
    [junit] Tests run: 4, Failures: 0, Errors: 0, Skipped: 0, Time elapsed: 18.648 sec
    [junit] Running org.apache.pig.test.TestReadToEndLoader
    [junit] Tests run: 1, Failures: 0, Errors: 0, Skipped: 0, Time elapsed: 1.147 sec
    [junit] Running org.apache.pig.test.TestRegexp
    [junit] Tests run: 2, Failures: 0, Errors: 0, Skipped: 0, Time elapsed: 0.343 sec
    [junit] Running org.apache.pig.test.TestRegisteredJarVisibility
    [junit] Tests run: 4, Failures: 0, Errors: 0, Skipped: 0, Time elapsed: 29.523 sec
    [junit] Running org.apache.pig.test.TestRelationToExprProject
    [junit] Tests run: 5, Failures: 0, Errors: 0, Skipped: 0, Time elapsed: 15.554 sec
    [junit] Running org.apache.pig.test.TestResourceSchema
    [junit] Tests run: 9, Failures: 0, Errors: 0, Skipped: 0, Time elapsed: 0.718 sec
    [junit] Running org.apache.pig.test.TestRollupDimensions
    [junit] Tests run: 1, Failures: 0, Errors: 0, Skipped: 0, Time elapsed: 0.36 sec
    [junit] Running org.apache.pig.test.TestSample
    [junit] Tests run: 7, Failures: 0, Errors: 0, Skipped: 0, Time elapsed: 46.88 sec
    [junit] Running org.apache.pig.test.TestSampleOptimizer
    [junit] Tests run: 5, Failures: 0, Errors: 0, Skipped: 0, Time elapsed: 104.122 sec
    [junit] Running org.apache.pig.test.TestScalarAliases
    [junit] Tests run: 2, Failures: 0, Errors: 0, Skipped: 0, Time elapsed: 41.849 sec
    [junit] Running org.apache.pig.test.TestScalarAliasesLocal
    [junit] Tests run: 12, Failures: 0, Errors: 0, Skipped: 0, Time elapsed: 69.167 sec
    [junit] Running org.apache.pig.test.TestSchema
    [junit] Tests run: 31, Failures: 0, Errors: 0, Skipped: 0, Time elapsed: 52.232 sec
    [junit] Running org.apache.pig.test.TestSchemaUtil
    [junit] Tests run: 2, Failures: 0, Errors: 0, Skipped: 0, Time elapsed: 0.336 sec
    [junit] Running org.apache.pig.test.TestScriptLanguage
    [junit] Tests run: 19, Failures: 0, Errors: 0, Skipped: 1, Time elapsed: 302.677 sec
    [junit] Running org.apache.pig.test.TestScriptLanguageJavaScript
    [junit] Tests run: 2, Failures: 0, Errors: 0, Skipped: 0, Time elapsed: 99.357 sec
    [junit] Running org.apache.pig.test.TestScriptUDF
    [junit] Tests run: 6, Failures: 0, Errors: 0, Skipped: 0, Time elapsed: 241.935 sec
    [junit] Running org.apache.pig.test.TestScriptingLanguagePython
    [junit] Tests run: 1, Failures: 0, Errors: 0, Skipped: 0, Time elapsed: 34.952 sec
    [junit] Running org.apache.pig.test.TestSecondarySort
    [junit] Tests run: 1, Failures: 0, Errors: 0, Skipped: 1, Time elapsed: 0.241 sec
    [junit] Running org.apache.pig.test.TestShortcuts
    [junit] Tests run: 19, Failures: 0, Errors: 0, Skipped: 0, Time elapsed: 9.405 sec
    [junit] Running org.apache.pig.test.TestSkewedJoin
    [junit] Tests run: 14, Failures: 0, Errors: 0, Skipped: 0, Time elapsed: 156.632 sec
    [junit] Running org.apache.pig.test.TestSplit
    [junit] Tests run: 4, Failures: 0, Errors: 0, Skipped: 0, Time elapsed: 12.845 sec
    [junit] Running org.apache.pig.test.TestSplitCombine
    [junit] Tests run: 11, Failures: 0, Errors: 0, Skipped: 0, Time elapsed: 1.263 sec
    [junit] Running org.apache.pig.test.TestSplitIndex
    [junit] Tests run: 2, Failures: 0, Errors: 0, Skipped: 0, Time elapsed: 7.868 sec
    [junit] Running org.apache.pig.test.TestSplitStore
    [junit] Tests run: 9, Failures: 0, Errors: 0, Skipped: 0, Time elapsed: 94.851 sec
    [junit] Running org.apache.pig.test.TestStore
    [junit] Tests run: 18, Failures: 0, Errors: 0, Skipped: 0, Time elapsed: 145.983 sec
    [junit] Running org.apache.pig.test.TestStoreBase
    [junit] Tests run: 1, Failures: 0, Errors: 0, Skipped: 1, Time elapsed: 0.248 sec
    [junit] Running org.apache.pig.test.TestStoreInstances
    [junit] Tests run: 1, Failures: 0, Errors: 0, Skipped: 0, Time elapsed: 52.355 sec
    [junit] Running org.apache.pig.test.TestStoreLocal
    [junit] Tests run: 6, Failures: 0, Errors: 0, Skipped: 0, Time elapsed: 30.781 sec
    [junit] Running org.apache.pig.test.TestStoreOld
    [junit] Tests run: 3, Failures: 0, Errors: 0, Skipped: 0, Time elapsed: 47.927 sec
    [junit] Running org.apache.pig.test.TestStreaming
    [junit] Tests run: 15, Failures: 0, Errors: 0, Skipped: 0, Time elapsed: 324.768 sec
    [junit] Running org.apache.pig.test.TestStreamingLocal
    [junit] Tests run: 7, Failures: 0, Errors: 0, Skipped: 0, Time elapsed: 31.079 sec
    [junit] Running org.apache.pig.test.TestStringUDFs
    [junit] Tests run: 17, Failures: 0, Errors: 0, Skipped: 0, Time elapsed: 0.302 sec
    [junit] Running org.apache.pig.test.TestSubtract
    [junit] Tests run: 1, Failures: 0, Errors: 0, Skipped: 0, Time elapsed: 0.427 sec
    [junit] Running org.apache.pig.test.TestTextDataParser
    [junit] Tests run: 15, Failures: 0, Errors: 0, Skipped: 0, Time elapsed: 0.872 sec
    [junit] Running org.apache.pig.test.TestTmpFileCompression
    [junit] Tests run: 8, Failures: 0, Errors: 0, Skipped: 0, Time elapsed: 314.463 sec
    [junit] Running org.apache.pig.test.TestToolsPigServer
    [junit] Tests run: 2, Failures: 0, Errors: 0, Skipped: 0, Time elapsed: 82.021 sec
    [junit] Running org.apache.pig.test.TestTuple
    [junit] Tests run: 12, Failures: 0, Errors: 0, Skipped: 0, Time elapsed: 0.617 sec
    [junit] Running org.apache.pig.test.TestTypeCheckingValidatorNewLP
    [junit] Tests run: 141, Failures: 1, Errors: 0, Skipped: 0, Time elapsed: 21.984 sec
    [junit] Test org.apache.pig.test.TestTypeCheckingValidatorNewLP FAILED
    [junit] Running org.apache.pig.test.TestTypedMap
    [junit] Tests run: 8, Failures: 0, Errors: 0, Skipped: 0, Time elapsed: 24.365 sec
    [junit] Running org.apache.pig.test.TestUDF
    [junit] Tests run: 10, Failures: 0, Errors: 0, Skipped: 0, Time elapsed: 79.216 sec
    [junit] Running org.apache.pig.test.TestUDFContext
    [junit] Tests run: 2, Failures: 0, Errors: 0, Skipped: 0, Time elapsed: 6.103 sec
    [junit] Running org.apache.pig.test.TestUDFGroovy
    [junit] Tests run: 7, Failures: 0, Errors: 0, Skipped: 0, Time elapsed: 15.922 sec
    [junit] Running org.apache.pig.test.TestUDFWithoutParameter
    [junit] Tests run: 1, Failures: 0, Errors: 0, Skipped: 0, Time elapsed: 5.719 sec
    [junit] Running org.apache.pig.test.TestUTF8
    [junit] Tests run: 4, Failures: 0, Errors: 0, Skipped: 0, Time elapsed: 8.205 sec
    [junit] Running org.apache.pig.test.TestUnion
    [junit] Tests run: 7, Failures: 0, Errors: 0, Skipped: 0, Time elapsed: 18.658 sec
    [junit] Running org.apache.pig.test.TestUnionOnSchema
    [junit] Tests run: 22, Failures: 0, Errors: 0, Skipped: 0, Time elapsed: 52.728 sec
    [junit] Running org.apache.pig.test.pigunit.TestPigTest
    [junit] Tests run: 22, Failures: 0, Errors: 0, Skipped: 1, Time elapsed: 51.504 sec
    [junit] Running org.apache.pig.test.pigunit.pig.TestGruntParser
    [junit] Tests run: 5, Failures: 0, Errors: 0, Skipped: 0, Time elapsed: 1.735 sec
    [junit] Running org.apache.pig.tez.TestGroupConstParallelTez
    [junit] Tests run: 3, Failures: 0, Errors: 0, Skipped: 0, Time elapsed: 52.698 sec
    [junit] Running org.apache.pig.tez.TestJobSubmissionTez
    [junit] Tests run: 7, Failures: 0, Errors: 0, Skipped: 2, Time elapsed: 24.667 sec
    [junit] Running org.apache.pig.tez.TestLoaderStorerShipCacheFilesTez
    [junit] Tests run: 4, Failures: 0, Errors: 0, Skipped: 0, Time elapsed: 2.701 sec
    [junit] Running org.apache.pig.tez.TestPOPartialAggPlanTez
    [junit] Tests run: 5, Failures: 0, Errors: 0, Skipped: 0, Time elapsed: 2.868 sec
    [junit] Running org.apache.pig.tez.TestPigStatsTez
    [junit] Tests run: 5, Failures: 0, Errors: 0, Skipped: 0, Time elapsed: 8.425 sec
    [junit] Running org.apache.pig.tez.TestSecondarySortTez
    [junit] Tests run: 18, Failures: 0, Errors: 0, Skipped: 0, Time elapsed: 122.094 sec
    [junit] Running org.apache.pig.tez.TestTezAutoParallelism
    [junit] Tests run: 10, Failures: 0, Errors: 0, Skipped: 0, Time elapsed: 263.302 sec
    [junit] Running org.apache.pig.tez.TestTezCompiler
    [junit] Tests run: 46, Failures: 0, Errors: 0, Skipped: 0, Time elapsed: 12.302 sec
    [junit] Running org.apache.pig.tez.TestTezGraceParallelism
    [junit] Tests run: 4, Failures: 1, Errors: 0, Skipped: 0, Time elapsed: 32.321 sec
    [junit] Test org.apache.pig.tez.TestTezGraceParallelism FAILED
    [junit] Running org.apache.pig.tez.TestTezJobControlCompiler
    [junit] Tests run: 8, Failures: 0, Errors: 0, Skipped: 0, Time elapsed: 4.886 sec
    [junit] Running org.apache.pig.tez.TestTezLauncher
    [junit] Tests run: 2, Failures: 0, Errors: 0, Skipped: 0, Time elapsed: 55.452 sec
    [junit] Running org.apache.pig.tools.grunt.TestGruntParser
    [junit] Tests run: 1, Failures: 0, Errors: 0, Skipped: 0, Time elapsed: 1.28 sec
   [delete] Deleting directory /tmp/pig_junit_tmp145747875

BUILD FAILED
<https://builds.apache.org/job/Pig-trunk-commit/ws/trunk/build.xml>:987: Tests failed!

Total time: 638 minutes 10 seconds
Build step 'Execute shell' marked build as failure
Recording test results
Publishing Javadoc
Recording fingerprints

Mime
View raw message