pig-dev mailing list archives

Site index · List index
Message view « Date » · « Thread »
Top « Date » · « Thread »
From Apache Jenkins Server <jenk...@builds.apache.org>
Subject Build failed in Jenkins: Pig-trunk-commit #2188
Date Thu, 09 Jul 2015 04:02:53 GMT
See <https://builds.apache.org/job/Pig-trunk-commit/2188/>

------------------------------------------
[...truncated 2994 lines...]
  [javadoc] Loading source files for package org.apache.pig.impl.streaming...
  [javadoc] Loading source files for package org.apache.pig.impl.util...
  [javadoc] Loading source files for package org.apache.pig.impl.util.avro...
  [javadoc] Loading source files for package org.apache.pig.impl.util.hive...
  [javadoc] Loading source files for package org.apache.pig.newplan...
  [javadoc] Loading source files for package org.apache.pig.newplan.logical...
  [javadoc] Loading source files for package org.apache.pig.newplan.logical.expression...
  [javadoc] Loading source files for package org.apache.pig.newplan.logical.optimizer...
  [javadoc] Loading source files for package org.apache.pig.newplan.logical.relational...
  [javadoc] Loading source files for package org.apache.pig.newplan.logical.rules...
  [javadoc] Loading source files for package org.apache.pig.newplan.logical.visitor...
  [javadoc] Loading source files for package org.apache.pig.newplan.optimizer...
  [javadoc] Loading source files for package org.apache.pig.parser...
  [javadoc] Loading source files for package org.apache.pig.pen...
  [javadoc] Loading source files for package org.apache.pig.pen.util...
  [javadoc] Loading source files for package org.apache.pig.scripting...
  [javadoc] Loading source files for package org.apache.pig.scripting.groovy...
  [javadoc] Loading source files for package org.apache.pig.scripting.jruby...
  [javadoc] Loading source files for package org.apache.pig.scripting.js...
  [javadoc] Loading source files for package org.apache.pig.scripting.jython...
  [javadoc] Loading source files for package org.apache.pig.scripting.streaming.python...
  [javadoc] Loading source files for package org.apache.pig.tools...
  [javadoc] Loading source files for package org.apache.pig.tools.cmdline...
  [javadoc] Loading source files for package org.apache.pig.tools.counters...
  [javadoc] Loading source files for package org.apache.pig.tools.grunt...
  [javadoc] Loading source files for package org.apache.pig.tools.parameters...
  [javadoc] Loading source files for package org.apache.pig.tools.pigstats...
  [javadoc] Loading source files for package org.apache.pig.tools.pigstats.mapreduce...
  [javadoc] Loading source files for package org.apache.pig.tools.pigstats.tez...
  [javadoc] Loading source files for package org.apache.pig.tools.streams...
  [javadoc] Loading source files for package org.apache.pig.tools.timer...
  [javadoc] Loading source files for package org.apache.pig.validator...
  [javadoc] Constructing Javadoc information...
  [javadoc] /home/jenkins/.ivy2/cache/org.apache.hbase/hbase-common/jars/hbase-common-0.98.12-hadoop2.jar(org/apache/hadoop/hbase/io/ImmutableBytesWritable.class):
warning: Cannot find annotation method 'value()' in type 'SuppressWarnings': class file for
edu.umd.cs.findbugs.annotations.SuppressWarnings not found
  [javadoc] /home/jenkins/.ivy2/cache/org.apache.hbase/hbase-common/jars/hbase-common-0.98.12-hadoop2.jar(org/apache/hadoop/hbase/io/ImmutableBytesWritable.class):
warning: Cannot find annotation method 'justification()' in type 'SuppressWarnings'
  [javadoc] Standard Doclet version 1.7.0_65
  [javadoc] Building tree for all the packages and classes...
  [javadoc] <https://builds.apache.org/job/Pig-trunk-commit/ws/trunk/src/org/apache/pig/EvalFunc.java>:96:
warning - Tag @see:illegal character: "123" in "{@link EvalFunc#getSchemaType()}"
  [javadoc] <https://builds.apache.org/job/Pig-trunk-commit/ws/trunk/src/org/apache/pig/EvalFunc.java>:96:
warning - Tag @see:illegal character: "64" in "{@link EvalFunc#getSchemaType()}"
  [javadoc] <https://builds.apache.org/job/Pig-trunk-commit/ws/trunk/src/org/apache/pig/EvalFunc.java>:295:
warning - Tag @link: reference not found: FuncUtils
  [javadoc] <https://builds.apache.org/job/Pig-trunk-commit/ws/trunk/src/org/apache/pig/EvalFunc.java>:96:
warning - Tag @see: reference not found: {@link EvalFunc#getSchemaType()}
  [javadoc] <https://builds.apache.org/job/Pig-trunk-commit/ws/trunk/src/org/apache/pig/ExecType.java>:90:
warning - @return tag has no arguments.
  [javadoc] <https://builds.apache.org/job/Pig-trunk-commit/ws/trunk/src/org/apache/pig/ExecTypeProvider.java>:61:
warning - @return tag has no arguments.
  [javadoc] <https://builds.apache.org/job/Pig-trunk-commit/ws/trunk/src/org/apache/pig/JVMReuseManager.java>:63:
warning - @StaticDataCleanup is an unknown tag.
  [javadoc] <https://builds.apache.org/job/Pig-trunk-commit/ws/trunk/src/org/apache/pig/LoadCaster.java>:134:
warning - @param argument "fieldSchema" is not a parameter name.
  [javadoc] <https://builds.apache.org/job/Pig-trunk-commit/ws/trunk/src/org/apache/pig/LoadCaster.java>:143:
warning - @param argument "fieldSchema" is not a parameter name.
  [javadoc] <https://builds.apache.org/job/Pig-trunk-commit/ws/trunk/src/org/apache/pig/LoadFunc.java>:324:
warning - Tag @link: reference not found: FuncUtils
  [javadoc] <https://builds.apache.org/job/Pig-trunk-commit/ws/trunk/src/org/apache/pig/OverwritableStoreFunc.java>:36:
warning - Tag @link: reference not found: InputOutputFileValidator#validate
  [javadoc] <https://builds.apache.org/job/Pig-trunk-commit/ws/trunk/src/org/apache/pig/OverwritableStoreFunc.java>:36:
warning - Tag @link: reference not found: InputOutputFileValidator#validate
  [javadoc] <https://builds.apache.org/job/Pig-trunk-commit/ws/trunk/src/org/apache/pig/PigConfiguration.java>:373:
warning - Tag @link: can't find PROP_NO_COMBINER1 in org.apache.pig.PigConfiguration
  [javadoc] <https://builds.apache.org/job/Pig-trunk-commit/ws/trunk/src/org/apache/pig/PigServer.java>:306:
warning - @return tag has no arguments.
  [javadoc] <https://builds.apache.org/job/Pig-trunk-commit/ws/trunk/src/org/apache/pig/PigServer.java>:410:
warning - @return tag has no arguments.
  [javadoc] <https://builds.apache.org/job/Pig-trunk-commit/ws/trunk/src/org/apache/pig/PigServer.java>:1347:
warning - @return tag has no arguments.
  [javadoc] <https://builds.apache.org/job/Pig-trunk-commit/ws/trunk/src/org/apache/pig/StoreResources.java>:48:
warning - Tag @link: reference not found: FuncUtils
  [javadoc] <https://builds.apache.org/job/Pig-trunk-commit/ws/trunk/src/org/apache/pig/backend/hadoop/accumulo/AbstractAccumuloStorage.java>:451:
warning - @return tag has no arguments.
  [javadoc] <https://builds.apache.org/job/Pig-trunk-commit/ws/trunk/src/org/apache/pig/backend/hadoop/accumulo/AbstractAccumuloStorage.java>:539:
warning - @param argument "job" is not a parameter name.
  [javadoc] <https://builds.apache.org/job/Pig-trunk-commit/ws/trunk/src/org/apache/pig/backend/hadoop/accumulo/AccumuloStorage.java>:100:
warning - @param argument "aggregateColfams" is not a parameter name.
  [javadoc] <https://builds.apache.org/job/Pig-trunk-commit/ws/trunk/src/org/apache/pig/backend/hadoop/executionengine/Launcher.java>:257:
warning - @param argument "jobClient" is not a parameter name.
  [javadoc] <https://builds.apache.org/job/Pig-trunk-commit/ws/trunk/src/org/apache/pig/backend/hadoop/executionengine/fetch/FetchOptimizer.java>:133:
warning - @return tag has no arguments.
  [javadoc] <https://builds.apache.org/job/Pig-trunk-commit/ws/trunk/src/org/apache/pig/backend/hadoop/executionengine/fetch/FetchOptimizer.java>:72:
warning - Tag @link: reference not found: FetchablePlanVisitor
  [javadoc] <https://builds.apache.org/job/Pig-trunk-commit/ws/trunk/src/org/apache/pig/backend/hadoop/executionengine/fetch/FetchOptimizer.java>:95:
warning - Tag @link: reference not found: FetchablePlanVisitor
  [javadoc] <https://builds.apache.org/job/Pig-trunk-commit/ws/trunk/src/org/apache/pig/backend/hadoop/executionengine/fetch/FetchOptimizer.java>:95:
warning - Tag @link: reference not found: FetchablePlanVisitor
  [javadoc] <https://builds.apache.org/job/Pig-trunk-commit/ws/trunk/src/org/apache/pig/backend/hadoop/executionengine/mapReduceLayer/InputSizeReducerEstimator.java>:114:
warning - @return tag has no arguments.
  [javadoc] <https://builds.apache.org/job/Pig-trunk-commit/ws/trunk/src/org/apache/pig/backend/hadoop/executionengine/mapReduceLayer/MRCompiler.java>:710:
warning - @return tag has no arguments.
  [javadoc] <https://builds.apache.org/job/Pig-trunk-commit/ws/trunk/src/org/apache/pig/backend/hadoop/executionengine/mapReduceLayer/MRCompiler.java>:725:
warning - @return tag has no arguments.
  [javadoc] <https://builds.apache.org/job/Pig-trunk-commit/ws/trunk/src/org/apache/pig/backend/hadoop/executionengine/mapReduceLayer/MRCompiler.java>:746:
warning - @return tag has no arguments.
  [javadoc] <https://builds.apache.org/job/Pig-trunk-commit/ws/trunk/src/org/apache/pig/backend/hadoop/executionengine/mapReduceLayer/PigInputFormat.java>:144:
warning - @return tag has no arguments.
  [javadoc] <https://builds.apache.org/job/Pig-trunk-commit/ws/trunk/src/org/apache/pig/backend/hadoop/executionengine/mapReduceLayer/PigOutputCommitter.java>:82:
warning - @return tag has no arguments.
  [javadoc] <https://builds.apache.org/job/Pig-trunk-commit/ws/trunk/src/org/apache/pig/backend/hadoop/executionengine/mapReduceLayer/PigOutputFormat.java>:227:
warning - @return tag has no arguments.
  [javadoc] <https://builds.apache.org/job/Pig-trunk-commit/ws/trunk/src/org/apache/pig/backend/hadoop/executionengine/mapReduceLayer/partitioners/WeightedRangePartitioner.java>:170:
warning - @return tag has no arguments.
  [javadoc] <https://builds.apache.org/job/Pig-trunk-commit/ws/trunk/src/org/apache/pig/backend/hadoop/executionengine/mapReduceLayer/partitioners/WeightedRangePartitioner.java>:235:
warning - @return tag has no arguments.
  [javadoc] <https://builds.apache.org/job/Pig-trunk-commit/ws/trunk/src/org/apache/pig/backend/hadoop/executionengine/mapReduceLayer/partitioners/WeightedRangePartitioner.java>:170:
warning - @param argument "value" is not a parameter name.
  [javadoc] <https://builds.apache.org/job/Pig-trunk-commit/ws/trunk/src/org/apache/pig/backend/hadoop/executionengine/physicalLayer/plans/PatternPlan.java>:101:
warning - @return tag has no arguments.
  [javadoc] <https://builds.apache.org/job/Pig-trunk-commit/ws/trunk/src/org/apache/pig/backend/hadoop/executionengine/physicalLayer/relationalOperators/MultiQueryPackager.java>:96:
warning - @param argument "pack" is not a parameter name.
  [javadoc] <https://builds.apache.org/job/Pig-trunk-commit/ws/trunk/src/org/apache/pig/backend/hadoop/executionengine/physicalLayer/relationalOperators/MultiQueryPackager.java>:107:
warning - @param argument "pack" is not a parameter name.
  [javadoc] <https://builds.apache.org/job/Pig-trunk-commit/ws/trunk/src/org/apache/pig/backend/hadoop/executionengine/tez/plan/TezCompiler.java>:1743:
warning - @return tag has no arguments.
  [javadoc] <https://builds.apache.org/job/Pig-trunk-commit/ws/trunk/src/org/apache/pig/backend/hadoop/executionengine/tez/plan/TezPlanContainerPrinter.java>:34:
warning - @param argument "plan" is not a parameter name.
  [javadoc] <https://builds.apache.org/job/Pig-trunk-commit/ws/trunk/src/org/apache/pig/backend/hadoop/executionengine/tez/plan/TezPlanContainerUDFCollector.java>:35:
warning - @param argument "ps" is not a parameter name.
  [javadoc] <https://builds.apache.org/job/Pig-trunk-commit/ws/trunk/src/org/apache/pig/backend/hadoop/executionengine/tez/plan/TezPlanContainerUDFCollector.java>:35:
warning - @param argument "plan" is not a parameter name.
  [javadoc] <https://builds.apache.org/job/Pig-trunk-commit/ws/trunk/src/org/apache/pig/backend/hadoop/executionengine/util/CombinerOptimizerUtil.java>:475:
warning - @return tag has no arguments.
  [javadoc] <https://builds.apache.org/job/Pig-trunk-commit/ws/trunk/src/org/apache/pig/backend/hadoop/executionengine/util/CombinerOptimizerUtil.java>:566:
warning - @return tag has no arguments.
  [javadoc] <https://builds.apache.org/job/Pig-trunk-commit/ws/trunk/src/org/apache/pig/backend/hadoop/executionengine/util/CombinerOptimizerUtil.java>:645:
warning - @return tag has no arguments.
  [javadoc] <https://builds.apache.org/job/Pig-trunk-commit/ws/trunk/src/org/apache/pig/backend/hadoop/executionengine/util/MapRedUtil.java>:314:
warning - @return tag has no arguments.
  [javadoc] <https://builds.apache.org/job/Pig-trunk-commit/ws/trunk/src/org/apache/pig/backend/hadoop/hbase/HBaseStorage.java>:393:
warning - @return tag has no arguments.
  [javadoc] <https://builds.apache.org/job/Pig-trunk-commit/ws/trunk/src/org/apache/pig/LoadFunc.java>:324:
warning - Tag @link: reference not found: FuncUtils
  [javadoc] /home/jenkins/.ivy2/cache/org.apache.hbase/hbase-server/jars/hbase-server-0.98.12-hadoop2.jar(org/apache/hadoop/hbase/mapreduce/HFileOutputFormat2.class):
warning: Cannot find annotation method 'value()' in type 'SuppressWarnings'
  [javadoc] /home/jenkins/.ivy2/cache/org.apache.hbase/hbase-server/jars/hbase-server-0.98.12-hadoop2.jar(org/apache/hadoop/hbase/mapreduce/HFileOutputFormat.class):
warning: Cannot find annotation method 'value()' in type 'SuppressWarnings'
  [javadoc] <https://builds.apache.org/job/Pig-trunk-commit/ws/trunk/src/org/apache/pig/builtin/AvroStorage.java>:574:
warning - @s is an unknown tag.
  [javadoc] <https://builds.apache.org/job/Pig-trunk-commit/ws/trunk/src/org/apache/pig/builtin/AvroStorage.java>:465:
warning - @s is an unknown tag.
  [javadoc] <https://builds.apache.org/job/Pig-trunk-commit/ws/trunk/src/org/apache/pig/builtin/AvroStorage.java>:465:
warning - @s is an unknown tag.
  [javadoc] <https://builds.apache.org/job/Pig-trunk-commit/ws/trunk/src/org/apache/pig/builtin/AvroStorage.java>:465:
warning - @s is an unknown tag.
  [javadoc] <https://builds.apache.org/job/Pig-trunk-commit/ws/trunk/src/org/apache/pig/builtin/AvroStorage.java>:574:
warning - @s is an unknown tag.
  [javadoc] <https://builds.apache.org/job/Pig-trunk-commit/ws/trunk/src/org/apache/pig/builtin/AvroStorage.java>:574:
warning - @s is an unknown tag.
  [javadoc] <https://builds.apache.org/job/Pig-trunk-commit/ws/trunk/src/org/apache/pig/LoadFunc.java>:324:
warning - Tag @link: reference not found: FuncUtils
  [javadoc] <https://builds.apache.org/job/Pig-trunk-commit/ws/trunk/src/org/apache/pig/EvalFunc.java>:295:
warning - Tag @link: reference not found: FuncUtils
  [javadoc] <https://builds.apache.org/job/Pig-trunk-commit/ws/trunk/src/org/apache/pig/EvalFunc.java>:295:
warning - Tag @link: reference not found: FuncUtils
  [javadoc] <https://builds.apache.org/job/Pig-trunk-commit/ws/trunk/src/org/apache/pig/EvalFunc.java>:295:
warning - Tag @link: reference not found: FuncUtils
  [javadoc] <https://builds.apache.org/job/Pig-trunk-commit/ws/trunk/src/org/apache/pig/LoadFunc.java>:324:
warning - Tag @link: reference not found: FuncUtils
  [javadoc] <https://builds.apache.org/job/Pig-trunk-commit/ws/trunk/src/org/apache/pig/StoreResources.java>:48:
warning - Tag @link: reference not found: FuncUtils
  [javadoc] <https://builds.apache.org/job/Pig-trunk-commit/ws/trunk/src/org/apache/pig/LoadFunc.java>:324:
warning - Tag @link: reference not found: FuncUtils
  [javadoc] <https://builds.apache.org/job/Pig-trunk-commit/ws/trunk/src/org/apache/pig/builtin/PigStorage.java>:370:
warning - @return tag has no arguments.
  [javadoc] <https://builds.apache.org/job/Pig-trunk-commit/ws/trunk/src/org/apache/pig/OverwritableStoreFunc.java>:36:
warning - Tag @link: reference not found: InputOutputFileValidator#validate
  [javadoc] <https://builds.apache.org/job/Pig-trunk-commit/ws/trunk/src/org/apache/pig/OverwritableStoreFunc.java>:36:
warning - Tag @link: reference not found: InputOutputFileValidator#validate
  [javadoc] <https://builds.apache.org/job/Pig-trunk-commit/ws/trunk/src/org/apache/pig/data/DataType.java>:1669:
warning - @return tag has no arguments.
  [javadoc] <https://builds.apache.org/job/Pig-trunk-commit/ws/trunk/src/org/apache/pig/data/ReadOnceBag.java>:61:
warning - @param argument "pkg" is not a parameter name.
  [javadoc] <https://builds.apache.org/job/Pig-trunk-commit/ws/trunk/src/org/apache/pig/data/ReadOnceBag.java>:61:
warning - @param argument "key" is not a parameter name.
  [javadoc] <https://builds.apache.org/job/Pig-trunk-commit/ws/trunk/src/org/apache/pig/impl/builtin/StreamingUDF.java>:313:
warning - @return tag has no arguments.
  [javadoc] <https://builds.apache.org/job/Pig-trunk-commit/ws/trunk/src/org/apache/pig/impl/io/FileLocalizer.java>:464:
warning - @return tag has no arguments.
  [javadoc] <https://builds.apache.org/job/Pig-trunk-commit/ws/trunk/src/org/apache/pig/impl/io/FileLocalizer.java>:785:
warning - @return tag has no arguments.
  [javadoc] <https://builds.apache.org/job/Pig-trunk-commit/ws/trunk/src/org/apache/pig/impl/logicalLayer/schema/Schema.java>:1531:
warning - @return tag has no arguments.
  [javadoc] <https://builds.apache.org/job/Pig-trunk-commit/ws/trunk/src/org/apache/pig/impl/logicalLayer/schema/Schema.java>:1656:
warning - @return tag has no arguments.
  [javadoc] <https://builds.apache.org/job/Pig-trunk-commit/ws/trunk/src/org/apache/pig/impl/plan/DependencyOrderWalker.java>:54:
warning - @param argument "boolean" is not a parameter name.
  [javadoc] <https://builds.apache.org/job/Pig-trunk-commit/ws/trunk/src/org/apache/pig/impl/streaming/StreamingUtil.java>:44:
warning - @return tag has no arguments.
  [javadoc] <https://builds.apache.org/job/Pig-trunk-commit/ws/trunk/src/org/apache/pig/impl/util/Utils.java>:541:
warning - @param argument "conf" is not a parameter name.
  [javadoc] <https://builds.apache.org/job/Pig-trunk-commit/ws/trunk/src/org/apache/pig/impl/util/avro/AvroMapWrapper.java>:49:
warning - @m is an unknown tag.
  [javadoc] <https://builds.apache.org/job/Pig-trunk-commit/ws/trunk/src/org/apache/pig/impl/util/avro/AvroMapWrapper.java>:49:
warning - @m is an unknown tag.
  [javadoc] <https://builds.apache.org/job/Pig-trunk-commit/ws/trunk/src/org/apache/pig/impl/util/avro/AvroMapWrapper.java>:49:
warning - @m is an unknown tag.
  [javadoc] <https://builds.apache.org/job/Pig-trunk-commit/ws/trunk/src/org/apache/pig/impl/util/avro/AvroRecordWriter.java>:65:
warning - @param argument "s" is not a parameter name.
  [javadoc] <https://builds.apache.org/job/Pig-trunk-commit/ws/trunk/src/org/apache/pig/newplan/FilterExtractor.java>:84:
warning - @{code is an unknown tag.
  [javadoc] <https://builds.apache.org/job/Pig-trunk-commit/ws/trunk/src/org/apache/pig/newplan/FilterExtractor.java>:92:
warning - @param argument "partitionCols" is not a parameter name.
  [javadoc] <https://builds.apache.org/job/Pig-trunk-commit/ws/trunk/src/org/apache/pig/newplan/logical/relational/LOCogroup.java>:103:
warning - @return tag has no arguments.
  [javadoc] <https://builds.apache.org/job/Pig-trunk-commit/ws/trunk/src/org/apache/pig/newplan/logical/relational/LogToPhyTranslationVisitor.java>:912:
warning - @return tag has no arguments.
  [javadoc] <https://builds.apache.org/job/Pig-trunk-commit/ws/trunk/src/org/apache/pig/newplan/logical/rules/MapKeysPruneHelper.java>:178:
warning - @return tag has no arguments.
  [javadoc] <https://builds.apache.org/job/Pig-trunk-commit/ws/trunk/src/org/apache/pig/newplan/logical/rules/PartitionFilterOptimizer.java>:203:
warning - @return tag has no arguments.
  [javadoc] <https://builds.apache.org/job/Pig-trunk-commit/ws/trunk/src/org/apache/pig/newplan/logical/rules/PartitionFilterOptimizer.java>:203:
warning - Tag @link: can't find getPartitionKeys(String, org.apache.hadoop.conf.Configuration)
in org.apache.pig.LoadMetadata
  [javadoc] <https://builds.apache.org/job/Pig-trunk-commit/ws/trunk/src/org/apache/pig/newplan/logical/visitor/LineageFindRelVisitor.java>:220:
warning - @return tag has no arguments.
  [javadoc] <https://builds.apache.org/job/Pig-trunk-commit/ws/trunk/src/org/apache/pig/newplan/logical/visitor/ProjectStarExpander.java>:173:
warning - @return tag has no arguments.
  [javadoc] <https://builds.apache.org/job/Pig-trunk-commit/ws/trunk/src/org/apache/pig/newplan/logical/visitor/ProjectStarExpander.java>:544:
warning - @return tag has no arguments.
  [javadoc] <https://builds.apache.org/job/Pig-trunk-commit/ws/trunk/src/org/apache/pig/newplan/logical/visitor/ProjectStarExpander.java>:579:
warning - @return tag has no arguments.
  [javadoc] <https://builds.apache.org/job/Pig-trunk-commit/ws/trunk/src/org/apache/pig/newplan/logical/visitor/ProjectStarExpander.java>:596:
warning - @return tag has no arguments.
  [javadoc] <https://builds.apache.org/job/Pig-trunk-commit/ws/trunk/src/org/apache/pig/newplan/logical/visitor/TypeCheckingExpVisitor.java>:1190:
warning - @return tag has no arguments.
  [javadoc] <https://builds.apache.org/job/Pig-trunk-commit/ws/trunk/src/org/apache/pig/newplan/logical/visitor/TypeCheckingExpVisitor.java>:1312:
warning - @return tag has no arguments.
  [javadoc] <https://builds.apache.org/job/Pig-trunk-commit/ws/trunk/src/org/apache/pig/newplan/logical/visitor/TypeCheckingRelVisitor.java>:879:
warning - @return tag has no arguments.
  [javadoc] <https://builds.apache.org/job/Pig-trunk-commit/ws/trunk/src/org/apache/pig/tools/parameters/ParameterSubstitutionPreprocessor.java>:61:
warning - @param argument "paramVal" is not a parameter name.
  [javadoc] <https://builds.apache.org/job/Pig-trunk-commit/ws/trunk/src/org/apache/pig/backend/hadoop/executionengine/physicalLayer/relationalOperators/POStream.java>:68:
warning - Tag @link: reference not found: FetchLauncher
  [javadoc] <https://builds.apache.org/job/Pig-trunk-commit/ws/trunk/src/org/apache/pig/backend/hadoop/executionengine/fetch/FetchOptimizer.java>:95:
warning - Tag @link: reference not found: FetchablePlanVisitor
  [javadoc] <https://builds.apache.org/job/Pig-trunk-commit/ws/trunk/src/org/apache/pig/backend/hadoop/executionengine/fetch/FetchOptimizer.java>:95:
warning - Tag @link: reference not found: FetchablePlanVisitor
  [javadoc] <https://builds.apache.org/job/Pig-trunk-commit/ws/trunk/src/org/apache/pig/backend/hadoop/executionengine/fetch/FetchOptimizer.java>:95:
warning - Tag @link: reference not found: FetchablePlanVisitor
  [javadoc] Building index for all the packages and classes...
  [javadoc] <https://builds.apache.org/job/Pig-trunk-commit/ws/trunk/src/org/apache/pig/impl/util/avro/AvroMapWrapper.java>:49:
warning - @m is an unknown tag.
  [javadoc] <https://builds.apache.org/job/Pig-trunk-commit/ws/trunk/src/org/apache/pig/backend/hadoop/executionengine/fetch/FetchOptimizer.java>:95:
warning - Tag @link: reference not found: FetchablePlanVisitor
  [javadoc] <https://builds.apache.org/job/Pig-trunk-commit/ws/trunk/src/org/apache/pig/builtin/AvroStorage.java>:574:
warning - @s is an unknown tag.
  [javadoc] <https://builds.apache.org/job/Pig-trunk-commit/ws/trunk/src/org/apache/pig/builtin/AvroStorage.java>:465:
warning - @s is an unknown tag.
  [javadoc] <https://builds.apache.org/job/Pig-trunk-commit/ws/trunk/src/org/apache/pig/OverwritableStoreFunc.java>:36:
warning - Tag @link: reference not found: InputOutputFileValidator#validate
  [javadoc] Building index for all classes...
  [javadoc] Generating <https://builds.apache.org/job/Pig-trunk-commit/ws/trunk/build/docs/api/help-doc.html...>
  [javadoc] 108 warnings

javadoc-jar:
      [jar] Building jar: <https://builds.apache.org/job/Pig-trunk-commit/ws/trunk/build/pig-0.16.0-SNAPSHOT-javadoc.jar>

ivy-test:

compile-test:
     [echo] *** Building Test Sources ***
     [echo] *** To compile with all warnings enabled, supply -Dall.warnings=1 on command line
***
     [echo] *** Else, you will only be warned about deprecations ***
    [javac] Compiling 429 source files to <https://builds.apache.org/job/Pig-trunk-commit/ws/trunk/build/test/classes>
    [javac] Note: Some input files use or override a deprecated API.
    [javac] Note: Recompile with -Xlint:deprecation for details.
    [javac] Note: Some input files use unchecked or unsafe operations.
    [javac] Note: Recompile with -Xlint:unchecked for details.
     [copy] Copying 1 file to <https://builds.apache.org/job/Pig-trunk-commit/ws/trunk/build/test/classes>

pigunit-jar:
     [echo]  *** Creating pigunit.jar ***
      [jar] Building jar: <https://builds.apache.org/job/Pig-trunk-commit/ws/trunk/pigunit.jar>

smoketests-jar:
     [echo]  *** Creating smoke tests jar for pigunit ***
      [jar] Building jar: <https://builds.apache.org/job/Pig-trunk-commit/ws/trunk/build/pig-0.16.0-SNAPSHOT-smoketests.jar>

piggybank:

init:
    [mkdir] Created dir: <https://builds.apache.org/job/Pig-trunk-commit/ws/trunk/contrib/piggybank/java/build>
    [mkdir] Created dir: <https://builds.apache.org/job/Pig-trunk-commit/ws/trunk/contrib/piggybank/java/build/classes>
    [mkdir] Created dir: <https://builds.apache.org/job/Pig-trunk-commit/ws/trunk/contrib/piggybank/java/build/test>
    [mkdir] Created dir: <https://builds.apache.org/job/Pig-trunk-commit/ws/trunk/contrib/piggybank/java/build/test/classes>
    [mkdir] Created dir: <https://builds.apache.org/job/Pig-trunk-commit/ws/trunk/contrib/piggybank/java/build/docs/api>

compile:
     [echo]  *** Compiling Pig UDFs ***
    [javac] <https://builds.apache.org/job/Pig-trunk-commit/ws/trunk/contrib/piggybank/java/build.xml>:98:
warning: 'includeantruntime' was not set, defaulting to build.sysclasspath=last; set to false
for repeatable builds
    [javac] Compiling 167 source files to <https://builds.apache.org/job/Pig-trunk-commit/ws/trunk/contrib/piggybank/java/build/classes>
    [javac] warning: [options] bootstrap class path not set in conjunction with -source 1.6
    [javac] Note: Some input files use or override a deprecated API.
    [javac] Note: Recompile with -Xlint:deprecation for details.
    [javac] Note: Some input files use unchecked or unsafe operations.
    [javac] Note: Recompile with -Xlint:unchecked for details.
    [javac] 1 warning

jar:
     [echo]  *** Creating pigudf.jar ***
      [jar] Building jar: <https://builds.apache.org/job/Pig-trunk-commit/ws/trunk/contrib/piggybank/java/piggybank.jar>

mvn-build:
     [move] Moving 1 file to <https://builds.apache.org/job/Pig-trunk-commit/ws/trunk/build>
     [move] Moving 1 file to <https://builds.apache.org/job/Pig-trunk-commit/ws/trunk/build>

ant-task-download:
      [get] Getting: http://repo2.maven.org/maven2/org/apache/maven/maven-ant-tasks/2.0.10/maven-ant-tasks-2.0.10.jar
      [get] To: <https://builds.apache.org/job/Pig-trunk-commit/ws/trunk/ivy/maven-ant-tasks-2.0.10.jar>

mvn-taskdef:

set-version:
     [copy] Copying 1 file to <https://builds.apache.org/job/Pig-trunk-commit/ws/trunk/ivy>
     [copy] Copying 1 file to <https://builds.apache.org/job/Pig-trunk-commit/ws/trunk/ivy>
     [copy] Copying 1 file to <https://builds.apache.org/job/Pig-trunk-commit/ws/trunk/ivy>
     [copy] Copying 1 file to <https://builds.apache.org/job/Pig-trunk-commit/ws/trunk/ivy>

clean-sign:

sign:

signanddeploy:

simpledeploy:
[artifact:install-provider] Installing provider: org.apache.maven.wagon:wagon-http:jar:1.0-beta-2:runtime
[artifact:deploy] Deploying to https://repository.apache.org/content/repositories/snapshots
[artifact:deploy] [INFO] Retrieving previous build number from apache.snapshots.https
[artifact:deploy] [WARNING] *** CHECKSUM FAILED - Checksum failed on download: local = '01d97c9e118653c9fbd78144128db526b6efc108';
remote = '9a3c7248d8602655ed7736c65debe431b7ffdf3a' - RETRYING
[artifact:deploy] [WARNING] *** CHECKSUM FAILED - Checksum failed on download: local = '01d97c9e118653c9fbd78144128db526b6efc108';
remote = '9a3c7248d8602655ed7736c65debe431b7ffdf3a' - IGNORING
[artifact:deploy] An error has occurred while processing the Maven artifact tasks.
[artifact:deploy]  Diagnosis:
[artifact:deploy] 
[artifact:deploy] Error deploying artifact 'org.apache.pig:pig:jar': Error deploying artifact:
File <https://builds.apache.org/job/Pig-trunk-commit/ws/trunk/build/pig-0.16.0-SNAPSHOT-h1.jar>
does not exist

BUILD FAILED
<https://builds.apache.org/job/Pig-trunk-commit/ws/trunk/build.xml>:1318: Error deploying
artifact 'org.apache.pig:pig:jar': Error deploying artifact: File <https://builds.apache.org/job/Pig-trunk-commit/ws/trunk/build/pig-0.16.0-SNAPSHOT-h1.jar>
does not exist

Total time: 5 minutes 4 seconds


======================================================================
======================================================================
STORE: saving artifacts
======================================================================
======================================================================


mv: cannot stat ‘build/*.tar.gz’: No such file or directory
mv: cannot stat ‘build/test/findbugs’: No such file or directory
Build Failed
Build step 'Execute shell' marked build as failure
Recording test results
Publishing Javadoc
Recording fingerprints

Mime
View raw message