pig-dev mailing list archives

Site index · List index
Message view « Date » · « Thread »
Top « Date » · « Thread »
From Apache Jenkins Server <jenk...@builds.apache.org>
Subject Build failed in Jenkins: Pig-trunk-commit #2113
Date Fri, 01 May 2015 15:50:48 GMT
See <https://builds.apache.org/job/Pig-trunk-commit/2113/changes>

Changes:

[gates] PIG-4525 Clarify "Scalar has more than one row in the output."

[daijy] PIG-4527: NON-ASCII Characters in Javadoc break 'ant docs'

------------------------------------------
[...truncated 4405 lines...]
    [junit] Tests run: 4, Failures: 0, Errors: 0, Skipped: 0, Time elapsed: 0.37 sec
    [junit] Running org.apache.pig.test.TestNewPlanLogToPhyTranslationVisitor
    [junit] Tests run: 27, Failures: 0, Errors: 0, Skipped: 0, Time elapsed: 5.096 sec
    [junit] Running org.apache.pig.test.TestNewPlanLogicalOptimizer
    [junit] Tests run: 1, Failures: 0, Errors: 0, Skipped: 0, Time elapsed: 1.447 sec
    [junit] Running org.apache.pig.test.TestNewPlanOperatorPlan
    [junit] Tests run: 47, Failures: 0, Errors: 0, Skipped: 0, Time elapsed: 4.234 sec
    [junit] Running org.apache.pig.test.TestNewPlanPruneMapKeys
    [junit] Tests run: 8, Failures: 0, Errors: 0, Skipped: 0, Time elapsed: 3.102 sec
    [junit] Running org.apache.pig.test.TestNewPlanPushDownForeachFlatten
    [junit] Tests run: 45, Failures: 0, Errors: 0, Skipped: 0, Time elapsed: 7.488 sec
    [junit] Running org.apache.pig.test.TestNewPlanPushUpFilter
    [junit] Tests run: 46, Failures: 0, Errors: 0, Skipped: 0, Time elapsed: 7.482 sec
    [junit] Running org.apache.pig.test.TestNewPlanRule
    [junit] Tests run: 4, Failures: 0, Errors: 0, Skipped: 0, Time elapsed: 0.337 sec
    [junit] Running org.apache.pig.test.TestNotEqualTo
    [junit] Tests run: 28, Failures: 0, Errors: 0, Skipped: 0, Time elapsed: 0.451 sec
    [junit] Running org.apache.pig.test.TestNull
    [junit] Tests run: 2, Failures: 0, Errors: 0, Skipped: 0, Time elapsed: 0.455 sec
    [junit] Running org.apache.pig.test.TestNullConstant
    [junit] Tests run: 8, Failures: 0, Errors: 0, Skipped: 0, Time elapsed: 24.901 sec
    [junit] Running org.apache.pig.test.TestNumberOfReducers
    [junit] Tests run: 10, Failures: 0, Errors: 0, Skipped: 0, Time elapsed: 512.42 sec
    [junit] Running org.apache.pig.test.TestOptimizeLimit
    [junit] Tests run: 12, Failures: 0, Errors: 0, Skipped: 0, Time elapsed: 3.442 sec
    [junit] Running org.apache.pig.test.TestOrderBy3
    [junit] Tests run: 4, Failures: 0, Errors: 0, Skipped: 0, Time elapsed: 14.503 sec
    [junit] Running org.apache.pig.test.TestPOBinCond
    [junit] Tests run: 10, Failures: 0, Errors: 0, Skipped: 0, Time elapsed: 0.459 sec
    [junit] Running org.apache.pig.test.TestPOCast
    [junit] Tests run: 14, Failures: 0, Errors: 0, Skipped: 0, Time elapsed: 0.892 sec
    [junit] Running org.apache.pig.test.TestPODistinct
    [junit] Tests run: 6, Failures: 0, Errors: 0, Skipped: 0, Time elapsed: 0.392 sec
    [junit] Running org.apache.pig.test.TestPOGenerate
    [junit] Tests run: 3, Failures: 0, Errors: 0, Skipped: 0, Time elapsed: 0.37 sec
    [junit] Running org.apache.pig.test.TestPOMapLookUp
    [junit] Tests run: 1, Failures: 0, Errors: 0, Skipped: 0, Time elapsed: 0.358 sec
    [junit] Running org.apache.pig.test.TestPONegative
    [junit] Tests run: 9, Failures: 0, Errors: 0, Skipped: 0, Time elapsed: 5.763 sec
    [junit] Running org.apache.pig.test.TestPOPartialAgg
    [junit] Tests run: 16, Failures: 0, Errors: 0, Skipped: 0, Time elapsed: 4.091 sec
    [junit] Running org.apache.pig.test.TestPOPartialAggPlan
    [junit] Tests run: 1, Failures: 0, Errors: 0, Skipped: 1, Time elapsed: 0.246 sec
    [junit] Running org.apache.pig.test.TestPORegexp
    [junit] Tests run: 2, Failures: 0, Errors: 0, Skipped: 0, Time elapsed: 0.373 sec
    [junit] Running org.apache.pig.test.TestPOSort
    [junit] Tests run: 14, Failures: 0, Errors: 0, Skipped: 0, Time elapsed: 0.446 sec
    [junit] Running org.apache.pig.test.TestPOSplit
    [junit] Tests run: 1, Failures: 0, Errors: 0, Skipped: 0, Time elapsed: 0.361 sec
    [junit] Running org.apache.pig.test.TestPOUserFunc
    [junit] Tests run: 6, Failures: 0, Errors: 0, Skipped: 0, Time elapsed: 0.448 sec
    [junit] Running org.apache.pig.test.TestPackage
    [junit] Tests run: 1, Failures: 0, Errors: 0, Skipped: 0, Time elapsed: 7.781 sec
    [junit] Running org.apache.pig.test.TestParamSubPreproc
    [junit] Tests run: 36, Failures: 0, Errors: 0, Skipped: 0, Time elapsed: 4.472 sec
    [junit] Running org.apache.pig.test.TestParser
    [junit] Tests run: 4, Failures: 0, Errors: 0, Skipped: 0, Time elapsed: 5.219 sec
    [junit] Running org.apache.pig.test.TestPhyOp
    [junit] Tests run: 1, Failures: 0, Errors: 0, Skipped: 0, Time elapsed: 0.446 sec
    [junit] Running org.apache.pig.test.TestPhyPatternMatch
    [junit] Tests run: 4, Failures: 0, Errors: 0, Skipped: 0, Time elapsed: 0.362 sec
    [junit] Running org.apache.pig.test.TestPigContext
    [junit] Tests run: 6, Failures: 0, Errors: 0, Skipped: 0, Time elapsed: 60.948 sec
    [junit] Running org.apache.pig.test.TestPigContextClassCache
    [junit] Tests run: 1, Failures: 0, Errors: 0, Skipped: 0, Time elapsed: 0.345 sec
    [junit] Running org.apache.pig.test.TestPigException
    [junit] Tests run: 2, Failures: 0, Errors: 0, Skipped: 0, Time elapsed: 0.256 sec
    [junit] Running org.apache.pig.test.TestPigProgressReporting
    [junit] Tests run: 1, Failures: 0, Errors: 0, Skipped: 0, Time elapsed: 44.471 sec
    [junit] Running org.apache.pig.test.TestPigRunner
    [junit] Tests run: 30, Failures: 0, Errors: 0, Skipped: 1, Time elapsed: 185.968 sec
    [junit] Running org.apache.pig.test.TestPigScriptParser
    [junit] Tests run: 4, Failures: 0, Errors: 0, Skipped: 0, Time elapsed: 4.377 sec
    [junit] Running org.apache.pig.test.TestPigServer
    [junit] Tests run: 31, Failures: 0, Errors: 0, Skipped: 0, Time elapsed: 74.66 sec
    [junit] Running org.apache.pig.test.TestPigServerLocal
    [junit] Tests run: 7, Failures: 0, Errors: 0, Skipped: 0, Time elapsed: 34.197 sec
    [junit] Running org.apache.pig.test.TestPigServerWithMacros
    [junit] Tests run: 2, Failures: 0, Errors: 0, Skipped: 0, Time elapsed: 8.571 sec
    [junit] Running org.apache.pig.test.TestPigServerWithMacrosRemote
    [junit] Tests run: 1, Failures: 0, Errors: 0, Skipped: 0, Time elapsed: 30.798 sec
    [junit] Running org.apache.pig.test.TestPigSplit
    [junit] Tests run: 3, Failures: 0, Errors: 1, Skipped: 0, Time elapsed: 84.551 sec
    [junit] Test org.apache.pig.test.TestPigSplit FAILED
    [junit] Running org.apache.pig.test.TestPigStats
    [junit] Tests run: 1, Failures: 0, Errors: 0, Skipped: 1, Time elapsed: 0.219 sec
    [junit] Running org.apache.pig.test.TestPigStorage
    [junit] Tests run: 20, Failures: 0, Errors: 0, Skipped: 0, Time elapsed: 68.058 sec
    [junit] Running org.apache.pig.test.TestPigStreaming
    [junit] Tests run: 13, Failures: 0, Errors: 0, Skipped: 0, Time elapsed: 0.366 sec
    [junit] Running org.apache.pig.test.TestPigTupleRawComparator
    [junit] Tests run: 16, Failures: 0, Errors: 0, Skipped: 0, Time elapsed: 1.774 sec
    [junit] Running org.apache.pig.test.TestPinOptions
    [junit] Tests run: 3, Failures: 0, Errors: 0, Skipped: 0, Time elapsed: 2.934 sec
    [junit] Running org.apache.pig.test.TestPlanGeneration
    [junit] Tests run: 10, Failures: 0, Errors: 0, Skipped: 0, Time elapsed: 2.857 sec
    [junit] Running org.apache.pig.test.TestPoissonSampleLoader
    [junit] Tests run: 1, Failures: 0, Errors: 0, Skipped: 0, Time elapsed: 5.658 sec
    [junit] Running org.apache.pig.test.TestPredeployedJar
    [junit] Tests run: 2, Failures: 0, Errors: 0, Skipped: 0, Time elapsed: 39.187 sec
    [junit] Running org.apache.pig.test.TestProject
    [junit] Tests run: 12, Failures: 0, Errors: 0, Skipped: 0, Time elapsed: 13.208 sec
    [junit] Running org.apache.pig.test.TestProjectRange
    [junit] Tests run: 23, Failures: 0, Errors: 0, Skipped: 0, Time elapsed: 103.365 sec
    [junit] Running org.apache.pig.test.TestProjectStarExpander
    [junit] Tests run: 2, Failures: 0, Errors: 0, Skipped: 0, Time elapsed: 8.327 sec
    [junit] Running org.apache.pig.test.TestProjectStarRangeInUdf
    [junit] Tests run: 15, Failures: 0, Errors: 0, Skipped: 0, Time elapsed: 10.079 sec
    [junit] Running org.apache.pig.test.TestPruneColumn
    [junit] Tests run: 71, Failures: 0, Errors: 0, Skipped: 0, Time elapsed: 166.378 sec
    [junit] Running org.apache.pig.test.TestRank1
    [junit] Tests run: 9, Failures: 0, Errors: 0, Skipped: 0, Time elapsed: 28.008 sec
    [junit] Running org.apache.pig.test.TestRank2
    [junit] Tests run: 4, Failures: 0, Errors: 0, Skipped: 0, Time elapsed: 28.174 sec
    [junit] Running org.apache.pig.test.TestRank3
    [junit] Tests run: 4, Failures: 0, Errors: 0, Skipped: 0, Time elapsed: 22.286 sec
    [junit] Running org.apache.pig.test.TestReadToEndLoader
    [junit] Tests run: 1, Failures: 0, Errors: 0, Skipped: 0, Time elapsed: 1.178 sec
    [junit] Running org.apache.pig.test.TestRegexp
    [junit] Tests run: 2, Failures: 0, Errors: 0, Skipped: 0, Time elapsed: 0.351 sec
    [junit] Running org.apache.pig.test.TestRegisteredJarVisibility
    [junit] Tests run: 4, Failures: 0, Errors: 0, Skipped: 0, Time elapsed: 29.541 sec
    [junit] Running org.apache.pig.test.TestRelationToExprProject
    [junit] Tests run: 5, Failures: 0, Errors: 0, Skipped: 0, Time elapsed: 16.846 sec
    [junit] Running org.apache.pig.test.TestResourceSchema
    [junit] Tests run: 9, Failures: 0, Errors: 0, Skipped: 0, Time elapsed: 0.714 sec
    [junit] Running org.apache.pig.test.TestRollupDimensions
    [junit] Tests run: 1, Failures: 0, Errors: 0, Skipped: 0, Time elapsed: 0.361 sec
    [junit] Running org.apache.pig.test.TestSample
    [junit] Tests run: 7, Failures: 0, Errors: 0, Skipped: 0, Time elapsed: 46.335 sec
    [junit] Running org.apache.pig.test.TestSampleOptimizer
    [junit] Tests run: 5, Failures: 0, Errors: 0, Skipped: 0, Time elapsed: 88.415 sec
    [junit] Running org.apache.pig.test.TestScalarAliases
    [junit] Tests run: 2, Failures: 0, Errors: 0, Skipped: 1, Time elapsed: 34.269 sec
    [junit] Running org.apache.pig.test.TestScalarAliasesLocal
    [junit] Tests run: 12, Failures: 0, Errors: 0, Skipped: 0, Time elapsed: 72.3 sec
    [junit] Running org.apache.pig.test.TestSchema
    [junit] Tests run: 31, Failures: 0, Errors: 0, Skipped: 0, Time elapsed: 52.222 sec
    [junit] Running org.apache.pig.test.TestSchemaUtil
    [junit] Tests run: 2, Failures: 0, Errors: 0, Skipped: 0, Time elapsed: 0.336 sec
    [junit] Running org.apache.pig.test.TestScriptLanguage
    [junit] Tests run: 19, Failures: 0, Errors: 0, Skipped: 1, Time elapsed: 299.533 sec
    [junit] Running org.apache.pig.test.TestScriptLanguageJavaScript
    [junit] Tests run: 2, Failures: 0, Errors: 0, Skipped: 0, Time elapsed: 103.54 sec
    [junit] Running org.apache.pig.test.TestScriptUDF
    [junit] Tests run: 6, Failures: 0, Errors: 0, Skipped: 0, Time elapsed: 245.402 sec
    [junit] Running org.apache.pig.test.TestScriptingLanguagePython
    [junit] Tests run: 1, Failures: 0, Errors: 0, Skipped: 0, Time elapsed: 34.355 sec
    [junit] Running org.apache.pig.test.TestSecondarySort
    [junit] Tests run: 1, Failures: 0, Errors: 0, Skipped: 1, Time elapsed: 0.238 sec
    [junit] Running org.apache.pig.test.TestShortcuts
    [junit] Tests run: 19, Failures: 0, Errors: 0, Skipped: 0, Time elapsed: 9.922 sec
    [junit] Running org.apache.pig.test.TestSkewedJoin
    [junit] Tests run: 14, Failures: 0, Errors: 1, Skipped: 0, Time elapsed: 187.642 sec
    [junit] Test org.apache.pig.test.TestSkewedJoin FAILED
    [junit] Running org.apache.pig.test.TestSplit
    [junit] Tests run: 4, Failures: 0, Errors: 0, Skipped: 0, Time elapsed: 12.935 sec
    [junit] Running org.apache.pig.test.TestSplitCombine
    [junit] Tests run: 11, Failures: 0, Errors: 0, Skipped: 0, Time elapsed: 1.377 sec
    [junit] Running org.apache.pig.test.TestSplitIndex
    [junit] Tests run: 2, Failures: 0, Errors: 0, Skipped: 0, Time elapsed: 8.004 sec
    [junit] Running org.apache.pig.test.TestSplitStore
    [junit] Tests run: 9, Failures: 0, Errors: 0, Skipped: 0, Time elapsed: 94.458 sec
    [junit] Running org.apache.pig.test.TestStore
    [junit] Tests run: 18, Failures: 0, Errors: 0, Skipped: 0, Time elapsed: 151.913 sec
    [junit] Running org.apache.pig.test.TestStoreBase
    [junit] Tests run: 1, Failures: 0, Errors: 0, Skipped: 1, Time elapsed: 0.237 sec
    [junit] Running org.apache.pig.test.TestStoreInstances
    [junit] Tests run: 1, Failures: 0, Errors: 0, Skipped: 0, Time elapsed: 54.283 sec
    [junit] Running org.apache.pig.test.TestStoreLocal
    [junit] Tests run: 6, Failures: 0, Errors: 0, Skipped: 0, Time elapsed: 30.93 sec
    [junit] Running org.apache.pig.test.TestStoreOld
    [junit] Tests run: 3, Failures: 0, Errors: 0, Skipped: 0, Time elapsed: 49.02 sec
    [junit] Running org.apache.pig.test.TestStreaming
    [junit] Tests run: 15, Failures: 0, Errors: 0, Skipped: 0, Time elapsed: 329.665 sec
    [junit] Running org.apache.pig.test.TestStreamingLocal
    [junit] Tests run: 7, Failures: 0, Errors: 0, Skipped: 0, Time elapsed: 31.556 sec
    [junit] Running org.apache.pig.test.TestStringUDFs
    [junit] Tests run: 17, Failures: 0, Errors: 0, Skipped: 0, Time elapsed: 0.299 sec
    [junit] Running org.apache.pig.test.TestSubtract
    [junit] Tests run: 1, Failures: 0, Errors: 0, Skipped: 0, Time elapsed: 0.429 sec
    [junit] Running org.apache.pig.test.TestTextDataParser
    [junit] Tests run: 15, Failures: 0, Errors: 0, Skipped: 0, Time elapsed: 0.859 sec
    [junit] Running org.apache.pig.test.TestTmpFileCompression
    [junit] Tests run: 8, Failures: 0, Errors: 0, Skipped: 0, Time elapsed: 313.278 sec
    [junit] Running org.apache.pig.test.TestToolsPigServer
    [junit] Tests run: 2, Failures: 0, Errors: 0, Skipped: 0, Time elapsed: 88.111 sec
    [junit] Running org.apache.pig.test.TestTuple
    [junit] Tests run: 12, Failures: 0, Errors: 0, Skipped: 0, Time elapsed: 0.609 sec
    [junit] Running org.apache.pig.test.TestTypeCheckingValidatorNewLP
    [junit] Tests run: 141, Failures: 0, Errors: 0, Skipped: 0, Time elapsed: 23.224 sec
    [junit] Running org.apache.pig.test.TestTypedMap
    [junit] Tests run: 8, Failures: 0, Errors: 0, Skipped: 0, Time elapsed: 24.566 sec
    [junit] Running org.apache.pig.test.TestUDF
    [junit] Tests run: 10, Failures: 0, Errors: 0, Skipped: 0, Time elapsed: 83.358 sec
    [junit] Running org.apache.pig.test.TestUDFContext
    [junit] Tests run: 2, Failures: 0, Errors: 0, Skipped: 0, Time elapsed: 6.151 sec
    [junit] Running org.apache.pig.test.TestUDFGroovy
    [junit] Tests run: 7, Failures: 0, Errors: 0, Skipped: 0, Time elapsed: 26.234 sec
    [junit] Running org.apache.pig.test.TestUDFWithoutParameter
    [junit] Tests run: 1, Failures: 0, Errors: 0, Skipped: 0, Time elapsed: 5.75 sec
    [junit] Running org.apache.pig.test.TestUTF8
    [junit] Tests run: 4, Failures: 0, Errors: 0, Skipped: 0, Time elapsed: 8.337 sec
    [junit] Running org.apache.pig.test.TestUnion
    [junit] Tests run: 7, Failures: 0, Errors: 0, Skipped: 0, Time elapsed: 19.112 sec
    [junit] Running org.apache.pig.test.TestUnionOnSchema
    [junit] Tests run: 22, Failures: 0, Errors: 1, Skipped: 0, Time elapsed: 50.693 sec
    [junit] Test org.apache.pig.test.TestUnionOnSchema FAILED
    [junit] Running org.apache.pig.test.pigunit.TestPigTest
    [junit] Tests run: 22, Failures: 0, Errors: 0, Skipped: 1, Time elapsed: 52.821 sec
    [junit] Running org.apache.pig.test.pigunit.pig.TestGruntParser
    [junit] Tests run: 5, Failures: 0, Errors: 0, Skipped: 0, Time elapsed: 2.066 sec
    [junit] Running org.apache.pig.tez.TestGroupConstParallelTez
    [junit] Tests run: 3, Failures: 0, Errors: 0, Skipped: 0, Time elapsed: 71.975 sec
    [junit] Running org.apache.pig.tez.TestJobSubmissionTez
    [junit] Tests run: 7, Failures: 0, Errors: 0, Skipped: 2, Time elapsed: 24.75 sec
    [junit] Running org.apache.pig.tez.TestLoaderStorerShipCacheFilesTez
    [junit] Tests run: 4, Failures: 0, Errors: 0, Skipped: 0, Time elapsed: 2.82 sec
    [junit] Running org.apache.pig.tez.TestPOPartialAggPlanTez
    [junit] Tests run: 5, Failures: 0, Errors: 0, Skipped: 0, Time elapsed: 2.923 sec
    [junit] Running org.apache.pig.tez.TestPigStatsTez
    [junit] Tests run: 5, Failures: 0, Errors: 0, Skipped: 0, Time elapsed: 8.557 sec
    [junit] Running org.apache.pig.tez.TestSecondarySortTez
    [junit] Tests run: 18, Failures: 0, Errors: 0, Skipped: 0, Time elapsed: 118.286 sec
    [junit] Running org.apache.pig.tez.TestTezAutoParallelism
    [junit] Tests run: 8, Failures: 0, Errors: 7, Skipped: 0, Time elapsed: 242.514 sec
    [junit] Test org.apache.pig.tez.TestTezAutoParallelism FAILED
    [junit] Running org.apache.pig.tez.TestTezCompiler
    [junit] Tests run: 43, Failures: 0, Errors: 9, Skipped: 0, Time elapsed: 12.06 sec
    [junit] Test org.apache.pig.tez.TestTezCompiler FAILED
    [junit] Running org.apache.pig.tez.TestTezGraceParallelism
    [junit] Tests run: 4, Failures: 0, Errors: 0, Skipped: 0, Time elapsed: 33.901 sec
    [junit] Running org.apache.pig.tez.TestTezJobControlCompiler
    [junit] Tests run: 8, Failures: 0, Errors: 3, Skipped: 0, Time elapsed: 4.899 sec
    [junit] Test org.apache.pig.tez.TestTezJobControlCompiler FAILED
    [junit] Running org.apache.pig.tez.TestTezLauncher
    [junit] Tests run: 2, Failures: 0, Errors: 0, Skipped: 0, Time elapsed: 55.568 sec
    [junit] Running org.apache.pig.tools.grunt.TestGruntParser
    [junit] Tests run: 1, Failures: 0, Errors: 0, Skipped: 0, Time elapsed: 1.34 sec
   [delete] Deleting directory /tmp/pig_junit_tmp1783488833

BUILD FAILED
<https://builds.apache.org/job/Pig-trunk-commit/ws/trunk/build.xml>:985: Tests failed!

Total time: 630 minutes 52 seconds
Build step 'Execute shell' marked build as failure
Recording test results
Publishing Javadoc
Recording fingerprints

Mime
View raw message