pig-dev mailing list archives

Site index · List index
Message view « Date » · « Thread »
Top « Date » · « Thread »
From Apache Jenkins Server <jenk...@builds.apache.org>
Subject Build failed in Jenkins: Pig-trunk-commit #2109
Date Mon, 27 Apr 2015 13:50:47 GMT
See <https://builds.apache.org/job/Pig-trunk-commit/2109/>

------------------------------------------
[...truncated 4425 lines...]
    [junit] Tests run: 12, Failures: 0, Errors: 0, Skipped: 0, Time elapsed: 2.963 sec
    [junit] Running org.apache.pig.test.TestNewPlanImplicitSplit
    [junit] Tests run: 3, Failures: 0, Errors: 0, Skipped: 0, Time elapsed: 34.884 sec
    [junit] Running org.apache.pig.test.TestNewPlanListener
    [junit] Tests run: 4, Failures: 0, Errors: 0, Skipped: 0, Time elapsed: 0.36 sec
    [junit] Running org.apache.pig.test.TestNewPlanLogToPhyTranslationVisitor
    [junit] Tests run: 27, Failures: 0, Errors: 0, Skipped: 0, Time elapsed: 4.674 sec
    [junit] Running org.apache.pig.test.TestNewPlanLogicalOptimizer
    [junit] Tests run: 1, Failures: 0, Errors: 0, Skipped: 0, Time elapsed: 1.319 sec
    [junit] Running org.apache.pig.test.TestNewPlanOperatorPlan
    [junit] Tests run: 47, Failures: 0, Errors: 0, Skipped: 0, Time elapsed: 3.982 sec
    [junit] Running org.apache.pig.test.TestNewPlanPruneMapKeys
    [junit] Tests run: 8, Failures: 0, Errors: 0, Skipped: 0, Time elapsed: 2.771 sec
    [junit] Running org.apache.pig.test.TestNewPlanPushDownForeachFlatten
    [junit] Tests run: 45, Failures: 0, Errors: 0, Skipped: 0, Time elapsed: 6.714 sec
    [junit] Running org.apache.pig.test.TestNewPlanPushUpFilter
    [junit] Tests run: 46, Failures: 0, Errors: 0, Skipped: 0, Time elapsed: 6.784 sec
    [junit] Running org.apache.pig.test.TestNewPlanRule
    [junit] Tests run: 4, Failures: 0, Errors: 0, Skipped: 0, Time elapsed: 0.33 sec
    [junit] Running org.apache.pig.test.TestNotEqualTo
    [junit] Tests run: 28, Failures: 0, Errors: 0, Skipped: 0, Time elapsed: 0.447 sec
    [junit] Running org.apache.pig.test.TestNull
    [junit] Tests run: 2, Failures: 0, Errors: 0, Skipped: 0, Time elapsed: 0.439 sec
    [junit] Running org.apache.pig.test.TestNullConstant
    [junit] Tests run: 8, Failures: 0, Errors: 0, Skipped: 0, Time elapsed: 23.406 sec
    [junit] Running org.apache.pig.test.TestNumberOfReducers
    [junit] Tests run: 10, Failures: 0, Errors: 0, Skipped: 0, Time elapsed: 511.705 sec
    [junit] Running org.apache.pig.test.TestOptimizeLimit
    [junit] Tests run: 12, Failures: 0, Errors: 0, Skipped: 0, Time elapsed: 3.173 sec
    [junit] Running org.apache.pig.test.TestOrderBy3
    [junit] Tests run: 4, Failures: 0, Errors: 0, Skipped: 0, Time elapsed: 13.148 sec
    [junit] Running org.apache.pig.test.TestPOBinCond
    [junit] Tests run: 10, Failures: 0, Errors: 0, Skipped: 0, Time elapsed: 0.45 sec
    [junit] Running org.apache.pig.test.TestPOCast
    [junit] Tests run: 14, Failures: 0, Errors: 0, Skipped: 0, Time elapsed: 0.891 sec
    [junit] Running org.apache.pig.test.TestPODistinct
    [junit] Tests run: 6, Failures: 0, Errors: 0, Skipped: 0, Time elapsed: 0.4 sec
    [junit] Running org.apache.pig.test.TestPOGenerate
    [junit] Tests run: 3, Failures: 0, Errors: 0, Skipped: 0, Time elapsed: 0.37 sec
    [junit] Running org.apache.pig.test.TestPOMapLookUp
    [junit] Tests run: 1, Failures: 0, Errors: 0, Skipped: 0, Time elapsed: 0.353 sec
    [junit] Running org.apache.pig.test.TestPONegative
    [junit] Tests run: 9, Failures: 0, Errors: 0, Skipped: 0, Time elapsed: 5.638 sec
    [junit] Running org.apache.pig.test.TestPOPartialAgg
    [junit] Tests run: 16, Failures: 0, Errors: 0, Skipped: 0, Time elapsed: 3.915 sec
    [junit] Running org.apache.pig.test.TestPOPartialAggPlan
    [junit] Tests run: 1, Failures: 0, Errors: 0, Skipped: 1, Time elapsed: 0.246 sec
    [junit] Running org.apache.pig.test.TestPORegexp
    [junit] Tests run: 2, Failures: 0, Errors: 0, Skipped: 0, Time elapsed: 0.373 sec
    [junit] Running org.apache.pig.test.TestPOSort
    [junit] Tests run: 14, Failures: 0, Errors: 0, Skipped: 0, Time elapsed: 0.398 sec
    [junit] Running org.apache.pig.test.TestPOSplit
    [junit] Tests run: 1, Failures: 0, Errors: 0, Skipped: 0, Time elapsed: 0.367 sec
    [junit] Running org.apache.pig.test.TestPOUserFunc
    [junit] Tests run: 6, Failures: 0, Errors: 0, Skipped: 0, Time elapsed: 0.404 sec
    [junit] Running org.apache.pig.test.TestPackage
    [junit] Tests run: 1, Failures: 0, Errors: 0, Skipped: 0, Time elapsed: 7.368 sec
    [junit] Running org.apache.pig.test.TestParamSubPreproc
    [junit] Tests run: 36, Failures: 0, Errors: 0, Skipped: 0, Time elapsed: 4.429 sec
    [junit] Running org.apache.pig.test.TestParser
    [junit] Tests run: 4, Failures: 0, Errors: 0, Skipped: 0, Time elapsed: 5.143 sec
    [junit] Running org.apache.pig.test.TestPhyOp
    [junit] Tests run: 1, Failures: 0, Errors: 0, Skipped: 0, Time elapsed: 0.43 sec
    [junit] Running org.apache.pig.test.TestPhyPatternMatch
    [junit] Tests run: 4, Failures: 0, Errors: 0, Skipped: 0, Time elapsed: 0.352 sec
    [junit] Running org.apache.pig.test.TestPigContext
    [junit] Tests run: 6, Failures: 0, Errors: 0, Skipped: 0, Time elapsed: 59.629 sec
    [junit] Running org.apache.pig.test.TestPigContextClassCache
    [junit] Tests run: 1, Failures: 0, Errors: 0, Skipped: 0, Time elapsed: 0.343 sec
    [junit] Running org.apache.pig.test.TestPigException
    [junit] Tests run: 2, Failures: 0, Errors: 0, Skipped: 0, Time elapsed: 0.251 sec
    [junit] Running org.apache.pig.test.TestPigProgressReporting
    [junit] Tests run: 1, Failures: 0, Errors: 0, Skipped: 0, Time elapsed: 43.426 sec
    [junit] Running org.apache.pig.test.TestPigRunner
    [junit] Tests run: 30, Failures: 0, Errors: 0, Skipped: 1, Time elapsed: 201.372 sec
    [junit] Running org.apache.pig.test.TestPigScriptParser
    [junit] Tests run: 4, Failures: 0, Errors: 0, Skipped: 0, Time elapsed: 4.103 sec
    [junit] Running org.apache.pig.test.TestPigServer
    [junit] Tests run: 31, Failures: 0, Errors: 0, Skipped: 0, Time elapsed: 73.024 sec
    [junit] Running org.apache.pig.test.TestPigServerLocal
    [junit] Tests run: 7, Failures: 0, Errors: 0, Skipped: 0, Time elapsed: 34.7 sec
    [junit] Running org.apache.pig.test.TestPigServerWithMacros
    [junit] Tests run: 2, Failures: 0, Errors: 0, Skipped: 0, Time elapsed: 26.439 sec
    [junit] Running org.apache.pig.test.TestPigServerWithMacrosRemote
    [junit] Tests run: 1, Failures: 0, Errors: 0, Skipped: 0, Time elapsed: 31.765 sec
    [junit] Running org.apache.pig.test.TestPigSplit
    [junit] Tests run: 3, Failures: 0, Errors: 0, Skipped: 0, Time elapsed: 68.569 sec
    [junit] Running org.apache.pig.test.TestPigStats
    [junit] Tests run: 1, Failures: 0, Errors: 0, Skipped: 1, Time elapsed: 0.218 sec
    [junit] Running org.apache.pig.test.TestPigStorage
    [junit] Tests run: 20, Failures: 0, Errors: 0, Skipped: 0, Time elapsed: 64.573 sec
    [junit] Running org.apache.pig.test.TestPigStreaming
    [junit] Tests run: 13, Failures: 0, Errors: 0, Skipped: 0, Time elapsed: 0.361 sec
    [junit] Running org.apache.pig.test.TestPigTupleRawComparator
    [junit] Tests run: 16, Failures: 0, Errors: 0, Skipped: 0, Time elapsed: 1.565 sec
    [junit] Running org.apache.pig.test.TestPinOptions
    [junit] Tests run: 3, Failures: 0, Errors: 0, Skipped: 0, Time elapsed: 2.727 sec
    [junit] Running org.apache.pig.test.TestPlanGeneration
    [junit] Tests run: 10, Failures: 0, Errors: 0, Skipped: 0, Time elapsed: 2.646 sec
    [junit] Running org.apache.pig.test.TestPoissonSampleLoader
    [junit] Tests run: 1, Failures: 0, Errors: 0, Skipped: 0, Time elapsed: 5.508 sec
    [junit] Running org.apache.pig.test.TestPredeployedJar
    [junit] Tests run: 2, Failures: 0, Errors: 0, Skipped: 0, Time elapsed: 39.091 sec
    [junit] Running org.apache.pig.test.TestProject
    [junit] Tests run: 12, Failures: 0, Errors: 0, Skipped: 0, Time elapsed: 13.022 sec
    [junit] Running org.apache.pig.test.TestProjectRange
    [junit] Tests run: 23, Failures: 0, Errors: 0, Skipped: 0, Time elapsed: 104.802 sec
    [junit] Running org.apache.pig.test.TestProjectStarExpander
    [junit] Tests run: 2, Failures: 0, Errors: 0, Skipped: 0, Time elapsed: 8.153 sec
    [junit] Running org.apache.pig.test.TestProjectStarRangeInUdf
    [junit] Tests run: 15, Failures: 0, Errors: 0, Skipped: 0, Time elapsed: 9.483 sec
    [junit] Running org.apache.pig.test.TestPruneColumn
    [junit] Tests run: 71, Failures: 0, Errors: 0, Skipped: 0, Time elapsed: 164.219 sec
    [junit] Running org.apache.pig.test.TestRank1
    [junit] Tests run: 9, Failures: 0, Errors: 0, Skipped: 0, Time elapsed: 27.493 sec
    [junit] Running org.apache.pig.test.TestRank2
    [junit] Tests run: 4, Failures: 0, Errors: 0, Skipped: 0, Time elapsed: 14.904 sec
    [junit] Running org.apache.pig.test.TestRank3
    [junit] Tests run: 4, Failures: 0, Errors: 0, Skipped: 0, Time elapsed: 19.921 sec
    [junit] Running org.apache.pig.test.TestReadToEndLoader
    [junit] Tests run: 1, Failures: 0, Errors: 0, Skipped: 0, Time elapsed: 1.153 sec
    [junit] Running org.apache.pig.test.TestRegexp
    [junit] Tests run: 2, Failures: 0, Errors: 0, Skipped: 0, Time elapsed: 0.366 sec
    [junit] Running org.apache.pig.test.TestRegisteredJarVisibility
    [junit] Tests run: 4, Failures: 0, Errors: 0, Skipped: 0, Time elapsed: 28.906 sec
    [junit] Running org.apache.pig.test.TestRelationToExprProject
    [junit] Tests run: 5, Failures: 0, Errors: 0, Skipped: 0, Time elapsed: 39.576 sec
    [junit] Running org.apache.pig.test.TestResourceSchema
    [junit] Tests run: 9, Failures: 0, Errors: 0, Skipped: 0, Time elapsed: 0.72 sec
    [junit] Running org.apache.pig.test.TestRollupDimensions
    [junit] Tests run: 1, Failures: 0, Errors: 0, Skipped: 0, Time elapsed: 0.36 sec
    [junit] Running org.apache.pig.test.TestSample
    [junit] Tests run: 7, Failures: 0, Errors: 0, Skipped: 0, Time elapsed: 46.99 sec
    [junit] Running org.apache.pig.test.TestSampleOptimizer
    [junit] Tests run: 5, Failures: 0, Errors: 0, Skipped: 0, Time elapsed: 103.379 sec
    [junit] Running org.apache.pig.test.TestScalarAliases
    [junit] Tests run: 2, Failures: 0, Errors: 0, Skipped: 1, Time elapsed: 35.116 sec
    [junit] Running org.apache.pig.test.TestScalarAliasesLocal
    [junit] Tests run: 12, Failures: 0, Errors: 0, Skipped: 0, Time elapsed: 74.244 sec
    [junit] Running org.apache.pig.test.TestSchema
    [junit] Tests run: 31, Failures: 0, Errors: 0, Skipped: 0, Time elapsed: 52.006 sec
    [junit] Running org.apache.pig.test.TestSchemaUtil
    [junit] Tests run: 2, Failures: 0, Errors: 0, Skipped: 0, Time elapsed: 0.348 sec
    [junit] Running org.apache.pig.test.TestScriptLanguage
    [junit] Tests run: 19, Failures: 0, Errors: 0, Skipped: 1, Time elapsed: 304.4 sec
    [junit] Running org.apache.pig.test.TestScriptLanguageJavaScript
    [junit] Tests run: 2, Failures: 0, Errors: 0, Skipped: 0, Time elapsed: 119.808 sec
    [junit] Running org.apache.pig.test.TestScriptUDF
    [junit] Tests run: 6, Failures: 0, Errors: 0, Skipped: 0, Time elapsed: 256.121 sec
    [junit] Running org.apache.pig.test.TestScriptingLanguagePython
    [junit] Tests run: 1, Failures: 0, Errors: 0, Skipped: 0, Time elapsed: 34.659 sec
    [junit] Running org.apache.pig.test.TestSecondarySort
    [junit] Tests run: 1, Failures: 0, Errors: 0, Skipped: 1, Time elapsed: 0.286 sec
    [junit] Running org.apache.pig.test.TestShortcuts
    [junit] Tests run: 19, Failures: 0, Errors: 0, Skipped: 0, Time elapsed: 9.607 sec
    [junit] Running org.apache.pig.test.TestSkewedJoin
    [junit] Tests run: 14, Failures: 0, Errors: 0, Skipped: 0, Time elapsed: 177.748 sec
    [junit] Running org.apache.pig.test.TestSplit
    [junit] Tests run: 4, Failures: 0, Errors: 0, Skipped: 0, Time elapsed: 12.937 sec
    [junit] Running org.apache.pig.test.TestSplitCombine
    [junit] Tests run: 11, Failures: 0, Errors: 0, Skipped: 0, Time elapsed: 1.235 sec
    [junit] Running org.apache.pig.test.TestSplitIndex
    [junit] Tests run: 2, Failures: 0, Errors: 0, Skipped: 0, Time elapsed: 7.906 sec
    [junit] Running org.apache.pig.test.TestSplitStore
    [junit] Tests run: 9, Failures: 0, Errors: 0, Skipped: 0, Time elapsed: 93.819 sec
    [junit] Running org.apache.pig.test.TestStore
    [junit] Tests run: 18, Failures: 0, Errors: 0, Skipped: 0, Time elapsed: 153.491 sec
    [junit] Running org.apache.pig.test.TestStoreBase
    [junit] Tests run: 1, Failures: 0, Errors: 0, Skipped: 1, Time elapsed: 0.257 sec
    [junit] Running org.apache.pig.test.TestStoreInstances
    [junit] Tests run: 1, Failures: 0, Errors: 0, Skipped: 0, Time elapsed: 53.106 sec
    [junit] Running org.apache.pig.test.TestStoreLocal
    [junit] Tests run: 6, Failures: 0, Errors: 0, Skipped: 0, Time elapsed: 30.625 sec
    [junit] Running org.apache.pig.test.TestStoreOld
    [junit] Tests run: 3, Failures: 0, Errors: 0, Skipped: 0, Time elapsed: 48.77 sec
    [junit] Running org.apache.pig.test.TestStreaming
    [junit] Tests run: 15, Failures: 0, Errors: 0, Skipped: 0, Time elapsed: 333.357 sec
    [junit] Running org.apache.pig.test.TestStreamingLocal
    [junit] Tests run: 7, Failures: 0, Errors: 0, Skipped: 0, Time elapsed: 31.191 sec
    [junit] Running org.apache.pig.test.TestStringUDFs
    [junit] Tests run: 17, Failures: 0, Errors: 0, Skipped: 0, Time elapsed: 0.299 sec
    [junit] Running org.apache.pig.test.TestSubtract
    [junit] Tests run: 1, Failures: 0, Errors: 0, Skipped: 0, Time elapsed: 0.438 sec
    [junit] Running org.apache.pig.test.TestTextDataParser
    [junit] Tests run: 15, Failures: 0, Errors: 0, Skipped: 0, Time elapsed: 0.858 sec
    [junit] Running org.apache.pig.test.TestTmpFileCompression
    [junit] Tests run: 8, Failures: 0, Errors: 0, Skipped: 0, Time elapsed: 317.012 sec
    [junit] Running org.apache.pig.test.TestToolsPigServer
    [junit] Tests run: 2, Failures: 0, Errors: 0, Skipped: 0, Time elapsed: 82.966 sec
    [junit] Running org.apache.pig.test.TestTuple
    [junit] Tests run: 12, Failures: 0, Errors: 0, Skipped: 0, Time elapsed: 0.613 sec
    [junit] Running org.apache.pig.test.TestTypeCheckingValidatorNewLP
    [junit] Tests run: 141, Failures: 0, Errors: 0, Skipped: 0, Time elapsed: 21.08 sec
    [junit] Running org.apache.pig.test.TestTypedMap
    [junit] Tests run: 8, Failures: 0, Errors: 0, Skipped: 0, Time elapsed: 24.174 sec
    [junit] Running org.apache.pig.test.TestUDF
    [junit] Tests run: 10, Failures: 0, Errors: 0, Skipped: 0, Time elapsed: 97.718 sec
    [junit] Running org.apache.pig.test.TestUDFContext
    [junit] Tests run: 2, Failures: 0, Errors: 0, Skipped: 0, Time elapsed: 6.07 sec
    [junit] Running org.apache.pig.test.TestUDFGroovy
    [junit] Tests run: 7, Failures: 0, Errors: 0, Skipped: 0, Time elapsed: 21.198 sec
    [junit] Running org.apache.pig.test.TestUDFWithoutParameter
    [junit] Tests run: 1, Failures: 0, Errors: 0, Skipped: 0, Time elapsed: 5.687 sec
    [junit] Running org.apache.pig.test.TestUTF8
    [junit] Tests run: 4, Failures: 0, Errors: 0, Skipped: 0, Time elapsed: 8.2 sec
    [junit] Running org.apache.pig.test.TestUnion
    [junit] Tests run: 7, Failures: 0, Errors: 0, Skipped: 0, Time elapsed: 18.873 sec
    [junit] Running org.apache.pig.test.TestUnionOnSchema
    [junit] Tests run: 22, Failures: 0, Errors: 0, Skipped: 0, Time elapsed: 54.697 sec
    [junit] Running org.apache.pig.test.pigunit.TestPigTest
    [junit] Tests run: 22, Failures: 0, Errors: 0, Skipped: 1, Time elapsed: 53.231 sec
    [junit] Running org.apache.pig.test.pigunit.pig.TestGruntParser
    [junit] Tests run: 5, Failures: 0, Errors: 0, Skipped: 0, Time elapsed: 1.7 sec
    [junit] Running org.apache.pig.tez.TestGroupConstParallelTez
    [junit] Tests run: 3, Failures: 0, Errors: 0, Skipped: 0, Time elapsed: 52.677 sec
    [junit] Running org.apache.pig.tez.TestJobSubmissionTez
    [junit] Tests run: 7, Failures: 0, Errors: 0, Skipped: 2, Time elapsed: 23.487 sec
    [junit] Running org.apache.pig.tez.TestLoaderStorerShipCacheFilesTez
    [junit] Tests run: 4, Failures: 0, Errors: 0, Skipped: 0, Time elapsed: 2.744 sec
    [junit] Running org.apache.pig.tez.TestPOPartialAggPlanTez
    [junit] Tests run: 5, Failures: 0, Errors: 0, Skipped: 0, Time elapsed: 3.312 sec
    [junit] Running org.apache.pig.tez.TestPigStatsTez
    [junit] Tests run: 5, Failures: 0, Errors: 0, Skipped: 0, Time elapsed: 8.412 sec
    [junit] Running org.apache.pig.tez.TestSecondarySortTez
    [junit] Tests run: 18, Failures: 0, Errors: 1, Skipped: 0, Time elapsed: 132.379 sec
    [junit] Test org.apache.pig.tez.TestSecondarySortTez FAILED
    [junit] Running org.apache.pig.tez.TestTezAutoParallelism
    [junit] Tests run: 8, Failures: 0, Errors: 7, Skipped: 0, Time elapsed: 248.949 sec
    [junit] Test org.apache.pig.tez.TestTezAutoParallelism FAILED
    [junit] Running org.apache.pig.tez.TestTezCompiler
    [junit] Tests run: 43, Failures: 0, Errors: 0, Skipped: 0, Time elapsed: 11.807 sec
    [junit] Running org.apache.pig.tez.TestTezGraceParallelism
    [junit] Tests run: 4, Failures: 0, Errors: 0, Skipped: 0, Time elapsed: 32.644 sec
    [junit] Running org.apache.pig.tez.TestTezJobControlCompiler
    [junit] Tests run: 8, Failures: 0, Errors: 0, Skipped: 0, Time elapsed: 5.033 sec
    [junit] Running org.apache.pig.tez.TestTezLauncher
    [junit] Tests run: 2, Failures: 0, Errors: 0, Skipped: 0, Time elapsed: 54.299 sec
    [junit] Running org.apache.pig.tools.grunt.TestGruntParser
    [junit] Tests run: 1, Failures: 0, Errors: 0, Skipped: 0, Time elapsed: 1.261 sec
   [delete] Deleting directory /tmp/pig_junit_tmp1473657774

BUILD FAILED
<https://builds.apache.org/job/Pig-trunk-commit/ws/trunk/build.xml>:985: Tests failed!

Total time: 631 minutes 11 seconds
Build step 'Execute shell' marked build as failure
Recording test results
Publishing Javadoc
Recording fingerprints

Mime
View raw message