pig-dev mailing list archives

Site index · List index
Message view « Date » · « Thread »
Top « Date » · « Thread »
From Apache Jenkins Server <hud...@hudson.apache.org>
Subject Build failed in Jenkins: Pig-trunk-commit #822
Date Fri, 20 May 2011 01:04:03 GMT
See <https://builds.apache.org/hudson/job/Pig-trunk-commit/822/changes>

Changes:

[tomwhite] Include 32-bit and 64-bit native libraries in Jenkins tarball builds

------------------------------------------
[...truncated 4755 lines...]
	---------------------------------------------------------------------
	|     buildJar     |   57  |   0   |   0   |   8   ||   50  |   0   |
	---------------------------------------------------------------------
[ivy:retrieve] :: retrieving :: org.apache.pig#Pig
[ivy:retrieve] 	confs: [buildJar]
[ivy:retrieve] 	1 artifacts copied, 49 already retrieved (288kB/9ms)

buildJar:
     [echo] svnString svn: This client is too old to work with working copy '<https://builds.apache.org/hudson/job/Pig-trunk-commit/ws/trunk'.>
 You need
     [echo] to get a newer Subversion client, or to downgrade this working copy.
     [echo] See http://subversion.tigris.org/faq.html#working-copy-format-change
     [echo] for details.
      [jar] Manifest is invalid: Manifest line "to get a newer Subversion client, or to downgrade
this working cop" is not valid as it does not contain a name and a value separated by ': '

      [jar] error while reading original manifest in file: <https://builds.apache.org/hudson/job/Pig-trunk-commit/ws/trunk/build/pig-0.10.0-SNAPSHOT-core.jarInvalid>
Manifest: null
      [jar] Building jar: <https://builds.apache.org/hudson/job/Pig-trunk-commit/ws/trunk/build/pig-0.10.0-SNAPSHOT-core.jar>
      [jar] Manifest is invalid: Manifest line "to get a newer Subversion client, or to downgrade
this working cop" is not valid as it does not contain a name and a value separated by ': '

      [jar] error while reading original manifest in file: <https://builds.apache.org/hudson/job/Pig-trunk-commit/ws/trunk/build/pig-0.10.0-SNAPSHOT.jarInvalid>
Manifest: null
      [jar] Building jar: <https://builds.apache.org/hudson/job/Pig-trunk-commit/ws/trunk/build/pig-0.10.0-SNAPSHOT.jar>
     [copy] Copying 1 file to <https://builds.apache.org/hudson/job/Pig-trunk-commit/ws/trunk>

jarWithOutSvn:

findbugs:
    [mkdir] Created dir: <https://builds.apache.org/hudson/job/Pig-trunk-commit/ws/trunk/build/test/findbugs>
 [findbugs] Executing findbugs from ant task
 [findbugs] Running FindBugs...
 [findbugs] Exception in thread "main" java.io.IOException: invalid header field
 [findbugs] 	at java.util.jar.Attributes.read(Attributes.java:389)
 [findbugs] 	at java.util.jar.Manifest.read(Manifest.java:234)
 [findbugs] 	at java.util.jar.Manifest.<init>(Manifest.java:52)
 [findbugs] 	at edu.umd.cs.findbugs.classfile.impl.ClassPathBuilder.scanJarManifestForClassPathEntries(ClassPathBuilder.java:706)
 [findbugs] 	at edu.umd.cs.findbugs.classfile.impl.ClassPathBuilder.processWorkList(ClassPathBuilder.java:580)
 [findbugs] 	at edu.umd.cs.findbugs.classfile.impl.ClassPathBuilder.build(ClassPathBuilder.java:195)
 [findbugs] 	at edu.umd.cs.findbugs.FindBugs2.buildClassPath(FindBugs2.java:584)
 [findbugs] 	at edu.umd.cs.findbugs.FindBugs2.execute(FindBugs2.java:181)
 [findbugs] 	at edu.umd.cs.findbugs.FindBugs.runMain(FindBugs.java:348)
 [findbugs] 	at edu.umd.cs.findbugs.FindBugs2.main(FindBugs2.java:1057)
 [findbugs] Java Result: 1
 [findbugs] Output saved to <https://builds.apache.org/hudson/job/Pig-trunk-commit/ws/trunk/build/test/findbugs/pig-findbugs-report.xml>
     [xslt] Processing <https://builds.apache.org/hudson/job/Pig-trunk-commit/ws/trunk/build/test/findbugs/pig-findbugs-report.xml>
to <https://builds.apache.org/hudson/job/Pig-trunk-commit/ws/trunk/build/test/findbugs/pig-findbugs-report.html>
     [xslt] Loading stylesheet /homes/hudson/tools/findbugs/latest/src/xsl/default.xsl
     [xslt] : Error! Premature end of file.
     [xslt] : Error! com.sun.org.apache.xml.internal.utils.WrappedRuntimeException: Premature
end of file.
     [xslt] Failed to process <https://builds.apache.org/hudson/job/Pig-trunk-commit/ws/trunk/build/test/findbugs/pig-findbugs-report.xml>

BUILD FAILED
javax.xml.transform.TransformerException: javax.xml.transform.TransformerException: com.sun.org.apache.xml.internal.utils.WrappedRuntimeException:
Premature end of file.
	at com.sun.org.apache.xalan.internal.xsltc.trax.TransformerImpl.transform(TransformerImpl.java:719)
	at com.sun.org.apache.xalan.internal.xsltc.trax.TransformerImpl.transform(TransformerImpl.java:313)
	at org.apache.tools.ant.taskdefs.optional.TraXLiaison.transform(TraXLiaison.java:187)
	at org.apache.tools.ant.taskdefs.XSLTProcess.process(XSLTProcess.java:709)
	at org.apache.tools.ant.taskdefs.XSLTProcess.execute(XSLTProcess.java:333)
	at org.apache.tools.ant.UnknownElement.execute(UnknownElement.java:288)
	at sun.reflect.GeneratedMethodAccessor1.invoke(Unknown Source)
	at sun.reflect.DelegatingMethodAccessorImpl.invoke(DelegatingMethodAccessorImpl.java:25)
	at java.lang.reflect.Method.invoke(Method.java:597)
	at org.apache.tools.ant.dispatch.DispatchUtils.execute(DispatchUtils.java:106)
	at org.apache.tools.ant.Task.perform(Task.java:348)
	at org.apache.tools.ant.Target.execute(Target.java:357)
	at org.apache.tools.ant.Target.performTasks(Target.java:385)
	at org.apache.tools.ant.Project.executeSortedTargets(Project.java:1337)
	at org.apache.tools.ant.Project.executeTarget(Project.java:1306)
	at org.apache.tools.ant.helper.DefaultExecutor.executeTargets(DefaultExecutor.java:41)
	at org.apache.tools.ant.Project.executeTargets(Project.java:1189)
	at org.apache.tools.ant.Main.runBuild(Main.java:758)
	at org.apache.tools.ant.Main.startAnt(Main.java:217)
	at org.apache.tools.ant.launch.Launcher.run(Launcher.java:257)
	at org.apache.tools.ant.launch.Launcher.main(Launcher.java:104)
Caused by: javax.xml.transform.TransformerException: com.sun.org.apache.xml.internal.utils.WrappedRuntimeException:
Premature end of file.
	at com.sun.org.apache.xalan.internal.xsltc.trax.TransformerImpl.getDOM(TransformerImpl.java:546)
	at com.sun.org.apache.xalan.internal.xsltc.trax.TransformerImpl.transform(TransformerImpl.java:709)
	... 20 more
Caused by: com.sun.org.apache.xml.internal.utils.WrappedRuntimeException: Premature end of
file.
	at com.sun.org.apache.xalan.internal.xsltc.dom.XSLTCDTMManager.getDTM(XSLTCDTMManager.java:446)
	at com.sun.org.apache.xalan.internal.xsltc.dom.XSLTCDTMManager.getDTM(XSLTCDTMManager.java:234)
	at com.sun.org.apache.xalan.internal.xsltc.trax.TransformerImpl.getDOM(TransformerImpl.java:524)
	... 21 more
---------
javax.xml.transform.TransformerException: com.sun.org.apache.xml.internal.utils.WrappedRuntimeException:
Premature end of file.
	at com.sun.org.apache.xalan.internal.xsltc.trax.TransformerImpl.getDOM(TransformerImpl.java:546)
	at com.sun.org.apache.xalan.internal.xsltc.trax.TransformerImpl.transform(TransformerImpl.java:709)
	at com.sun.org.apache.xalan.internal.xsltc.trax.TransformerImpl.transform(TransformerImpl.java:313)
	at org.apache.tools.ant.taskdefs.optional.TraXLiaison.transform(TraXLiaison.java:187)
	at org.apache.tools.ant.taskdefs.XSLTProcess.process(XSLTProcess.java:709)
	at org.apache.tools.ant.taskdefs.XSLTProcess.execute(XSLTProcess.java:333)
	at org.apache.tools.ant.UnknownElement.execute(UnknownElement.java:288)
	at sun.reflect.GeneratedMethodAccessor1.invoke(Unknown Source)
	at sun.reflect.DelegatingMethodAccessorImpl.invoke(DelegatingMethodAccessorImpl.java:25)
	at java.lang.reflect.Method.invoke(Method.java:597)
	at org.apache.tools.ant.dispatch.DispatchUtils.execute(DispatchUtils.java:106)
	at org.apache.tools.ant.Task.perform(Task.java:348)
	at org.apache.tools.ant.Target.execute(Target.java:357)
	at org.apache.tools.ant.Target.performTasks(Target.java:385)
	at org.apache.tools.ant.Project.executeSortedTargets(Project.java:1337)
	at org.apache.tools.ant.Project.executeTarget(Project.java:1306)
	at org.apache.tools.ant.helper.DefaultExecutor.executeTargets(DefaultExecutor.java:41)
	at org.apache.tools.ant.Project.executeTargets(Project.java:1189)
	at org.apache.tools.ant.Main.runBuild(Main.java:758)
	at org.apache.tools.ant.Main.startAnt(Main.java:217)
	at org.apache.tools.ant.launch.Launcher.run(Launcher.java:257)
	at org.apache.tools.ant.launch.Launcher.main(Launcher.java:104)
Caused by: com.sun.org.apache.xml.internal.utils.WrappedRuntimeException: Premature end of
file.
	at com.sun.org.apache.xalan.internal.xsltc.dom.XSLTCDTMManager.getDTM(XSLTCDTMManager.java:446)
	at com.sun.org.apache.xalan.internal.xsltc.dom.XSLTCDTMManager.getDTM(XSLTCDTMManager.java:234)
	at com.sun.org.apache.xalan.internal.xsltc.trax.TransformerImpl.getDOM(TransformerImpl.java:524)
	... 21 more
---------
com.sun.org.apache.xml.internal.utils.WrappedRuntimeException: Premature end of file.
	at com.sun.org.apache.xalan.internal.xsltc.dom.XSLTCDTMManager.getDTM(XSLTCDTMManager.java:446)
	at com.sun.org.apache.xalan.internal.xsltc.dom.XSLTCDTMManager.getDTM(XSLTCDTMManager.java:234)
	at com.sun.org.apache.xalan.internal.xsltc.trax.TransformerImpl.getDOM(TransformerImpl.java:524)
	at com.sun.org.apache.xalan.internal.xsltc.trax.TransformerImpl.transform(TransformerImpl.java:709)
	at com.sun.org.apache.xalan.internal.xsltc.trax.TransformerImpl.transform(TransformerImpl.java:313)
	at org.apache.tools.ant.taskdefs.optional.TraXLiaison.transform(TraXLiaison.java:187)
	at org.apache.tools.ant.taskdefs.XSLTProcess.process(XSLTProcess.java:709)
	at org.apache.tools.ant.taskdefs.XSLTProcess.execute(XSLTProcess.java:333)
	at org.apache.tools.ant.UnknownElement.execute(UnknownElement.java:288)
	at sun.reflect.GeneratedMethodAccessor1.invoke(Unknown Source)
	at sun.reflect.DelegatingMethodAccessorImpl.invoke(DelegatingMethodAccessorImpl.java:25)
	at java.lang.reflect.Method.invoke(Method.java:597)
	at org.apache.tools.ant.dispatch.DispatchUtils.execute(DispatchUtils.java:106)
	at org.apache.tools.ant.Task.perform(Task.java:348)
	at org.apache.tools.ant.Target.execute(Target.java:357)
	at org.apache.tools.ant.Target.performTasks(Target.java:385)
	at org.apache.tools.ant.Project.executeSortedTargets(Project.java:1337)
	at org.apache.tools.ant.Project.executeTarget(Project.java:1306)
	at org.apache.tools.ant.helper.DefaultExecutor.executeTargets(DefaultExecutor.java:41)
	at org.apache.tools.ant.Project.executeTargets(Project.java:1189)
	at org.apache.tools.ant.Main.runBuild(Main.java:758)
	at org.apache.tools.ant.Main.startAnt(Main.java:217)
	at org.apache.tools.ant.launch.Launcher.run(Launcher.java:257)
	at org.apache.tools.ant.launch.Launcher.main(Launcher.java:104)
---------
org.xml.sax.SAXParseException: Premature end of file.
	at org.apache.xerces.util.ErrorHandlerWrapper.createSAXParseException(Unknown Source)
	at org.apache.xerces.util.ErrorHandlerWrapper.fatalError(Unknown Source)
	at org.apache.xerces.impl.XMLErrorReporter.reportError(Unknown Source)
	at org.apache.xerces.impl.XMLErrorReporter.reportError(Unknown Source)
	at org.apache.xerces.impl.XMLVersionDetector.determineDocVersion(Unknown Source)
	at org.apache.xerces.parsers.XML11Configuration.parse(Unknown Source)
	at org.apache.xerces.parsers.XML11Configuration.parse(Unknown Source)
	at org.apache.xerces.parsers.XMLParser.parse(Unknown Source)
	at org.apache.xerces.parsers.AbstractSAXParser.parse(Unknown Source)
	at org.apache.xerces.jaxp.SAXParserImpl$JAXPSAXParser.parse(Unknown Source)
	at com.sun.org.apache.xalan.internal.xsltc.dom.XSLTCDTMManager.getDTM(XSLTCDTMManager.java:440)
	at com.sun.org.apache.xalan.internal.xsltc.dom.XSLTCDTMManager.getDTM(XSLTCDTMManager.java:234)
	at com.sun.org.apache.xalan.internal.xsltc.trax.TransformerImpl.getDOM(TransformerImpl.java:524)
	at com.sun.org.apache.xalan.internal.xsltc.trax.TransformerImpl.transform(TransformerImpl.java:709)
	at com.sun.org.apache.xalan.internal.xsltc.trax.TransformerImpl.transform(TransformerImpl.java:313)
	at org.apache.tools.ant.taskdefs.optional.TraXLiaison.transform(TraXLiaison.java:187)
	at org.apache.tools.ant.taskdefs.XSLTProcess.process(XSLTProcess.java:709)
	at org.apache.tools.ant.taskdefs.XSLTProcess.execute(XSLTProcess.java:333)
	at org.apache.tools.ant.UnknownElement.execute(UnknownElement.java:288)
	at sun.reflect.GeneratedMethodAccessor1.invoke(Unknown Source)
	at sun.reflect.DelegatingMethodAccessorImpl.invoke(DelegatingMethodAccessorImpl.java:25)
	at java.lang.reflect.Method.invoke(Method.java:597)
	at org.apache.tools.ant.dispatch.DispatchUtils.execute(DispatchUtils.java:106)
	at org.apache.tools.ant.Task.perform(Task.java:348)
	at org.apache.tools.ant.Target.execute(Target.java:357)
	at org.apache.tools.ant.Target.performTasks(Target.java:385)
	at org.apache.tools.ant.Project.executeSortedTargets(Project.java:1337)
	at org.apache.tools.ant.Project.executeTarget(Project.java:1306)
	at org.apache.tools.ant.helper.DefaultExecutor.executeTargets(DefaultExecutor.java:41)
	at org.apache.tools.ant.Project.executeTargets(Project.java:1189)
	at org.apache.tools.ant.Main.runBuild(Main.java:758)
	at org.apache.tools.ant.Main.startAnt(Main.java:217)
	at org.apache.tools.ant.launch.Launcher.run(Launcher.java:257)
	at org.apache.tools.ant.launch.Launcher.main(Launcher.java:104)
---------
com.sun.org.apache.xml.internal.utils.WrappedRuntimeException: Premature end of file.
	at com.sun.org.apache.xalan.internal.xsltc.dom.XSLTCDTMManager.getDTM(XSLTCDTMManager.java:446)
	at com.sun.org.apache.xalan.internal.xsltc.dom.XSLTCDTMManager.getDTM(XSLTCDTMManager.java:234)
	at com.sun.org.apache.xalan.internal.xsltc.trax.TransformerImpl.getDOM(TransformerImpl.java:524)
	at com.sun.org.apache.xalan.internal.xsltc.trax.TransformerImpl.transform(TransformerImpl.java:709)
	at com.sun.org.apache.xalan.internal.xsltc.trax.TransformerImpl.transform(TransformerImpl.java:313)
	at org.apache.tools.ant.taskdefs.optional.TraXLiaison.transform(TraXLiaison.java:187)
	at org.apache.tools.ant.taskdefs.XSLTProcess.process(XSLTProcess.java:709)
	at org.apache.tools.ant.taskdefs.XSLTProcess.execute(XSLTProcess.java:333)
	at org.apache.tools.ant.UnknownElement.execute(UnknownElement.java:288)
	at sun.reflect.GeneratedMethodAccessor1.invoke(Unknown Source)
	at sun.reflect.DelegatingMethodAccessorImpl.invoke(DelegatingMethodAccessorImpl.java:25)
	at java.lang.reflect.Method.invoke(Method.java:597)
	at org.apache.tools.ant.dispatch.DispatchUtils.execute(DispatchUtils.java:106)
	at org.apache.tools.ant.Task.perform(Task.java:348)
	at org.apache.tools.ant.Target.execute(Target.java:357)
	at org.apache.tools.ant.Target.performTasks(Target.java:385)
	at org.apache.tools.ant.Project.executeSortedTargets(Project.java:1337)
	at org.apache.tools.ant.Project.executeTarget(Project.java:1306)
	at org.apache.tools.ant.helper.DefaultExecutor.executeTargets(DefaultExecutor.java:41)
	at org.apache.tools.ant.Project.executeTargets(Project.java:1189)
	at org.apache.tools.ant.Main.runBuild(Main.java:758)
	at org.apache.tools.ant.Main.startAnt(Main.java:217)
	at org.apache.tools.ant.launch.Launcher.run(Launcher.java:257)
	at org.apache.tools.ant.launch.Launcher.main(Launcher.java:104)
---------
org.xml.sax.SAXParseException: Premature end of file.
	at org.apache.xerces.util.ErrorHandlerWrapper.createSAXParseException(Unknown Source)
	at org.apache.xerces.util.ErrorHandlerWrapper.fatalError(Unknown Source)
	at org.apache.xerces.impl.XMLErrorReporter.reportError(Unknown Source)
	at org.apache.xerces.impl.XMLErrorReporter.reportError(Unknown Source)
	at org.apache.xerces.impl.XMLVersionDetector.determineDocVersion(Unknown Source)
	at org.apache.xerces.parsers.XML11Configuration.parse(Unknown Source)
	at org.apache.xerces.parsers.XML11Configuration.parse(Unknown Source)
	at org.apache.xerces.parsers.XMLParser.parse(Unknown Source)
	at org.apache.xerces.parsers.AbstractSAXParser.parse(Unknown Source)
	at org.apache.xerces.jaxp.SAXParserImpl$JAXPSAXParser.parse(Unknown Source)
	at com.sun.org.apache.xalan.internal.xsltc.dom.XSLTCDTMManager.getDTM(XSLTCDTMManager.java:440)
	at com.sun.org.apache.xalan.internal.xsltc.dom.XSLTCDTMManager.getDTM(XSLTCDTMManager.java:234)
	at com.sun.org.apache.xalan.internal.xsltc.trax.TransformerImpl.getDOM(TransformerImpl.java:524)
	at com.sun.org.apache.xalan.internal.xsltc.trax.TransformerImpl.transform(TransformerImpl.java:709)
	at com.sun.org.apache.xalan.internal.xsltc.trax.TransformerImpl.transform(TransformerImpl.java:313)
	at org.apache.tools.ant.taskdefs.optional.TraXLiaison.transform(TraXLiaison.java:187)
	at org.apache.tools.ant.taskdefs.XSLTProcess.process(XSLTProcess.java:709)
	at org.apache.tools.ant.taskdefs.XSLTProcess.execute(XSLTProcess.java:333)
	at org.apache.tools.ant.UnknownElement.execute(UnknownElement.java:288)
	at sun.reflect.GeneratedMethodAccessor1.invoke(Unknown Source)
	at sun.reflect.DelegatingMethodAccessorImpl.invoke(DelegatingMethodAccessorImpl.java:25)
	at java.lang.reflect.Method.invoke(Method.java:597)
	at org.apache.tools.ant.dispatch.DispatchUtils.execute(DispatchUtils.java:106)
	at org.apache.tools.ant.Task.perform(Task.java:348)
	at org.apache.tools.ant.Target.execute(Target.java:357)
	at org.apache.tools.ant.Target.performTasks(Target.java:385)
	at org.apache.tools.ant.Project.executeSortedTargets(Project.java:1337)
	at org.apache.tools.ant.Project.executeTarget(Project.java:1306)
	at org.apache.tools.ant.helper.DefaultExecutor.executeTargets(DefaultExecutor.java:41)
	at org.apache.tools.ant.Project.executeTargets(Project.java:1189)
	at org.apache.tools.ant.Main.runBuild(Main.java:758)
	at org.apache.tools.ant.Main.startAnt(Main.java:217)
	at org.apache.tools.ant.launch.Launcher.run(Launcher.java:257)
	at org.apache.tools.ant.launch.Launcher.main(Launcher.java:104)

Total time: 2 minutes 54 seconds


======================================================================
======================================================================
STORE: saving artifacts
======================================================================
======================================================================


Build Failed
[FINDBUGS] Skipping publisher since build result is FAILURE
Recording test results
Publishing Javadoc
Archiving artifacts
Recording fingerprints
Publishing Clover coverage report...
No Clover report will be published due to a Build Failure


Mime
View raw message