pig-dev mailing list archives

Site index · List index
Message view « Date » · « Thread »
Top « Date » · « Thread »
From Apache Hudson Server <hud...@hudson.apache.org>
Subject Build failed in Hudson: Pig-trunk #931
Date Fri, 18 Feb 2011 10:20:48 GMT
See <https://hudson.apache.org/hudson/job/Pig-trunk/931/changes>

Changes:

[daijy] PIG-1850: Order by is failing with ClassCastException if schema is undefined for new
logical plan in 0.8

[daijy] PIG-1831: Indeterministic behavior in local mode due to static variable PigMapReduce.sJobConf

[daijy] PIG-1841: TupleSize implemented incorrectly

[daijy] PIG-1843: NPE in schema generation

[daijy] PIG-1820: New logical plan: FilterLogicExpressionSimplifier fail to deal with UDF

------------------------------------------
[...truncated 5324 lines...]

jarWithOutSvn:

findbugs:
    [mkdir] Created dir: <https://hudson.apache.org/hudson/job/Pig-trunk/ws/trunk/build/test/findbugs>
 [findbugs] Executing findbugs from ant task
 [findbugs] Running FindBugs...
 [findbugs] Out of memory
 [findbugs] Total memory: 477M
 [findbugs]  free memory: 60M
 [findbugs] Analyzed: <https://hudson.apache.org/hudson/job/Pig-trunk/ws/trunk/build/pig-2011-02-18_10-06-25-core.jar>
 [findbugs]      Aux: <https://hudson.apache.org/hudson/job/Pig-trunk/ws/trunk/lib/automaton.jar>
 [findbugs]      Aux: <https://hudson.apache.org/hudson/job/Pig-trunk/ws/trunk/lib/hbase-0.20.6-test.jar>
 [findbugs]      Aux: <https://hudson.apache.org/hudson/job/Pig-trunk/ws/trunk/lib/hbase-0.20.6.jar>
 [findbugs]      Aux: <https://hudson.apache.org/hudson/job/Pig-trunk/ws/trunk/lib/zookeeper-hbase-1329.jar>
 [findbugs] Exception in thread "main" java.lang.OutOfMemoryError: GC overhead limit exceeded
 [findbugs] 	at java.util.HashMap.<init>(HashMap.java:209)
 [findbugs] 	at edu.umd.cs.findbugs.ba.npe.IsNullValueFrame.mergeKnownValuesWith(IsNullValueFrame.java:173)
 [findbugs] 	at edu.umd.cs.findbugs.ba.npe.IsNullValueAnalysis.mergeInto(IsNullValueAnalysis.java:575)
 [findbugs] 	at edu.umd.cs.findbugs.ba.npe.IsNullValueAnalysis.meetInto(IsNullValueAnalysis.java:556)
 [findbugs] 	at edu.umd.cs.findbugs.ba.npe.IsNullValueAnalysis.meetInto(IsNullValueAnalysis.java:367)
 [findbugs] 	at edu.umd.cs.findbugs.ba.npe.IsNullValueAnalysis.meetInto(IsNullValueAnalysis.java:72)
 [findbugs] 	at edu.umd.cs.findbugs.ba.Dataflow.execute(Dataflow.java:333)
 [findbugs] 	at edu.umd.cs.findbugs.classfile.engine.bcel.IsNullValueDataflowFactory.analyze(IsNullValueDataflowFactory.java:75)
 [findbugs] 	at edu.umd.cs.findbugs.classfile.engine.bcel.IsNullValueDataflowFactory.analyze(IsNullValueDataflowFactory.java:44)
 [findbugs] 	at edu.umd.cs.findbugs.classfile.impl.AnalysisCache.analyzeMethod(AnalysisCache.java:332)
 [findbugs] 	at edu.umd.cs.findbugs.classfile.impl.AnalysisCache.getMethodAnalysis(AnalysisCache.java:282)
 [findbugs] 	at edu.umd.cs.findbugs.ba.ClassContext.getMethodAnalysis(ClassContext.java:942)
 [findbugs] 	at edu.umd.cs.findbugs.ba.ClassContext.getIsNullValueDataflow(ClassContext.java:371)
 [findbugs] 	at edu.umd.cs.findbugs.detect.BuildNonnullReturnDatabase.analyzeMethod(BuildNonnullReturnDatabase.java:77)
 [findbugs] 	at edu.umd.cs.findbugs.detect.BuildNonnullReturnDatabase.considerMethod(BuildNonnullReturnDatabase.java:66)
 [findbugs] 	at edu.umd.cs.findbugs.detect.BuildNonnullReturnDatabase.visitClassContext(BuildNonnullReturnDatabase.java:59)
 [findbugs] 	at edu.umd.cs.findbugs.DetectorToDetector2Adapter.visitClass(DetectorToDetector2Adapter.java:68)
 [findbugs] 	at edu.umd.cs.findbugs.FindBugs2.analyzeApplication(FindBugs2.java:979)
 [findbugs] 	at edu.umd.cs.findbugs.FindBugs2.execute(FindBugs2.java:230)
 [findbugs] 	at edu.umd.cs.findbugs.FindBugs.runMain(FindBugs.java:348)
 [findbugs] 	at edu.umd.cs.findbugs.FindBugs2.main(FindBugs2.java:1057)
 [findbugs] Java Result: 1
 [findbugs] Output saved to <https://hudson.apache.org/hudson/job/Pig-trunk/ws/trunk/build/test/findbugs/pig-findbugs-report.xml>
     [xslt] Processing <https://hudson.apache.org/hudson/job/Pig-trunk/ws/trunk/build/test/findbugs/pig-findbugs-report.xml>
to <https://hudson.apache.org/hudson/job/Pig-trunk/ws/trunk/build/test/findbugs/pig-findbugs-report.html>
     [xslt] Loading stylesheet /homes/hudson/tools/findbugs/latest/src/xsl/default.xsl
     [xslt] : Error! Premature end of file.
     [xslt] : Error! com.sun.org.apache.xml.internal.utils.WrappedRuntimeException: Premature
end of file.
     [xslt] Failed to process <https://hudson.apache.org/hudson/job/Pig-trunk/ws/trunk/build/test/findbugs/pig-findbugs-report.xml>

BUILD FAILED
javax.xml.transform.TransformerException: javax.xml.transform.TransformerException: com.sun.org.apache.xml.internal.utils.WrappedRuntimeException:
Premature end of file.
	at com.sun.org.apache.xalan.internal.xsltc.trax.TransformerImpl.transform(TransformerImpl.java:719)
	at com.sun.org.apache.xalan.internal.xsltc.trax.TransformerImpl.transform(TransformerImpl.java:313)
	at org.apache.tools.ant.taskdefs.optional.TraXLiaison.transform(TraXLiaison.java:187)
	at org.apache.tools.ant.taskdefs.XSLTProcess.process(XSLTProcess.java:709)
	at org.apache.tools.ant.taskdefs.XSLTProcess.execute(XSLTProcess.java:333)
	at org.apache.tools.ant.UnknownElement.execute(UnknownElement.java:288)
	at sun.reflect.GeneratedMethodAccessor1.invoke(Unknown Source)
	at sun.reflect.DelegatingMethodAccessorImpl.invoke(DelegatingMethodAccessorImpl.java:25)
	at java.lang.reflect.Method.invoke(Method.java:597)
	at org.apache.tools.ant.dispatch.DispatchUtils.execute(DispatchUtils.java:106)
	at org.apache.tools.ant.Task.perform(Task.java:348)
	at org.apache.tools.ant.Target.execute(Target.java:357)
	at org.apache.tools.ant.Target.performTasks(Target.java:385)
	at org.apache.tools.ant.Project.executeSortedTargets(Project.java:1337)
	at org.apache.tools.ant.Project.executeTarget(Project.java:1306)
	at org.apache.tools.ant.helper.DefaultExecutor.executeTargets(DefaultExecutor.java:41)
	at org.apache.tools.ant.Project.executeTargets(Project.java:1189)
	at org.apache.tools.ant.Main.runBuild(Main.java:758)
	at org.apache.tools.ant.Main.startAnt(Main.java:217)
	at org.apache.tools.ant.launch.Launcher.run(Launcher.java:257)
	at org.apache.tools.ant.launch.Launcher.main(Launcher.java:104)
Caused by: javax.xml.transform.TransformerException: com.sun.org.apache.xml.internal.utils.WrappedRuntimeException:
Premature end of file.
	at com.sun.org.apache.xalan.internal.xsltc.trax.TransformerImpl.getDOM(TransformerImpl.java:546)
	at com.sun.org.apache.xalan.internal.xsltc.trax.TransformerImpl.transform(TransformerImpl.java:709)
	... 20 more
Caused by: com.sun.org.apache.xml.internal.utils.WrappedRuntimeException: Premature end of
file.
	at com.sun.org.apache.xalan.internal.xsltc.dom.XSLTCDTMManager.getDTM(XSLTCDTMManager.java:446)
	at com.sun.org.apache.xalan.internal.xsltc.dom.XSLTCDTMManager.getDTM(XSLTCDTMManager.java:234)
	at com.sun.org.apache.xalan.internal.xsltc.trax.TransformerImpl.getDOM(TransformerImpl.java:524)
	... 21 more
---------
javax.xml.transform.TransformerException: com.sun.org.apache.xml.internal.utils.WrappedRuntimeException:
Premature end of file.
	at com.sun.org.apache.xalan.internal.xsltc.trax.TransformerImpl.getDOM(TransformerImpl.java:546)
	at com.sun.org.apache.xalan.internal.xsltc.trax.TransformerImpl.transform(TransformerImpl.java:709)
	at com.sun.org.apache.xalan.internal.xsltc.trax.TransformerImpl.transform(TransformerImpl.java:313)
	at org.apache.tools.ant.taskdefs.optional.TraXLiaison.transform(TraXLiaison.java:187)
	at org.apache.tools.ant.taskdefs.XSLTProcess.process(XSLTProcess.java:709)
	at org.apache.tools.ant.taskdefs.XSLTProcess.execute(XSLTProcess.java:333)
	at org.apache.tools.ant.UnknownElement.execute(UnknownElement.java:288)
	at sun.reflect.GeneratedMethodAccessor1.invoke(Unknown Source)
	at sun.reflect.DelegatingMethodAccessorImpl.invoke(DelegatingMethodAccessorImpl.java:25)
	at java.lang.reflect.Method.invoke(Method.java:597)
	at org.apache.tools.ant.dispatch.DispatchUtils.execute(DispatchUtils.java:106)
	at org.apache.tools.ant.Task.perform(Task.java:348)
	at org.apache.tools.ant.Target.execute(Target.java:357)
	at org.apache.tools.ant.Target.performTasks(Target.java:385)
	at org.apache.tools.ant.Project.executeSortedTargets(Project.java:1337)
	at org.apache.tools.ant.Project.executeTarget(Project.java:1306)
	at org.apache.tools.ant.helper.DefaultExecutor.executeTargets(DefaultExecutor.java:41)
	at org.apache.tools.ant.Project.executeTargets(Project.java:1189)
	at org.apache.tools.ant.Main.runBuild(Main.java:758)
	at org.apache.tools.ant.Main.startAnt(Main.java:217)
	at org.apache.tools.ant.launch.Launcher.run(Launcher.java:257)
	at org.apache.tools.ant.launch.Launcher.main(Launcher.java:104)
Caused by: com.sun.org.apache.xml.internal.utils.WrappedRuntimeException: Premature end of
file.
	at com.sun.org.apache.xalan.internal.xsltc.dom.XSLTCDTMManager.getDTM(XSLTCDTMManager.java:446)
	at com.sun.org.apache.xalan.internal.xsltc.dom.XSLTCDTMManager.getDTM(XSLTCDTMManager.java:234)
	at com.sun.org.apache.xalan.internal.xsltc.trax.TransformerImpl.getDOM(TransformerImpl.java:524)
	... 21 more
---------
com.sun.org.apache.xml.internal.utils.WrappedRuntimeException: Premature end of file.
	at com.sun.org.apache.xalan.internal.xsltc.dom.XSLTCDTMManager.getDTM(XSLTCDTMManager.java:446)
	at com.sun.org.apache.xalan.internal.xsltc.dom.XSLTCDTMManager.getDTM(XSLTCDTMManager.java:234)
	at com.sun.org.apache.xalan.internal.xsltc.trax.TransformerImpl.getDOM(TransformerImpl.java:524)
	at com.sun.org.apache.xalan.internal.xsltc.trax.TransformerImpl.transform(TransformerImpl.java:709)
	at com.sun.org.apache.xalan.internal.xsltc.trax.TransformerImpl.transform(TransformerImpl.java:313)
	at org.apache.tools.ant.taskdefs.optional.TraXLiaison.transform(TraXLiaison.java:187)
	at org.apache.tools.ant.taskdefs.XSLTProcess.process(XSLTProcess.java:709)
	at org.apache.tools.ant.taskdefs.XSLTProcess.execute(XSLTProcess.java:333)
	at org.apache.tools.ant.UnknownElement.execute(UnknownElement.java:288)
	at sun.reflect.GeneratedMethodAccessor1.invoke(Unknown Source)
	at sun.reflect.DelegatingMethodAccessorImpl.invoke(DelegatingMethodAccessorImpl.java:25)
	at java.lang.reflect.Method.invoke(Method.java:597)
	at org.apache.tools.ant.dispatch.DispatchUtils.execute(DispatchUtils.java:106)
	at org.apache.tools.ant.Task.perform(Task.java:348)
	at org.apache.tools.ant.Target.execute(Target.java:357)
	at org.apache.tools.ant.Target.performTasks(Target.java:385)
	at org.apache.tools.ant.Project.executeSortedTargets(Project.java:1337)
	at org.apache.tools.ant.Project.executeTarget(Project.java:1306)
	at org.apache.tools.ant.helper.DefaultExecutor.executeTargets(DefaultExecutor.java:41)
	at org.apache.tools.ant.Project.executeTargets(Project.java:1189)
	at org.apache.tools.ant.Main.runBuild(Main.java:758)
	at org.apache.tools.ant.Main.startAnt(Main.java:217)
	at org.apache.tools.ant.launch.Launcher.run(Launcher.java:257)
	at org.apache.tools.ant.launch.Launcher.main(Launcher.java:104)
---------
org.xml.sax.SAXParseException: Premature end of file.
	at org.apache.xerces.util.ErrorHandlerWrapper.createSAXParseException(Unknown Source)
	at org.apache.xerces.util.ErrorHandlerWrapper.fatalError(Unknown Source)
	at org.apache.xerces.impl.XMLErrorReporter.reportError(Unknown Source)
	at org.apache.xerces.impl.XMLErrorReporter.reportError(Unknown Source)
	at org.apache.xerces.impl.XMLVersionDetector.determineDocVersion(Unknown Source)
	at org.apache.xerces.parsers.XML11Configuration.parse(Unknown Source)
	at org.apache.xerces.parsers.XML11Configuration.parse(Unknown Source)
	at org.apache.xerces.parsers.XMLParser.parse(Unknown Source)
	at org.apache.xerces.parsers.AbstractSAXParser.parse(Unknown Source)
	at org.apache.xerces.jaxp.SAXParserImpl$JAXPSAXParser.parse(Unknown Source)
	at com.sun.org.apache.xalan.internal.xsltc.dom.XSLTCDTMManager.getDTM(XSLTCDTMManager.java:440)
	at com.sun.org.apache.xalan.internal.xsltc.dom.XSLTCDTMManager.getDTM(XSLTCDTMManager.java:234)
	at com.sun.org.apache.xalan.internal.xsltc.trax.TransformerImpl.getDOM(TransformerImpl.java:524)
	at com.sun.org.apache.xalan.internal.xsltc.trax.TransformerImpl.transform(TransformerImpl.java:709)
	at com.sun.org.apache.xalan.internal.xsltc.trax.TransformerImpl.transform(TransformerImpl.java:313)
	at org.apache.tools.ant.taskdefs.optional.TraXLiaison.transform(TraXLiaison.java:187)
	at org.apache.tools.ant.taskdefs.XSLTProcess.process(XSLTProcess.java:709)
	at org.apache.tools.ant.taskdefs.XSLTProcess.execute(XSLTProcess.java:333)
	at org.apache.tools.ant.UnknownElement.execute(UnknownElement.java:288)
	at sun.reflect.GeneratedMethodAccessor1.invoke(Unknown Source)
	at sun.reflect.DelegatingMethodAccessorImpl.invoke(DelegatingMethodAccessorImpl.java:25)
	at java.lang.reflect.Method.invoke(Method.java:597)
	at org.apache.tools.ant.dispatch.DispatchUtils.execute(DispatchUtils.java:106)
	at org.apache.tools.ant.Task.perform(Task.java:348)
	at org.apache.tools.ant.Target.execute(Target.java:357)
	at org.apache.tools.ant.Target.performTasks(Target.java:385)
	at org.apache.tools.ant.Project.executeSortedTargets(Project.java:1337)
	at org.apache.tools.ant.Project.executeTarget(Project.java:1306)
	at org.apache.tools.ant.helper.DefaultExecutor.executeTargets(DefaultExecutor.java:41)
	at org.apache.tools.ant.Project.executeTargets(Project.java:1189)
	at org.apache.tools.ant.Main.runBuild(Main.java:758)
	at org.apache.tools.ant.Main.startAnt(Main.java:217)
	at org.apache.tools.ant.launch.Launcher.run(Launcher.java:257)
	at org.apache.tools.ant.launch.Launcher.main(Launcher.java:104)
---------
com.sun.org.apache.xml.internal.utils.WrappedRuntimeException: Premature end of file.
	at com.sun.org.apache.xalan.internal.xsltc.dom.XSLTCDTMManager.getDTM(XSLTCDTMManager.java:446)
	at com.sun.org.apache.xalan.internal.xsltc.dom.XSLTCDTMManager.getDTM(XSLTCDTMManager.java:234)
	at com.sun.org.apache.xalan.internal.xsltc.trax.TransformerImpl.getDOM(TransformerImpl.java:524)
	at com.sun.org.apache.xalan.internal.xsltc.trax.TransformerImpl.transform(TransformerImpl.java:709)
	at com.sun.org.apache.xalan.internal.xsltc.trax.TransformerImpl.transform(TransformerImpl.java:313)
	at org.apache.tools.ant.taskdefs.optional.TraXLiaison.transform(TraXLiaison.java:187)
	at org.apache.tools.ant.taskdefs.XSLTProcess.process(XSLTProcess.java:709)
	at org.apache.tools.ant.taskdefs.XSLTProcess.execute(XSLTProcess.java:333)
	at org.apache.tools.ant.UnknownElement.execute(UnknownElement.java:288)
	at sun.reflect.GeneratedMethodAccessor1.invoke(Unknown Source)
	at sun.reflect.DelegatingMethodAccessorImpl.invoke(DelegatingMethodAccessorImpl.java:25)
	at java.lang.reflect.Method.invoke(Method.java:597)
	at org.apache.tools.ant.dispatch.DispatchUtils.execute(DispatchUtils.java:106)
	at org.apache.tools.ant.Task.perform(Task.java:348)
	at org.apache.tools.ant.Target.execute(Target.java:357)
	at org.apache.tools.ant.Target.performTasks(Target.java:385)
	at org.apache.tools.ant.Project.executeSortedTargets(Project.java:1337)
	at org.apache.tools.ant.Project.executeTarget(Project.java:1306)
	at org.apache.tools.ant.helper.DefaultExecutor.executeTargets(DefaultExecutor.java:41)
	at org.apache.tools.ant.Project.executeTargets(Project.java:1189)
	at org.apache.tools.ant.Main.runBuild(Main.java:758)
	at org.apache.tools.ant.Main.startAnt(Main.java:217)
	at org.apache.tools.ant.launch.Launcher.run(Launcher.java:257)
	at org.apache.tools.ant.launch.Launcher.main(Launcher.java:104)
---------
org.xml.sax.SAXParseException: Premature end of file.
	at org.apache.xerces.util.ErrorHandlerWrapper.createSAXParseException(Unknown Source)
	at org.apache.xerces.util.ErrorHandlerWrapper.fatalError(Unknown Source)
	at org.apache.xerces.impl.XMLErrorReporter.reportError(Unknown Source)
	at org.apache.xerces.impl.XMLErrorReporter.reportError(Unknown Source)
	at org.apache.xerces.impl.XMLVersionDetector.determineDocVersion(Unknown Source)
	at org.apache.xerces.parsers.XML11Configuration.parse(Unknown Source)
	at org.apache.xerces.parsers.XML11Configuration.parse(Unknown Source)
	at org.apache.xerces.parsers.XMLParser.parse(Unknown Source)
	at org.apache.xerces.parsers.AbstractSAXParser.parse(Unknown Source)
	at org.apache.xerces.jaxp.SAXParserImpl$JAXPSAXParser.parse(Unknown Source)
	at com.sun.org.apache.xalan.internal.xsltc.dom.XSLTCDTMManager.getDTM(XSLTCDTMManager.java:440)
	at com.sun.org.apache.xalan.internal.xsltc.dom.XSLTCDTMManager.getDTM(XSLTCDTMManager.java:234)
	at com.sun.org.apache.xalan.internal.xsltc.trax.TransformerImpl.getDOM(TransformerImpl.java:524)
	at com.sun.org.apache.xalan.internal.xsltc.trax.TransformerImpl.transform(TransformerImpl.java:709)
	at com.sun.org.apache.xalan.internal.xsltc.trax.TransformerImpl.transform(TransformerImpl.java:313)
	at org.apache.tools.ant.taskdefs.optional.TraXLiaison.transform(TraXLiaison.java:187)
	at org.apache.tools.ant.taskdefs.XSLTProcess.process(XSLTProcess.java:709)
	at org.apache.tools.ant.taskdefs.XSLTProcess.execute(XSLTProcess.java:333)
	at org.apache.tools.ant.UnknownElement.execute(UnknownElement.java:288)
	at sun.reflect.GeneratedMethodAccessor1.invoke(Unknown Source)
	at sun.reflect.DelegatingMethodAccessorImpl.invoke(DelegatingMethodAccessorImpl.java:25)
	at java.lang.reflect.Method.invoke(Method.java:597)
	at org.apache.tools.ant.dispatch.DispatchUtils.execute(DispatchUtils.java:106)
	at org.apache.tools.ant.Task.perform(Task.java:348)
	at org.apache.tools.ant.Target.execute(Target.java:357)
	at org.apache.tools.ant.Target.performTasks(Target.java:385)
	at org.apache.tools.ant.Project.executeSortedTargets(Project.java:1337)
	at org.apache.tools.ant.Project.executeTarget(Project.java:1306)
	at org.apache.tools.ant.helper.DefaultExecutor.executeTargets(DefaultExecutor.java:41)
	at org.apache.tools.ant.Project.executeTargets(Project.java:1189)
	at org.apache.tools.ant.Main.runBuild(Main.java:758)
	at org.apache.tools.ant.Main.startAnt(Main.java:217)
	at org.apache.tools.ant.launch.Launcher.run(Launcher.java:257)
	at org.apache.tools.ant.launch.Launcher.main(Launcher.java:104)

Total time: 13 minutes 58 seconds


======================================================================
======================================================================
STORE: saving artifacts
======================================================================
======================================================================


Build Failed
[FINDBUGS] Skipping publisher since build result is FAILURE
Publishing Javadoc
Archiving artifacts
Recording test results
Recording fingerprints
Publishing Clover coverage report...
No Clover report will be published due to a Build Failure


Mime
View raw message