pig-dev mailing list archives

Site index · List index
Message view « Date » · « Thread »
Top « Date » · « Thread »
From Apache Hudson Server <hud...@hudson.apache.org>
Subject Build failed in Hudson: Pig-trunk-commit #622
Date Thu, 16 Dec 2010 19:32:11 GMT
See <https://hudson.apache.org/hudson/job/Pig-trunk-commit/622/changes>

Changes:

[olga] PIG-1768: docs reorg (changec via olgan)

[olga] PIG-1768: docs reorg (changec via olgan)

------------------------------------------
[...truncated 34354 lines...]
    [junit] 10/12/16 19:26:00 INFO mapred.JobTracker: Stopping expireLaunchingTasks
    [junit] 10/12/16 19:26:00 INFO mapred.JobTracker: stopped all jobtracker services
    [junit] Tests run: 17, Failures: 0, Errors: 3, Time elapsed: 300.078 sec
    [junit] Test org.apache.pig.test.TestStore FAILED
    [junit] Running org.apache.pig.test.TestStringUDFs
    [junit] Tests run: 6, Failures: 0, Errors: 6, Time elapsed: 0.079 sec
    [junit] Test org.apache.pig.test.TestStringUDFs FAILED
    [junit] Running org.apache.pig.test.TestTypeChecking
    [junit] 	at org.apache.pig.impl.PigContext.<init>(PigContext.java:140)
    [junit] 	at org.apache.pig.test.TestTypeChecking.<init>(TestTypeChecking.java:38)
    [junit] 	at sun.reflect.NativeConstructorAccessorImpl.newInstance0(Native Method)
    [junit] 	at sun.reflect.NativeConstructorAccessorImpl.newInstance(NativeConstructorAccessorImpl.java:39)
    [junit] 	at sun.reflect.DelegatingConstructorAccessorImpl.newInstance(DelegatingConstructorAccessorImpl.java:27)
    [junit] 	at java.lang.reflect.Constructor.newInstance(Constructor.java:513)
    [junit] 	at junit.framework.TestSuite.createTest(TestSuite.java:61)
    [junit] 	at junit.framework.TestSuite.addTestMethod(TestSuite.java:283)
    [junit] 	at junit.framework.TestSuite.<init>(TestSuite.java:146)
    [junit] 	at org.junit.internal.runners.JUnit38ClassRunner.<init>(JUnit38ClassRunner.java:67)
    [junit] 	at org.junit.internal.builders.JUnit3Builder.runnerForClass(JUnit3Builder.java:14)
    [junit] 	at org.junit.runners.model.RunnerBuilder.safeRunnerForClass(RunnerBuilder.java:57)
    [junit] 	at org.junit.internal.builders.AllDefaultPossibilitiesBuilder.runnerForClass(AllDefaultPossibilitiesBuilder.java:29)
    [junit] 	at org.junit.runners.model.RunnerBuilder.safeRunnerForClass(RunnerBuilder.java:57)
    [junit] 	at org.junit.internal.requests.ClassRequest.getRunner(ClassRequest.java:24)
    [junit] 	at junit.framework.JUnit4TestAdapter.<init>(JUnit4TestAdapter.java:31)
    [junit] 	at junit.framework.JUnit4TestAdapter.<init>(JUnit4TestAdapter.java:24)
    [junit] 	at sun.reflect.NativeConstructorAccessorImpl.newInstance0(Native Method)
    [junit] 	at sun.reflect.NativeConstructorAccessorImpl.newInstance(NativeConstructorAccessorImpl.java:39)
    [junit] 	at sun.reflect.DelegatingConstructorAccessorImpl.newInstance(DelegatingConstructorAccessorImpl.java:27)
    [junit] 	at java.lang.reflect.Constructor.newInstance(Constructor.java:513)
    [junit] 	at org.apache.tools.ant.taskdefs.optional.junit.JUnitTestRunner.run(JUnitTestRunner.java:386)
    [junit] 	at org.apache.tools.ant.taskdefs.optional.junit.JUnitTestRunner.launch(JUnitTestRunner.java:911)
    [junit] 	at org.apache.tools.ant.taskdefs.optional.junit.JUnitTestRunner.main(JUnitTestRunner.java:768)
    [junit] Caused by: java.lang.ClassNotFoundException: org.apache.hadoop.fs.FileSystem
    [junit] 	at java.net.URLClassLoader$1.run(URLClassLoader.java:200)
    [junit] 	at java.security.AccessController.doPrivileged(Native Method)
    [junit] 	at java.net.URLClassLoader.findClass(URLClassLoader.java:188)
    [junit] 	at java.lang.ClassLoader.loadClass(ClassLoader.java:307)
    [junit] 	at sun.misc.Launcher$AppClassLoader.loadClass(Launcher.java:301)
    [junit] 	at java.lang.ClassLoader.loadClass(ClassLoader.java:252)
    [junit] 	at java.lang.ClassLoader.loadClassInternal(ClassLoader.java:320)
    [junit] 	... 24 more
    [junit] ))
    [junit] 	at org.apache.pig.impl.PigContext.<init>(PigContext.java:140)
    [junit] 	at org.apache.pig.test.TestTypeChecking.<init>(TestTypeChecking.java:38)
    [junit] 	at sun.reflect.NativeConstructorAccessorImpl.newInstance0(Native Method)
    [junit] 	at sun.reflect.NativeConstructorAccessorImpl.newInstance(NativeConstructorAccessorImpl.java:39)
    [junit] 	at sun.reflect.DelegatingConstructorAccessorImpl.newInstance(DelegatingConstructorAccessorImpl.java:27)
    [junit] 	at java.lang.reflect.Constructor.newInstance(Constructor.java:513)
    [junit] 	at junit.framework.TestSuite.createTest(TestSuite.java:61)
    [junit] 	at junit.framework.TestSuite.addTestMethod(TestSuite.java:283)
    [junit] 	at junit.framework.TestSuite.<init>(TestSuite.java:146)
    [junit] 	at org.junit.internal.runners.JUnit38ClassRunner.<init>(JUnit38ClassRunner.java:67)
    [junit] 	at org.junit.internal.builders.JUnit3Builder.runnerForClass(JUnit3Builder.java:14)
    [junit] 	at org.junit.runners.model.RunnerBuilder.safeRunnerForClass(RunnerBuilder.java:57)
    [junit] 	at org.junit.internal.builders.AllDefaultPossibilitiesBuilder.runnerForClass(AllDefaultPossibilitiesBuilder.java:29)
    [junit] 	at org.junit.runners.model.RunnerBuilder.safeRunnerForClass(RunnerBuilder.java:57)
    [junit] 	at org.junit.internal.requests.ClassRequest.getRunner(ClassRequest.java:24)
    [junit] 	at junit.framework.JUnit4TestAdapter.<init>(JUnit4TestAdapter.java:31)
    [junit] 	at junit.framework.JUnit4TestAdapter.<init>(JUnit4TestAdapter.java:24)
    [junit] 	at sun.reflect.NativeConstructorAccessorImpl.newInstance0(Native Method)
    [junit] 	at sun.reflect.NativeConstructorAccessorImpl.newInstance(NativeConstructorAccessorImpl.java:39)
    [junit] 	at sun.reflect.DelegatingConstructorAccessorImpl.newInstance(DelegatingConstructorAccessorImpl.java:27)
    [junit] 	at java.lang.reflect.Constructor.newInstance(Constructor.java:513)
    [junit] 	at org.apache.tools.ant.taskdefs.optional.junit.JUnitTestRunner.run(JUnitTestRunner.java:386)
    [junit] 	at org.apache.tools.ant.taskdefs.optional.junit.JUnitTestRunner.launch(JUnitTestRunner.java:911)
    [junit] 	at org.apache.tools.ant.taskdefs.optional.junit.JUnitTestRunner.main(JUnitTestRunner.java:768)
    [junit] ))
    [junit] 	at org.apache.pig.impl.PigContext.<init>(PigContext.java:140)
    [junit] 	at org.apache.pig.test.TestTypeChecking.<init>(TestTypeChecking.java:38)
    [junit] 	at sun.reflect.NativeConstructorAccessorImpl.newInstance0(Native Method)
    [junit] 	at sun.reflect.NativeConstructorAccessorImpl.newInstance(NativeConstructorAccessorImpl.java:39)
    [junit] 	at sun.reflect.DelegatingConstructorAccessorImpl.newInstance(DelegatingConstructorAccessorImpl.java:27)
    [junit] 	at java.lang.reflect.Constructor.newInstance(Constructor.java:513)
    [junit] 	at junit.framework.TestSuite.createTest(TestSuite.java:61)
    [junit] 	at junit.framework.TestSuite.addTestMethod(TestSuite.java:283)
    [junit] 	at junit.framework.TestSuite.<init>(TestSuite.java:146)
    [junit] 	at org.junit.internal.runners.JUnit38ClassRunner.<init>(JUnit38ClassRunner.java:67)
    [junit] 	at org.junit.internal.builders.JUnit3Builder.runnerForClass(JUnit3Builder.java:14)
    [junit] 	at org.junit.runners.model.RunnerBuilder.safeRunnerForClass(RunnerBuilder.java:57)
    [junit] 	at org.junit.internal.builders.AllDefaultPossibilitiesBuilder.runnerForClass(AllDefaultPossibilitiesBuilder.java:29)
    [junit] 	at org.junit.runners.model.RunnerBuilder.safeRunnerForClass(RunnerBuilder.java:57)
    [junit] 	at org.junit.internal.requests.ClassRequest.getRunner(ClassRequest.java:24)
    [junit] 	at junit.framework.JUnit4TestAdapter.<init>(JUnit4TestAdapter.java:31)
    [junit] 	at junit.framework.JUnit4TestAdapter.<init>(JUnit4TestAdapter.java:24)
    [junit] 	at sun.reflect.NativeConstructorAccessorImpl.newInstance0(Native Method)
    [junit] 	at sun.reflect.NativeConstructorAccessorImpl.newInstance(NativeConstructorAccessorImpl.java:39)
    [junit] 	at sun.reflect.DelegatingConstructorAccessorImpl.newInstance(DelegatingConstructorAccessorImpl.java:27)
    [junit] 	at java.lang.reflect.Constructor.newInstance(Constructor.java:513)
    [junit] 	at org.apache.tools.ant.taskdefs.optional.junit.JUnitTestRunner.run(JUnitTestRunner.java:386)
    [junit] 	at org.apache.tools.ant.taskdefs.optional.junit.JUnitTestRunner.launch(JUnitTestRunner.java:911)
    [junit] 	at org.apache.tools.ant.taskdefs.optional.junit.JUnitTestRunner.main(JUnitTestRunner.java:768)
    [junit] ))
    [junit] 	at org.apache.pig.impl.PigContext.<init>(PigContext.java:140)
    [junit] 	at org.apache.pig.test.TestTypeChecking.<init>(TestTypeChecking.java:38)
    [junit] 	at sun.reflect.NativeConstructorAccessorImpl.newInstance0(Native Method)
    [junit] 	at sun.reflect.NativeConstructorAccessorImpl.newInstance(NativeConstructorAccessorImpl.java:39)
    [junit] 	at sun.reflect.DelegatingConstructorAccessorImpl.newInstance(DelegatingConstructorAccessorImpl.java:27)
    [junit] 	at java.lang.reflect.Constructor.newInstance(Constructor.java:513)
    [junit] 	at junit.framework.TestSuite.createTest(TestSuite.java:61)
    [junit] 	at junit.framework.TestSuite.addTestMethod(TestSuite.java:283)
    [junit] 	at junit.framework.TestSuite.<init>(TestSuite.java:146)
    [junit] 	at org.junit.internal.runners.JUnit38ClassRunner.<init>(JUnit38ClassRunner.java:67)
    [junit] 	at org.junit.internal.builders.JUnit3Builder.runnerForClass(JUnit3Builder.java:14)
    [junit] 	at org.junit.runners.model.RunnerBuilder.safeRunnerForClass(RunnerBuilder.java:57)
    [junit] 	at org.junit.internal.builders.AllDefaultPossibilitiesBuilder.runnerForClass(AllDefaultPossibilitiesBuilder.java:29)
    [junit] 	at org.junit.runners.model.RunnerBuilder.safeRunnerForClass(RunnerBuilder.java:57)
    [junit] 	at org.junit.internal.requests.ClassRequest.getRunner(ClassRequest.java:24)
    [junit] 	at junit.framework.JUnit4TestAdapter.<init>(JUnit4TestAdapter.java:31)
    [junit] 	at junit.framework.JUnit4TestAdapter.<init>(JUnit4TestAdapter.java:24)
    [junit] 	at sun.reflect.NativeConstructorAccessorImpl.newInstance0(Native Method)
    [junit] 	at sun.reflect.NativeConstructorAccessorImpl.newInstance(NativeConstructorAccessorImpl.java:39)
    [junit] 	at sun.reflect.DelegatingConstructorAccessorImpl.newInstance(DelegatingConstructorAccessorImpl.java:27)
    [junit] 	at java.lang.reflect.Constructor.newInstance(Constructor.java:513)
    [junit] 	at org.apache.tools.ant.taskdefs.optional.junit.JUnitTestRunner.run(JUnitTestRunner.java:386)
    [junit] 	at org.apache.tools.ant.taskdefs.optional.junit.JUnitTestRunner.launch(JUnitTestRunner.java:911)
    [junit] 	at org.apache.tools.ant.taskdefs.optional.junit.JUnitTestRunner.main(JUnitTestRunner.java:768)
    [junit] ))
    [junit] 	at org.apache.pig.impl.PigContext.<init>(PigContext.java:140)
    [junit] 	at org.apache.pig.test.TestTypeChecking.<init>(TestTypeChecking.java:38)
    [junit] 	at sun.reflect.NativeConstructorAccessorImpl.newInstance0(Native Method)
    [junit] 	at sun.reflect.NativeConstructorAccessorImpl.newInstance(NativeConstructorAccessorImpl.java:39)
    [junit] 	at sun.reflect.DelegatingConstructorAccessorImpl.newInstance(DelegatingConstructorAccessorImpl.java:27)
    [junit] 	at java.lang.reflect.Constructor.newInstance(Constructor.java:513)
    [junit] 	at junit.framework.TestSuite.createTest(TestSuite.java:61)
    [junit] 	at junit.framework.TestSuite.addTestMethod(TestSuite.java:283)
    [junit] 	at junit.framework.TestSuite.<init>(TestSuite.java:146)
    [junit] 	at org.junit.internal.runners.JUnit38ClassRunner.<init>(JUnit38ClassRunner.java:67)
    [junit] 	at org.junit.internal.builders.JUnit3Builder.runnerForClass(JUnit3Builder.java:14)
    [junit] 	at org.junit.runners.model.RunnerBuilder.safeRunnerForClass(RunnerBuilder.java:57)
    [junit] 	at org.junit.internal.builders.AllDefaultPossibilitiesBuilder.runnerForClass(AllDefaultPossibilitiesBuilder.java:29)
    [junit] 	at org.junit.runners.model.RunnerBuilder.safeRunnerForClass(RunnerBuilder.java:57)
    [junit] 	at org.junit.internal.requests.ClassRequest.getRunner(ClassRequest.java:24)
    [junit] 	at junit.framework.JUnit4TestAdapter.<init>(JUnit4TestAdapter.java:31)
    [junit] 	at junit.framework.JUnit4TestAdapter.<init>(JUnit4TestAdapter.java:24)
    [junit] 	at sun.reflect.NativeConstructorAccessorImpl.newInstance0(Native Method)
    [junit] 	at sun.reflect.NativeConstructorAccessorImpl.newInstance(NativeConstructorAccessorImpl.java:39)
    [junit] 	at sun.reflect.DelegatingConstructorAccessorImpl.newInstance(DelegatingConstructorAccessorImpl.java:27)
    [junit] 	at java.lang.reflect.Constructor.newInstance(Constructor.java:513)
    [junit] 	at org.apache.tools.ant.taskdefs.optional.junit.JUnitTestRunner.run(JUnitTestRunner.java:386)
    [junit] 	at org.apache.tools.ant.taskdefs.optional.junit.JUnitTestRunner.launch(JUnitTestRunner.java:911)
    [junit] 	at org.apache.tools.ant.taskdefs.optional.junit.JUnitTestRunner.main(JUnitTestRunner.java:768)
    [junit] ))
    [junit] 	at org.apache.pig.impl.PigContext.<init>(PigContext.java:140)
    [junit] 	at org.apache.pig.test.TestTypeChecking.<init>(TestTypeChecking.java:38)
    [junit] 	at sun.reflect.NativeConstructorAccessorImpl.newInstance0(Native Method)
    [junit] 	at sun.reflect.NativeConstructorAccessorImpl.newInstance(NativeConstructorAccessorImpl.java:39)
    [junit] 	at sun.reflect.DelegatingConstructorAccessorImpl.newInstance(DelegatingConstructorAccessorImpl.java:27)
    [junit] 	at java.lang.reflect.Constructor.newInstance(Constructor.java:513)
    [junit] 	at junit.framework.TestSuite.createTest(TestSuite.java:61)
    [junit] 	at junit.framework.TestSuite.addTestMethod(TestSuite.java:283)
    [junit] 	at junit.framework.TestSuite.<init>(TestSuite.java:146)
    [junit] 	at org.junit.internal.runners.JUnit38ClassRunner.<init>(JUnit38ClassRunner.java:67)
    [junit] 	at org.junit.internal.builders.JUnit3Builder.runnerForClass(JUnit3Builder.java:14)
    [junit] 	at org.junit.runners.model.RunnerBuilder.safeRunnerForClass(RunnerBuilder.java:57)
    [junit] 	at org.junit.internal.builders.AllDefaultPossibilitiesBuilder.runnerForClass(AllDefaultPossibilitiesBuilder.java:29)
    [junit] 	at org.junit.runners.model.RunnerBuilder.safeRunnerForClass(RunnerBuilder.java:57)
    [junit] 	at org.junit.internal.requests.ClassRequest.getRunner(ClassRequest.java:24)
    [junit] 	at junit.framework.JUnit4TestAdapter.<init>(JUnit4TestAdapter.java:31)
    [junit] 	at junit.framework.JUnit4TestAdapter.<init>(JUnit4TestAdapter.java:24)
    [junit] 	at sun.reflect.NativeConstructorAccessorImpl.newInstance0(Native Method)
    [junit] 	at sun.reflect.NativeConstructorAccessorImpl.newInstance(NativeConstructorAccessorImpl.java:39)
    [junit] 	at sun.reflect.DelegatingConstructorAccessorImpl.newInstance(DelegatingConstructorAccessorImpl.java:27)
    [junit] 	at java.lang.reflect.Constructor.newInstance(Constructor.java:513)
    [junit] 	at org.apache.tools.ant.taskdefs.optional.junit.JUnitTestRunner.run(JUnitTestRunner.java:386)
    [junit] 	at org.apache.tools.ant.taskdefs.optional.junit.JUnitTestRunner.launch(JUnitTestRunner.java:911)
    [junit] 	at org.apache.tools.ant.taskdefs.optional.junit.JUnitTestRunner.main(JUnitTestRunner.java:768)
    [junit] ))
    [junit] 	at org.apache.pig.impl.PigContext.<init>(PigContext.java:140)
    [junit] 	at org.apache.pig.test.TestTypeChecking.<init>(TestTypeChecking.java:38)
    [junit] 	at sun.reflect.NativeConstructorAccessorImpl.newInstance0(Native Method)
    [junit] 	at sun.reflect.NativeConstructorAccessorImpl.newInstance(NativeConstructorAccessorImpl.java:39)
    [junit] 	at sun.reflect.DelegatingConstructorAccessorImpl.newInstance(DelegatingConstructorAccessorImpl.java:27)
    [junit] 	at java.lang.reflect.Constructor.newInstance(Constructor.java:513)
    [junit] 	at junit.framework.TestSuite.createTest(TestSuite.java:61)
    [junit] 	at junit.framework.TestSuite.addTestMethod(TestSuite.java:283)
    [junit] 	at junit.framework.TestSuite.<init>(TestSuite.java:146)
    [junit] 	at org.junit.internal.runners.JUnit38ClassRunner.<init>(JUnit38ClassRunner.java:67)
    [junit] 	at org.junit.internal.builders.JUnit3Builder.runnerForClass(JUnit3Builder.java:14)
    [junit] 	at org.junit.runners.model.RunnerBuilder.safeRunnerForClass(RunnerBuilder.java:57)
    [junit] 	at org.junit.internal.builders.AllDefaultPossibilitiesBuilder.runnerForClass(AllDefaultPossibilitiesBuilder.java:29)
    [junit] 	at org.junit.runners.model.RunnerBuilder.safeRunnerForClass(RunnerBuilder.java:57)
    [junit] 	at org.junit.internal.requests.ClassRequest.getRunner(ClassRequest.java:24)
    [junit] 	at junit.framework.JUnit4TestAdapter.<init>(JUnit4TestAdapter.java:31)
    [junit] 	at junit.framework.JUnit4TestAdapter.<init>(JUnit4TestAdapter.java:24)
    [junit] 	at sun.reflect.NativeConstructorAccessorImpl.newInstance0(Native Method)
    [junit] 	at sun.reflect.NativeConstructorAccessorImpl.newInstance(NativeConstructorAccessorImpl.java:39)
    [junit] 	at sun.reflect.DelegatingConstructorAccessorImpl.newInstance(DelegatingConstructorAccessorImpl.java:27)
    [junit] 	at java.lang.reflect.Constructor.newInstance(Constructor.java:513)
    [junit] 	at org.apache.tools.ant.taskdefs.optional.junit.JUnitTestRunner.run(JUnitTestRunner.java:386)
    [junit] 	at org.apache.tools.ant.taskdefs.optional.junit.JUnitTestRunner.launch(JUnitTestRunner.java:911)
    [junit] 	at org.apache.tools.ant.taskdefs.optional.junit.JUnitTestRunner.main(JUnitTestRunner.java:768)
    [junit] ))
    [junit] 	at org.apache.pig.impl.PigContext.<init>(PigContext.java:140)
    [junit] 	at org.apache.pig.test.TestTypeChecking.<init>(TestTypeChecking.java:38)
    [junit] 	at sun.reflect.NativeConstructorAccessorImpl.newInstance0(Native Method)
    [junit] 	at sun.reflect.NativeConstructorAccessorImpl.newInstance(NativeConstructorAccessorImpl.java:39)
    [junit] 	at sun.reflect.DelegatingConstructorAccessorImpl.newInstance(DelegatingConstructorAccessorImpl.java:27)
    [junit] 	at java.lang.reflect.Constructor.newInstance(Constructor.java:513)
    [junit] 	at junit.framework.TestSuite.createTest(TestSuite.java:61)
    [junit] 	at junit.framework.TestSuite.addTestMethod(TestSuite.java:283)
    [junit] 	at junit.framework.TestSuite.<init>(TestSuite.java:146)
    [junit] 	at org.junit.internal.runners.JUnit38ClassRunner.<init>(JUnit38ClassRunner.java:67)
    [junit] 	at org.junit.internal.builders.JUnit3Builder.runnerForClass(JUnit3Builder.java:14)
    [junit] 	at org.junit.runners.model.RunnerBuilder.safeRunnerForClass(RunnerBuilder.java:57)
    [junit] 	at org.junit.internal.builders.AllDefaultPossibilitiesBuilder.runnerForClass(AllDefaultPossibilitiesBuilder.java:29)
    [junit] 	at org.junit.runners.model.RunnerBuilder.safeRunnerForClass(RunnerBuilder.java:57)
    [junit] 	at org.junit.internal.requests.ClassRequest.getRunner(ClassRequest.java:24)
    [junit] 	at junit.framework.JUnit4TestAdapter.<init>(JUnit4TestAdapter.java:31)
    [junit] 	at junit.framework.JUnit4TestAdapter.<init>(JUnit4TestAdapter.java:24)
    [junit] 	at sun.reflect.NativeConstructorAccessorImpl.newInstance0(Native Method)
    [junit] 	at sun.reflect.NativeConstructorAccessorImpl.newInstance(NativeConstructorAccessorImpl.java:39)
    [junit] 	at sun.reflect.DelegatingConstructorAccessorImpl.newInstance(DelegatingConstructorAccessorImpl.java:27)
    [junit] 	at java.lang.reflect.Constructor.newInstance(Constructor.java:513)
    [junit] 	at org.apache.tools.ant.taskdefs.optional.junit.JUnitTestRunner.run(JUnitTestRunner.java:386)
    [junit] 	at org.apache.tools.ant.taskdefs.optional.junit.JUnitTestRunner.launch(JUnitTestRunner.java:911)
    [junit] 	at org.apache.tools.ant.taskdefs.optional.junit.JUnitTestRunner.main(JUnitTestRunner.java:768)
    [junit] ))
    [junit] Tests run: 8, Failures: 8, Errors: 0, Time elapsed: 0.063 sec
    [junit] Test org.apache.pig.test.TestTypeChecking FAILED
    [junit] Running org.apache.pig.test.TestTypeCheckingValidatorNoSchema
    [junit] testUnion1
    [junit] testUnion2
    [junit] testSplitWithInnerPlan1
    [junit] testSplitWithInnerPlan2
    [junit] testDistinct1
    [junit] testSort1
    [junit] testFilter1
    [junit] testFilter2
    [junit] testCross1
    [junit] testCross2
    [junit] testCOGroupByAtom1
    [junit] testCOGroupByTuple1
    [junit] testForEachGenerate1
    [junit] Tests run: 13, Failures: 0, Errors: 13, Time elapsed: 0.237 sec
    [junit] Test org.apache.pig.test.TestTypeCheckingValidatorNoSchema FAILED
   [delete] Deleting directory /tmp/pig_junit_tmp1530868390

BUILD FAILED
<https://hudson.apache.org/hudson/job/Pig-trunk-commit/ws/trunk/build.xml>:638: The
following error occurred while executing this line:
<https://hudson.apache.org/hudson/job/Pig-trunk-commit/ws/trunk/build.xml>:715: Tests
failed!

Total time: 18 minutes 54 seconds
[FINDBUGS] Skipping publisher since build result is FAILURE
Publishing Javadoc
Archiving artifacts
Recording test results
Recording fingerprints
Publishing Clover coverage report...
No Clover report will be published due to a Build Failure


Mime
View raw message