phoenix-issues mailing list archives

Site index · List index
Message view « Date » · « Thread »
Top « Date » · « Thread »
From "Hudson (JIRA)" <j...@apache.org>
Subject [jira] [Commented] (PHOENIX-5323) UpgradeIT.testMapTableToNamespaceDuringUpgrade is flapping
Date Mon, 10 Jun 2019 03:51:00 GMT

    [ https://issues.apache.org/jira/browse/PHOENIX-5323?page=com.atlassian.jira.plugin.system.issuetabpanels:comment-tabpanel&focusedCommentId=16859690#comment-16859690
] 

Hudson commented on PHOENIX-5323:
---------------------------------

ABORTED: Integrated in Jenkins build Phoenix-4.x-HBase-1.5 #24 (See [https://builds.apache.org/job/Phoenix-4.x-HBase-1.5/24/])
PHOENIX-5323 UpgradeIT.testMapTableToNamespaceDuringUpgrade is flapping. (larsh: rev 0dedf510e93862508f4893b4b1b2207814d313e5)
* (edit) phoenix-core/src/it/java/org/apache/phoenix/end2end/UpgradeIT.java


> UpgradeIT.testMapTableToNamespaceDuringUpgrade is flapping
> ----------------------------------------------------------
>
>                 Key: PHOENIX-5323
>                 URL: https://issues.apache.org/jira/browse/PHOENIX-5323
>             Project: Phoenix
>          Issue Type: Test
>            Reporter: Lars Hofhansl
>            Priority: Major
>         Attachments: 5323.txt
>
>
> {quote}
> [ERROR] Tests run: 9, Failures: 1, Errors: 0, Skipped: 0, Time elapsed: 94.074 s <<<
FAILURE! - in org.apache.phoenix.end2end.UpgradeIT
> [ERROR] testMapTableToNamespaceDuringUpgrade(org.apache.phoenix.end2end.UpgradeIT)  Time
elapsed: 36.722 s  <<< FAILURE!
> java.lang.AssertionError: expected:<-9223372036854775805> but was:<-9223372036854774707>
> 	at org.apache.phoenix.end2end.UpgradeIT.testMapTableToNamespaceDuringUpgrade(UpgradeIT.java:189)
> {quote}



--
This message was sent by Atlassian JIRA
(v7.6.3#76005)

Mime
View raw message