phoenix-dev mailing list archives

Site index · List index
Message view « Date » · « Thread »
Top « Date » · « Thread »
From "Hudson (JIRA)" <j...@apache.org>
Subject [jira] [Commented] (PHOENIX-4496) Fix RowValueConstructorIT and IndexMetadataIT
Date Fri, 13 Apr 2018 13:14:00 GMT

    [ https://issues.apache.org/jira/browse/PHOENIX-4496?page=com.atlassian.jira.plugin.system.issuetabpanels:comment-tabpanel&focusedCommentId=16437284#comment-16437284
] 

Hudson commented on PHOENIX-4496:
---------------------------------

SUCCESS: Integrated in Jenkins build Phoenix-4.x-HBase-1.3 #94 (See [https://builds.apache.org/job/Phoenix-4.x-HBase-1.3/94/])
PHOENIX-4496 Fix RowValueConstructorIT and IndexMetadataIT (ankitsinghal59: rev 672f195ae71e20f2358e16bec5c8bb7a3d608858)
* (edit) phoenix-core/src/main/java/org/apache/phoenix/hbase/index/scanner/ScannerBuilder.java
PHOENIX-4496 Fix RowValueConstructorIT and IndexMetadataIT (ankitsinghal59: rev f543d99a358a3bd3164754bfb81f9f1582c320f9)
* (edit) phoenix-core/src/main/java/org/apache/phoenix/hbase/index/scanner/ScannerBuilder.java


> Fix RowValueConstructorIT and IndexMetadataIT
> ---------------------------------------------
>
>                 Key: PHOENIX-4496
>                 URL: https://issues.apache.org/jira/browse/PHOENIX-4496
>             Project: Phoenix
>          Issue Type: Sub-task
>    Affects Versions: 4.14.0
>            Reporter: Rajeshbabu Chintaguntla
>            Assignee: Ankit Singhal
>            Priority: Major
>              Labels: HBase-2.0
>             Fix For: 4.14.0, 5.0.0
>
>         Attachments: PHOENIX-4496.patch
>
>
> {noformat}
> [ERROR] Tests run: 46, Failures: 1, Errors: 0, Skipped: 0, Time elapsed: 117.444 s <<<
FAILURE! - in org.apache.phoenix.end2end.RowValueConstructorIT
> [ERROR] testRVCLastPkIsTable1stPkIndex(org.apache.phoenix.end2end.RowValueConstructorIT)
 Time elapsed: 4.516 s  <<< FAILURE!
> java.lang.AssertionError
>         at org.apache.phoenix.end2end.RowValueConstructorIT.testRVCLastPkIsTable1stPkIndex(RowValueConstructorIT.java:1584)
> {noformat}
> {noformat}
> ERROR] Tests run: 14, Failures: 1, Errors: 0, Skipped: 0, Time elapsed: 79.381 s <<<
FAILURE! - in org.apache.phoenix.end2end.index.IndexMetadataIT
> [ERROR] testMutableTableOnlyHasPrimaryKeyIndex(org.apache.phoenix.end2end.index.IndexMetadataIT)
 Time elapsed: 4.504 s  <<< FAILURE!
> java.lang.AssertionError
>         at org.apache.phoenix.end2end.index.IndexMetadataIT.helpTestTableOnlyHasPrimaryKeyIndex(IndexMetadataIT.java:662)
>         at org.apache.phoenix.end2end.index.IndexMetadataIT.testMutableTableOnlyHasPrimaryKeyIndex(IndexMetadataIT.java:623)
> {noformat}



--
This message was sent by Atlassian JIRA
(v7.6.3#76005)

Mime
View raw message