phoenix-dev mailing list archives

Site index · List index
Message view « Date » · « Thread »
Top « Date » · « Thread »
From "Josh Elser (JIRA)" <j...@apache.org>
Subject [jira] [Updated] (PHOENIX-4570) Phoenix pherf tests fail with Mockito dependency issue.
Date Wed, 31 Jan 2018 17:35:00 GMT

     [ https://issues.apache.org/jira/browse/PHOENIX-4570?page=com.atlassian.jira.plugin.system.issuetabpanels:all-tabpanel
]

Josh Elser updated PHOENIX-4570:
--------------------------------
    Attachment: PHOENIX-4570.002.patch

> Phoenix pherf tests fail with Mockito dependency issue.
> -------------------------------------------------------
>
>                 Key: PHOENIX-4570
>                 URL: https://issues.apache.org/jira/browse/PHOENIX-4570
>             Project: Phoenix
>          Issue Type: Bug
>            Reporter: Josh Elser
>            Assignee: Josh Elser
>            Priority: Blocker
>              Labels: HBase-2.0
>             Fix For: 5.0.0
>
>         Attachments: PHOENIX-4570.002.patch, PHOENIX-4570.patch
>
>
> {noformat}
> Tests run: 1, Failures: 0, Errors: 1, Skipped: 0, Time elapsed: 0.006 s <<<
FAILURE! - in org.apache.phoenix.pherf.SchemaReaderIT
> org.apache.phoenix.pherf.SchemaReaderIT  Time elapsed: 0.005 s  <<< ERROR!
> java.lang.RuntimeException: java.lang.NoClassDefFoundError: org/mockito/stubbing/Answer
> Caused by: java.lang.NoClassDefFoundError: org/mockito/stubbing/Answer
> Caused by: java.lang.ClassNotFoundException: org.mockito.stubbing.Answer
> Tests run: 2, Failures: 0, Errors: 2, Skipped: 0, Time elapsed: 0.004 s <<<
FAILURE! - in org.apache.phoenix.pherf.PherfMainIT
> org.apache.phoenix.pherf.PherfMainIT  Time elapsed: 0.004 s  <<< ERROR!
> java.lang.RuntimeException: java.lang.NoClassDefFoundError: org/mockito/stubbing/Answer
> Caused by: java.lang.NoClassDefFoundError: org/mockito/stubbing/Answer
> Caused by: java.lang.ClassNotFoundException: org.mockito.stubbing.Answer
> Tests run: 2, Failures: 0, Errors: 2, Skipped: 0, Time elapsed: 0.004 s <<<
FAILURE! - in org.apache.phoenix.pherf.DataIngestIT
> org.apache.phoenix.pherf.DataIngestIT  Time elapsed: 0.003 s  <<< ERROR!
> java.lang.RuntimeException: java.lang.NoClassDefFoundError: org/mockito/stubbing/Answer
> Caused by: java.lang.NoClassDefFoundError: org/mockito/stubbing/Answer
> Caused by: java.lang.ClassNotFoundException: org.mockito.stubbing.Answer
> {noformat}
> Looks like a pretty easy dependency issue to fix up.



--
This message was sent by Atlassian JIRA
(v7.6.3#76005)

Mime
View raw message