phoenix-dev mailing list archives

Site index · List index
Message view « Date » · « Thread »
Top « Date » · « Thread »
From "Hadoop QA (JIRA)" <j...@apache.org>
Subject [jira] [Commented] (PHOENIX-4496) Fix RowValueConstructorIT and IndexMetadataIT
Date Wed, 03 Jan 2018 12:38:00 GMT

    [ https://issues.apache.org/jira/browse/PHOENIX-4496?page=com.atlassian.jira.plugin.system.issuetabpanels:comment-tabpanel&focusedCommentId=16309591#comment-16309591
] 

Hadoop QA commented on PHOENIX-4496:
------------------------------------

{color:red}-1 overall{color}.  Here are the results of testing the latest attachment 
  http://issues.apache.org/jira/secure/attachment/12904390/PHOENIX-4496.patch
  against master branch at commit f7142879f33cae236e0530a8ed4eeaad1542d66a.
  ATTACHMENT ID: 12904390

    {color:green}+1 @author{color}.  The patch does not contain any @author tags.

    {color:red}-1 tests included{color}.  The patch doesn't appear to include any new or modified
tests.
                        Please justify why no new tests are needed for this patch.
                        Also please list what manual steps were performed to verify this patch.

    {color:red}-1 javac{color}.  The patch appears to cause mvn compile goal to fail .

    Compilation errors resume:
    [ERROR] COMPILATION ERROR : 
[ERROR] /home/jenkins/jenkins-slave/workspace/PreCommit-PHOENIX-Build/phoenix-core/src/main/java/org/apache/phoenix/hbase/index/scanner/ScannerBuilder.java:[104,49]
<anonymous org.apache.phoenix.hbase.index.scanner.ScannerBuilder$1> is not abstract
and does not override abstract method filterKeyValue(org.apache.hadoop.hbase.Cell) in org.apache.hadoop.hbase.filter.Filter
[ERROR] Failed to execute goal org.apache.maven.plugins:maven-compiler-plugin:3.0:compile
(default-compile) on project phoenix-core: Compilation failure
[ERROR] /home/jenkins/jenkins-slave/workspace/PreCommit-PHOENIX-Build/phoenix-core/src/main/java/org/apache/phoenix/hbase/index/scanner/ScannerBuilder.java:[104,49]
<anonymous org.apache.phoenix.hbase.index.scanner.ScannerBuilder$1> is not abstract
and does not override abstract method filterKeyValue(org.apache.hadoop.hbase.Cell) in org.apache.hadoop.hbase.filter.Filter
[ERROR] 
[ERROR] -> [Help 1]
[ERROR] 
[ERROR] To see the full stack trace of the errors, re-run Maven with the -e switch.
[ERROR] Re-run Maven using the -X switch to enable full debug logging.
[ERROR] 
[ERROR] For more information about the errors and possible solutions, please read the following
articles:
[ERROR] [Help 1] http://cwiki.apache.org/confluence/display/MAVEN/MojoFailureException
[ERROR] 
[ERROR] After correcting the problems, you can resume the build with the command
[ERROR]   mvn <goals> -rf :phoenix-core
    

Console output: https://builds.apache.org/job/PreCommit-PHOENIX-Build/1700//console

This message is automatically generated.

> Fix RowValueConstructorIT and IndexMetadataIT
> ---------------------------------------------
>
>                 Key: PHOENIX-4496
>                 URL: https://issues.apache.org/jira/browse/PHOENIX-4496
>             Project: Phoenix
>          Issue Type: Sub-task
>            Reporter: Rajeshbabu Chintaguntla
>            Assignee: Ankit Singhal
>              Labels: HBase-2.0
>             Fix For: 5.0.0
>
>         Attachments: PHOENIX-4496.patch
>
>
> {noformat}
> [ERROR] Tests run: 46, Failures: 1, Errors: 0, Skipped: 0, Time elapsed: 117.444 s <<<
FAILURE! - in org.apache.phoenix.end2end.RowValueConstructorIT
> [ERROR] testRVCLastPkIsTable1stPkIndex(org.apache.phoenix.end2end.RowValueConstructorIT)
 Time elapsed: 4.516 s  <<< FAILURE!
> java.lang.AssertionError
>         at org.apache.phoenix.end2end.RowValueConstructorIT.testRVCLastPkIsTable1stPkIndex(RowValueConstructorIT.java:1584)
> {noformat}
> {noformat}
> ERROR] Tests run: 14, Failures: 1, Errors: 0, Skipped: 0, Time elapsed: 79.381 s <<<
FAILURE! - in org.apache.phoenix.end2end.index.IndexMetadataIT
> [ERROR] testMutableTableOnlyHasPrimaryKeyIndex(org.apache.phoenix.end2end.index.IndexMetadataIT)
 Time elapsed: 4.504 s  <<< FAILURE!
> java.lang.AssertionError
>         at org.apache.phoenix.end2end.index.IndexMetadataIT.helpTestTableOnlyHasPrimaryKeyIndex(IndexMetadataIT.java:662)
>         at org.apache.phoenix.end2end.index.IndexMetadataIT.testMutableTableOnlyHasPrimaryKeyIndex(IndexMetadataIT.java:623)
> {noformat}



--
This message was sent by Atlassian JIRA
(v6.4.14#64029)

Mime
View raw message