phoenix-commits mailing list archives

Site index · List index
Message view « Date » · « Thread »
Top « Date » · « Thread »
From Apache Jenkins Server <jenk...@builds.apache.org>
Subject Build failed in Jenkins: Phoenix Compile Compatibility with HBase #838
Date Wed, 05 Dec 2018 09:17:09 GMT
See <https://builds.apache.org/job/Phoenix_Compile_Compat_wHBase/838/display/redirect>

------------------------------------------
Started by timer
[EnvInject] - Loading node environment variables.
Building remotely on H25 (ubuntu xenial) in workspace <https://builds.apache.org/job/Phoenix_Compile_Compat_wHBase/ws/>
[Phoenix_Compile_Compat_wHBase] $ /bin/bash /tmp/jenkins1406536061493391644.sh
core file size          (blocks, -c) 0
data seg size           (kbytes, -d) unlimited
scheduling priority             (-e) 0
file size               (blocks, -f) unlimited
pending signals                 (-i) 386407
max locked memory       (kbytes, -l) 64
max memory size         (kbytes, -m) unlimited
open files                      (-n) 60000
pipe size            (512 bytes, -p) 8
POSIX message queues     (bytes, -q) 819200
real-time priority              (-r) 0
stack size              (kbytes, -s) 8192
cpu time               (seconds, -t) unlimited
max user processes              (-u) 10240
virtual memory          (kbytes, -v) unlimited
file locks                      (-x) unlimited
core id		: 0
core id		: 1
core id		: 2
core id		: 3
core id		: 4
core id		: 5
physical id	: 0
physical id	: 1
MemTotal:       98957636 kB
MemFree:        51764044 kB
Filesystem      Size  Used Avail Use% Mounted on
udev             48G     0   48G   0% /dev
tmpfs           9.5G  394M  9.1G   5% /run
/dev/sda3       3.6T  226G  3.2T   7% /
tmpfs            48G   64K   48G   1% /dev/shm
tmpfs           5.0M     0  5.0M   0% /run/lock
tmpfs            48G     0   48G   0% /sys/fs/cgroup
/dev/sda2       473M  146M  303M  33% /boot
/dev/loop0       88M   88M     0 100% /snap/core/5662
/dev/loop1       28M   28M     0 100% /snap/snapcraft/1871
/dev/loop3       88M   88M     0 100% /snap/core/5742
tmpfs           9.5G  4.0K  9.5G   1% /run/user/910
/dev/loop6       52M   52M     0 100% /snap/lxd/9564
/dev/loop4       52M   52M     0 100% /snap/lxd/9600
/dev/loop5       89M   89M     0 100% /snap/core/5897
/dev/loop7       52M   52M     0 100% /snap/lxd/9664
tmpfs           9.5G     0  9.5G   0% /run/user/1000
/dev/loop2       28M   28M     0 100% /snap/snapcraft/2374
apache-maven-2.2.1
apache-maven-3.0.4
apache-maven-3.0.5
apache-maven-3.1.1
apache-maven-3.2.1
apache-maven-3.2.5
apache-maven-3.3.3
apache-maven-3.3.9
apache-maven-3.5.0
apache-maven-3.5.2
apache-maven-3.5.4
latest
latest2
latest3


===========================================================================================
Verifying compile level compatibility with HBase 0.98 with Phoenix 4.x-HBase-0.98
===========================================================================================

Cloning into 'hbase'...
Switched to a new branch '0.98'
Branch 0.98 set up to track remote branch 0.98 from origin.
[ERROR] Plugin org.codehaus.mojo:findbugs-maven-plugin:2.5.2 or one of its dependencies could
not be resolved: Failed to read artifact descriptor for org.codehaus.mojo:findbugs-maven-plugin:jar:2.5.2:
Could not transfer artifact org.codehaus.mojo:findbugs-maven-plugin:pom:2.5.2 from/to central
(https://repo.maven.apache.org/maven2): Received fatal alert: protocol_version -> [Help
1]
[ERROR] 
[ERROR] To see the full stack trace of the errors, re-run Maven with the -e switch.
[ERROR] Re-run Maven using the -X switch to enable full debug logging.
[ERROR] 
[ERROR] For more information about the errors and possible solutions, please read the following
articles:
[ERROR] [Help 1] http://cwiki.apache.org/confluence/display/MAVEN/PluginResolutionException
Build step 'Execute shell' marked build as failure

Mime
View raw message