phoenix-commits mailing list archives

Site index · List index
Message view « Date » · « Thread »
Top « Date » · « Thread »
From Apache Jenkins Server <jenk...@builds.apache.org>
Subject Build failed in Jenkins: Phoenix-4.x-HBase-1.3 #220
Date Tue, 02 Oct 2018 23:10:26 GMT
See <https://builds.apache.org/job/Phoenix-4.x-HBase-1.3/220/display/redirect?page=changes>

Changes:

[gjacoby] PHOENIX-4519 - Index rebuild MR jobs not created for "alter index

------------------------------------------
[...truncated 322.93 KB...]

[ERROR] testNonSaltedUpdatableViewWithLocalIndex[transactional = true](org.apache.phoenix.end2end.StatsEnabledSplitSystemCatalogIT)
 Time elapsed: 2.005 s  <<< ERROR!
java.lang.RuntimeException: org.apache.thrift.TException: Unable to discover transaction service.
	at org.apache.phoenix.end2end.StatsEnabledSplitSystemCatalogIT.testUpdatableViewWithIndex(StatsEnabledSplitSystemCatalogIT.java:161)
	at org.apache.phoenix.end2end.StatsEnabledSplitSystemCatalogIT.testNonSaltedUpdatableViewWithLocalIndex(StatsEnabledSplitSystemCatalogIT.java:114)
Caused by: org.apache.thrift.TException: Unable to discover transaction service.
	at org.apache.phoenix.end2end.StatsEnabledSplitSystemCatalogIT.testUpdatableViewWithIndex(StatsEnabledSplitSystemCatalogIT.java:161)
	at org.apache.phoenix.end2end.StatsEnabledSplitSystemCatalogIT.testNonSaltedUpdatableViewWithLocalIndex(StatsEnabledSplitSystemCatalogIT.java:114)

[ERROR] testNonSaltedUpdatableViewWithIndex[transactional = true](org.apache.phoenix.end2end.StatsEnabledSplitSystemCatalogIT)
 Time elapsed: 2.005 s  <<< ERROR!
java.lang.RuntimeException: org.apache.thrift.TException: Unable to discover transaction service.
	at org.apache.phoenix.end2end.StatsEnabledSplitSystemCatalogIT.testUpdatableViewWithIndex(StatsEnabledSplitSystemCatalogIT.java:161)
	at org.apache.phoenix.end2end.StatsEnabledSplitSystemCatalogIT.testNonSaltedUpdatableViewWithIndex(StatsEnabledSplitSystemCatalogIT.java:109)
Caused by: org.apache.thrift.TException: Unable to discover transaction service.
	at org.apache.phoenix.end2end.StatsEnabledSplitSystemCatalogIT.testUpdatableViewWithIndex(StatsEnabledSplitSystemCatalogIT.java:161)
	at org.apache.phoenix.end2end.StatsEnabledSplitSystemCatalogIT.testNonSaltedUpdatableViewWithIndex(StatsEnabledSplitSystemCatalogIT.java:109)

[ERROR] testReadOnlyOnReadOnlyView[transactional = true](org.apache.phoenix.end2end.StatsEnabledSplitSystemCatalogIT)
 Time elapsed: 2.011 s  <<< ERROR!
java.lang.RuntimeException: org.apache.thrift.TException: Unable to discover transaction service.
	at org.apache.phoenix.end2end.StatsEnabledSplitSystemCatalogIT.testReadOnlyOnReadOnlyView(StatsEnabledSplitSystemCatalogIT.java:198)
Caused by: org.apache.thrift.TException: Unable to discover transaction service.
	at org.apache.phoenix.end2end.StatsEnabledSplitSystemCatalogIT.testReadOnlyOnReadOnlyView(StatsEnabledSplitSystemCatalogIT.java:198)

[INFO] Running org.apache.phoenix.end2end.SystemCatalogCreationOnConnectionIT
[WARNING] Tests run: 28, Failures: 0, Errors: 0, Skipped: 4, Time elapsed: 181.229 s - in
org.apache.phoenix.end2end.SysTableNamespaceMappedStatsCollectorIT
[INFO] Running org.apache.phoenix.end2end.SystemCatalogIT
[INFO] Tests run: 12, Failures: 0, Errors: 0, Skipped: 0, Time elapsed: 392.319 s - in org.apache.phoenix.end2end.SplitIT
[INFO] Running org.apache.phoenix.end2end.SystemTablePermissionsIT
[INFO] Tests run: 1, Failures: 0, Errors: 0, Skipped: 0, Time elapsed: 102.276 s - in org.apache.phoenix.end2end.SystemCatalogIT
[INFO] Running org.apache.phoenix.end2end.TableDDLPermissionsIT
[INFO] Tests run: 2, Failures: 0, Errors: 0, Skipped: 0, Time elapsed: 156.27 s - in org.apache.phoenix.end2end.SystemTablePermissionsIT
[INFO] Running org.apache.phoenix.end2end.TableSnapshotReadsMapReduceIT
[INFO] Tests run: 3, Failures: 0, Errors: 0, Skipped: 0, Time elapsed: 30.063 s - in org.apache.phoenix.end2end.TableSnapshotReadsMapReduceIT
[INFO] Tests run: 96, Failures: 0, Errors: 0, Skipped: 0, Time elapsed: 1,777.992 s - in org.apache.phoenix.end2end.IndexToolIT
[INFO] Running org.apache.phoenix.end2end.UpdateCacheAcrossDifferentClientsIT
[INFO] Running org.apache.phoenix.end2end.UserDefinedFunctionsIT
[INFO] Tests run: 6, Failures: 0, Errors: 0, Skipped: 0, Time elapsed: 60.582 s - in org.apache.phoenix.end2end.UpdateCacheAcrossDifferentClientsIT
[INFO] Running org.apache.phoenix.end2end.index.ImmutableIndexIT
[INFO] Tests run: 16, Failures: 0, Errors: 0, Skipped: 0, Time elapsed: 180.528 s - in org.apache.phoenix.end2end.UserDefinedFunctionsIT
[INFO] Running org.apache.phoenix.end2end.index.LocalIndexIT
[INFO] Tests run: 4, Failures: 0, Errors: 0, Skipped: 0, Time elapsed: 635.152 s - in org.apache.phoenix.end2end.TableDDLPermissionsIT
[INFO] Tests run: 14, Failures: 0, Errors: 0, Skipped: 0, Time elapsed: 1,008.929 s - in org.apache.phoenix.end2end.SystemCatalogCreationOnConnectionIT
[INFO] Running org.apache.phoenix.end2end.index.MutableIndexFailureIT
[INFO] Running org.apache.phoenix.end2end.index.MutableIndexFailureWithNamespaceIT
[ERROR] Tests run: 40, Failures: 0, Errors: 12, Skipped: 16, Time elapsed: 332.728 s <<<
FAILURE! - in org.apache.phoenix.end2end.index.ImmutableIndexIT
[ERROR] testDeleteFromPartialPK[ImmutableIndexIT_localIndex=false,transactional=true,columnEncoded=false](org.apache.phoenix.end2end.index.ImmutableIndexIT)
 Time elapsed: 2.276 s  <<< ERROR!
java.lang.RuntimeException: org.apache.thrift.TException: Unable to discover transaction service.
	at org.apache.phoenix.end2end.index.ImmutableIndexIT.testDeleteFromPartialPK(ImmutableIndexIT.java:177)
Caused by: org.apache.thrift.TException: Unable to discover transaction service.
	at org.apache.phoenix.end2end.index.ImmutableIndexIT.testDeleteFromPartialPK(ImmutableIndexIT.java:177)

[ERROR] testDropIfImmutableKeyValueColumn[ImmutableIndexIT_localIndex=false,transactional=true,columnEncoded=false](org.apache.phoenix.end2end.index.ImmutableIndexIT)
 Time elapsed: 2.007 s  <<< ERROR!
java.lang.RuntimeException: org.apache.thrift.TException: Unable to discover transaction service.
	at org.apache.phoenix.end2end.index.ImmutableIndexIT.testDropIfImmutableKeyValueColumn(ImmutableIndexIT.java:134)
Caused by: org.apache.thrift.TException: Unable to discover transaction service.
	at org.apache.phoenix.end2end.index.ImmutableIndexIT.testDropIfImmutableKeyValueColumn(ImmutableIndexIT.java:134)

[ERROR] testDeleteFromNonPK[ImmutableIndexIT_localIndex=false,transactional=true,columnEncoded=false](org.apache.phoenix.end2end.index.ImmutableIndexIT)
 Time elapsed: 2.005 s  <<< ERROR!
java.lang.RuntimeException: org.apache.thrift.TException: Unable to discover transaction service.
	at org.apache.phoenix.end2end.index.ImmutableIndexIT.testDeleteFromNonPK(ImmutableIndexIT.java:219)
Caused by: org.apache.thrift.TException: Unable to discover transaction service.
	at org.apache.phoenix.end2end.index.ImmutableIndexIT.testDeleteFromNonPK(ImmutableIndexIT.java:219)

[ERROR] testDeleteFromPartialPK[ImmutableIndexIT_localIndex=false,transactional=true,columnEncoded=true](org.apache.phoenix.end2end.index.ImmutableIndexIT)
 Time elapsed: 2.003 s  <<< ERROR!
java.lang.RuntimeException: org.apache.thrift.TException: Unable to discover transaction service.
	at org.apache.phoenix.end2end.index.ImmutableIndexIT.testDeleteFromPartialPK(ImmutableIndexIT.java:177)
Caused by: org.apache.thrift.TException: Unable to discover transaction service.
	at org.apache.phoenix.end2end.index.ImmutableIndexIT.testDeleteFromPartialPK(ImmutableIndexIT.java:177)

[ERROR] testDropIfImmutableKeyValueColumn[ImmutableIndexIT_localIndex=false,transactional=true,columnEncoded=true](org.apache.phoenix.end2end.index.ImmutableIndexIT)
 Time elapsed: 2.004 s  <<< ERROR!
java.lang.RuntimeException: org.apache.thrift.TException: Unable to discover transaction service.
	at org.apache.phoenix.end2end.index.ImmutableIndexIT.testDropIfImmutableKeyValueColumn(ImmutableIndexIT.java:134)
Caused by: org.apache.thrift.TException: Unable to discover transaction service.
	at org.apache.phoenix.end2end.index.ImmutableIndexIT.testDropIfImmutableKeyValueColumn(ImmutableIndexIT.java:134)

[ERROR] testDeleteFromNonPK[ImmutableIndexIT_localIndex=false,transactional=true,columnEncoded=true](org.apache.phoenix.end2end.index.ImmutableIndexIT)
 Time elapsed: 2.005 s  <<< ERROR!
java.lang.RuntimeException: org.apache.thrift.TException: Unable to discover transaction service.
	at org.apache.phoenix.end2end.index.ImmutableIndexIT.testDeleteFromNonPK(ImmutableIndexIT.java:219)
Caused by: org.apache.thrift.TException: Unable to discover transaction service.
	at org.apache.phoenix.end2end.index.ImmutableIndexIT.testDeleteFromNonPK(ImmutableIndexIT.java:219)

[ERROR] testDeleteFromPartialPK[ImmutableIndexIT_localIndex=true,transactional=true,columnEncoded=false](org.apache.phoenix.end2end.index.ImmutableIndexIT)
 Time elapsed: 2.005 s  <<< ERROR!
java.lang.RuntimeException: org.apache.thrift.TException: Unable to discover transaction service.
	at org.apache.phoenix.end2end.index.ImmutableIndexIT.testDeleteFromPartialPK(ImmutableIndexIT.java:177)
Caused by: org.apache.thrift.TException: Unable to discover transaction service.
	at org.apache.phoenix.end2end.index.ImmutableIndexIT.testDeleteFromPartialPK(ImmutableIndexIT.java:177)

[ERROR] testDropIfImmutableKeyValueColumn[ImmutableIndexIT_localIndex=true,transactional=true,columnEncoded=false](org.apache.phoenix.end2end.index.ImmutableIndexIT)
 Time elapsed: 2.004 s  <<< ERROR!
java.lang.RuntimeException: org.apache.thrift.TException: Unable to discover transaction service.
	at org.apache.phoenix.end2end.index.ImmutableIndexIT.testDropIfImmutableKeyValueColumn(ImmutableIndexIT.java:134)
Caused by: org.apache.thrift.TException: Unable to discover transaction service.
	at org.apache.phoenix.end2end.index.ImmutableIndexIT.testDropIfImmutableKeyValueColumn(ImmutableIndexIT.java:134)

[ERROR] testDeleteFromNonPK[ImmutableIndexIT_localIndex=true,transactional=true,columnEncoded=false](org.apache.phoenix.end2end.index.ImmutableIndexIT)
 Time elapsed: 2.004 s  <<< ERROR!
java.lang.RuntimeException: org.apache.thrift.TException: Unable to discover transaction service.
	at org.apache.phoenix.end2end.index.ImmutableIndexIT.testDeleteFromNonPK(ImmutableIndexIT.java:219)
Caused by: org.apache.thrift.TException: Unable to discover transaction service.
	at org.apache.phoenix.end2end.index.ImmutableIndexIT.testDeleteFromNonPK(ImmutableIndexIT.java:219)

[ERROR] testDeleteFromPartialPK[ImmutableIndexIT_localIndex=true,transactional=true,columnEncoded=true](org.apache.phoenix.end2end.index.ImmutableIndexIT)
 Time elapsed: 2.004 s  <<< ERROR!
java.lang.RuntimeException: org.apache.thrift.TException: Unable to discover transaction service.
	at org.apache.phoenix.end2end.index.ImmutableIndexIT.testDeleteFromPartialPK(ImmutableIndexIT.java:177)
Caused by: org.apache.thrift.TException: Unable to discover transaction service.
	at org.apache.phoenix.end2end.index.ImmutableIndexIT.testDeleteFromPartialPK(ImmutableIndexIT.java:177)

[ERROR] testDropIfImmutableKeyValueColumn[ImmutableIndexIT_localIndex=true,transactional=true,columnEncoded=true](org.apache.phoenix.end2end.index.ImmutableIndexIT)
 Time elapsed: 2.005 s  <<< ERROR!
java.lang.RuntimeException: org.apache.thrift.TException: Unable to discover transaction service.
	at org.apache.phoenix.end2end.index.ImmutableIndexIT.testDropIfImmutableKeyValueColumn(ImmutableIndexIT.java:134)
Caused by: org.apache.thrift.TException: Unable to discover transaction service.
	at org.apache.phoenix.end2end.index.ImmutableIndexIT.testDropIfImmutableKeyValueColumn(ImmutableIndexIT.java:134)

[ERROR] testDeleteFromNonPK[ImmutableIndexIT_localIndex=true,transactional=true,columnEncoded=true](org.apache.phoenix.end2end.index.ImmutableIndexIT)
 Time elapsed: 2.004 s  <<< ERROR!
java.lang.RuntimeException: org.apache.thrift.TException: Unable to discover transaction service.
	at org.apache.phoenix.end2end.index.ImmutableIndexIT.testDeleteFromNonPK(ImmutableIndexIT.java:219)
Caused by: org.apache.thrift.TException: Unable to discover transaction service.
	at org.apache.phoenix.end2end.index.ImmutableIndexIT.testDeleteFromNonPK(ImmutableIndexIT.java:219)

[INFO] Running org.apache.phoenix.end2end.index.MutableIndexRebuilderIT
[INFO] Tests run: 1, Failures: 0, Errors: 0, Skipped: 0, Time elapsed: 75.19 s - in org.apache.phoenix.end2end.index.MutableIndexRebuilderIT
[INFO] Tests run: 7, Failures: 0, Errors: 0, Skipped: 0, Time elapsed: 160.663 s - in org.apache.phoenix.end2end.index.MutableIndexFailureWithNamespaceIT
[INFO] Tests run: 14, Failures: 0, Errors: 0, Skipped: 0, Time elapsed: 264.669 s - in org.apache.phoenix.end2end.index.MutableIndexFailureIT
[INFO] Running org.apache.phoenix.end2end.index.PartialIndexRebuilderIT
[INFO] Running org.apache.phoenix.end2end.index.PhoenixMRJobSubmitterIT
[INFO] Tests run: 1, Failures: 0, Errors: 0, Skipped: 0, Time elapsed: 9.731 s - in org.apache.phoenix.end2end.index.PhoenixMRJobSubmitterIT
[INFO] Running org.apache.phoenix.end2end.index.MutableIndexReplicationIT
[ERROR] Tests run: 1, Failures: 0, Errors: 1, Skipped: 0, Time elapsed: 0.006 s <<<
FAILURE! - in org.apache.phoenix.end2end.index.MutableIndexReplicationIT
[ERROR] org.apache.phoenix.end2end.index.MutableIndexReplicationIT  Time elapsed: 0.006 s
 <<< ERROR!
java.io.IOException: Shutting down
	at org.apache.phoenix.end2end.index.MutableIndexReplicationIT.setupConfigsAndStartCluster(MutableIndexReplicationIT.java:157)
	at org.apache.phoenix.end2end.index.MutableIndexReplicationIT.setUpBeforeClass(MutableIndexReplicationIT.java:108)
Caused by: java.lang.RuntimeException: Master not initialized after 200000ms seconds
	at org.apache.phoenix.end2end.index.MutableIndexReplicationIT.setupConfigsAndStartCluster(MutableIndexReplicationIT.java:157)
	at org.apache.phoenix.end2end.index.MutableIndexReplicationIT.setUpBeforeClass(MutableIndexReplicationIT.java:108)

[INFO] Tests run: 38, Failures: 0, Errors: 0, Skipped: 0, Time elapsed: 501.736 s - in org.apache.phoenix.end2end.index.LocalIndexIT
[INFO] Running org.apache.phoenix.end2end.index.txn.TxWriteFailureIT
[INFO] Running org.apache.phoenix.execute.PartialCommitIT
[INFO] Running org.apache.phoenix.execute.UpsertSelectOverlappingBatchesIT
[INFO] Tests run: 12, Failures: 0, Errors: 0, Skipped: 0, Time elapsed: 0.864 s - in org.apache.phoenix.execute.PartialCommitIT
[INFO] Tests run: 8, Failures: 0, Errors: 0, Skipped: 0, Time elapsed: 59.485 s - in org.apache.phoenix.end2end.index.txn.TxWriteFailureIT
[INFO] Running org.apache.phoenix.hbase.index.FailForUnsupportedHBaseVersionsIT
[INFO] Tests run: 2, Failures: 0, Errors: 0, Skipped: 0, Time elapsed: 31.034 s - in org.apache.phoenix.hbase.index.FailForUnsupportedHBaseVersionsIT
[INFO] Running org.apache.phoenix.iterate.RoundRobinResultIteratorWithStatsIT
[INFO] Tests run: 1, Failures: 0, Errors: 0, Skipped: 0, Time elapsed: 7.511 s - in org.apache.phoenix.iterate.RoundRobinResultIteratorWithStatsIT
[INFO] Tests run: 3, Failures: 0, Errors: 0, Skipped: 0, Time elapsed: 83.703 s - in org.apache.phoenix.execute.UpsertSelectOverlappingBatchesIT
[INFO] Running org.apache.phoenix.iterate.ScannerLeaseRenewalIT
[INFO] Running org.apache.phoenix.monitoring.PhoenixLoggingMetricsIT
[INFO] Running org.apache.phoenix.monitoring.PhoenixMetricsIT
[INFO] Tests run: 4, Failures: 0, Errors: 0, Skipped: 0, Time elapsed: 45.499 s - in org.apache.phoenix.monitoring.PhoenixLoggingMetricsIT
[INFO] Running org.apache.phoenix.rpc.PhoenixClientRpcIT
[INFO] Tests run: 2, Failures: 0, Errors: 0, Skipped: 0, Time elapsed: 7.687 s - in org.apache.phoenix.rpc.PhoenixClientRpcIT
[INFO] Tests run: 21, Failures: 0, Errors: 0, Skipped: 0, Time elapsed: 109.536 s - in org.apache.phoenix.monitoring.PhoenixMetricsIT
[INFO] Tests run: 2, Failures: 0, Errors: 0, Skipped: 0, Time elapsed: 167.919 s - in org.apache.phoenix.iterate.ScannerLeaseRenewalIT
[INFO] Tests run: 25, Failures: 0, Errors: 0, Skipped: 0, Time elapsed: 482.046 s - in org.apache.phoenix.end2end.index.PartialIndexRebuilderIT
[INFO] Running org.apache.phoenix.rpc.PhoenixServerRpcIT
[INFO] Tests run: 2, Failures: 0, Errors: 0, Skipped: 0, Time elapsed: 19.987 s - in org.apache.phoenix.rpc.PhoenixServerRpcIT
[INFO] 
[INFO] Results:
[INFO] 
[ERROR] Errors: 
[ERROR]   StatsEnabledSplitSystemCatalogIT.testNonSaltedUpdatableViewWithIndex:109->testUpdatableViewWithIndex:161
» Runtime
[ERROR]   StatsEnabledSplitSystemCatalogIT.testNonSaltedUpdatableViewWithLocalIndex:114->testUpdatableViewWithIndex:161
» Runtime
[ERROR]   StatsEnabledSplitSystemCatalogIT.testReadOnlyOnReadOnlyView:198 » Runtime org....
[ERROR]   StatsEnabledSplitSystemCatalogIT.testSaltedUpdatableViewWithIndex:99->testUpdatableViewWithIndex:161
» Runtime
[ERROR]   StatsEnabledSplitSystemCatalogIT.testSaltedUpdatableViewWithLocalIndex:104->testUpdatableViewWithIndex:161
» Runtime
[ERROR]   StatsEnabledSplitSystemCatalogIT.testUpdatableOnUpdatableView:123 » Runtime or...
[ERROR]   ImmutableIndexIT.testDeleteFromNonPK:219 » Runtime org.apache.thrift.TExceptio...
[ERROR]   ImmutableIndexIT.testDeleteFromNonPK:219 » Runtime org.apache.thrift.TExceptio...
[ERROR]   ImmutableIndexIT.testDeleteFromNonPK:219 » Runtime org.apache.thrift.TExceptio...
[ERROR]   ImmutableIndexIT.testDeleteFromNonPK:219 » Runtime org.apache.thrift.TExceptio...
[ERROR]   ImmutableIndexIT.testDeleteFromPartialPK:177 » Runtime org.apache.thrift.TExce...
[ERROR]   ImmutableIndexIT.testDeleteFromPartialPK:177 » Runtime org.apache.thrift.TExce...
[ERROR]   ImmutableIndexIT.testDeleteFromPartialPK:177 » Runtime org.apache.thrift.TExce...
[ERROR]   ImmutableIndexIT.testDeleteFromPartialPK:177 » Runtime org.apache.thrift.TExce...
[ERROR]   ImmutableIndexIT.testDropIfImmutableKeyValueColumn:134 » Runtime org.apache.th...
[ERROR]   ImmutableIndexIT.testDropIfImmutableKeyValueColumn:134 » Runtime org.apache.th...
[ERROR]   ImmutableIndexIT.testDropIfImmutableKeyValueColumn:134 » Runtime org.apache.th...
[ERROR]   ImmutableIndexIT.testDropIfImmutableKeyValueColumn:134 » Runtime org.apache.th...
[ERROR]   MutableIndexReplicationIT.setUpBeforeClass:108->setupConfigsAndStartCluster:157
» IO
[INFO] 
[ERROR] Tests run: 718, Failures: 0, Errors: 19, Skipped: 44
[INFO] 
[INFO] 
[INFO] --- maven-failsafe-plugin:2.20:integration-test (SplitSystemCatalogTests) @ phoenix-core
---
[INFO] 
[INFO] -------------------------------------------------------
[INFO]  T E S T S
[INFO] -------------------------------------------------------
[INFO] Running org.apache.phoenix.end2end.AlterMultiTenantTableWithViewsIT
[INFO] Running org.apache.phoenix.end2end.AlterTableWithViewsIT
[INFO] Running org.apache.phoenix.end2end.TenantSpecificViewIndexSaltedIT
[INFO] Running org.apache.phoenix.end2end.TenantSpecificViewIndexIT
[INFO] Tests run: 9, Failures: 0, Errors: 0, Skipped: 0, Time elapsed: 139.984 s - in org.apache.phoenix.end2end.AlterMultiTenantTableWithViewsIT
[INFO] Tests run: 4, Failures: 0, Errors: 0, Skipped: 0, Time elapsed: 71.221 s - in org.apache.phoenix.end2end.TenantSpecificViewIndexSaltedIT
[INFO] Tests run: 10, Failures: 0, Errors: 0, Skipped: 0, Time elapsed: 167.472 s - in org.apache.phoenix.end2end.TenantSpecificViewIndexIT
[INFO] Running org.apache.phoenix.end2end.ViewIT
[INFO] Running org.apache.phoenix.end2end.index.ViewIndexIT
[WARNING] Tests run: 14, Failures: 0, Errors: 0, Skipped: 2, Time elapsed: 169.8 s - in org.apache.phoenix.end2end.index.ViewIndexIT
[INFO] Tests run: 52, Failures: 0, Errors: 0, Skipped: 0, Time elapsed: 575.461 s - in org.apache.phoenix.end2end.AlterTableWithViewsIT
[INFO] Tests run: 128, Failures: 0, Errors: 0, Skipped: 0, Time elapsed: 834.038 s - in org.apache.phoenix.end2end.ViewIT
[INFO] 
[INFO] Results:
[INFO] 
[WARNING] Tests run: 217, Failures: 0, Errors: 0, Skipped: 2
[INFO] 
[INFO] 
[INFO] --- maven-failsafe-plugin:2.20:verify (ParallelStatsEnabledTest) @ phoenix-core ---
[INFO] ------------------------------------------------------------------------
[INFO] Reactor Summary:
[INFO] 
[INFO] Apache Phoenix 4.14.0-HBase-1.3 .................... SUCCESS [  7.106 s]
[INFO] Phoenix Core ....................................... FAILURE [  04:15 h]
[INFO] Phoenix - Flume .................................... SKIPPED
[INFO] Phoenix - Kafka .................................... SKIPPED
[INFO] Phoenix - Pig ...................................... SKIPPED
[INFO] Phoenix Query Server Client ........................ SKIPPED
[INFO] Phoenix Query Server ............................... SKIPPED
[INFO] Phoenix - Pherf .................................... SKIPPED
[INFO] Phoenix - Spark .................................... SKIPPED
[INFO] Phoenix - Hive ..................................... SKIPPED
[INFO] Phoenix Client ..................................... SKIPPED
[INFO] Phoenix Server ..................................... SKIPPED
[INFO] Phoenix Assembly ................................... SKIPPED
[INFO] Phoenix - Tracing Web Application .................. SKIPPED
[INFO] Phoenix Load Balancer 4.14.0-HBase-1.3 ............. SKIPPED
[INFO] ------------------------------------------------------------------------
[INFO] BUILD FAILURE
[INFO] ------------------------------------------------------------------------
[INFO] Total time: 04:15 h
[INFO] Finished at: 2018-10-02T23:04:21Z
[INFO] ------------------------------------------------------------------------
[ERROR] Failed to execute goal org.apache.maven.plugins:maven-failsafe-plugin:2.20:verify
(ParallelStatsEnabledTest) on project phoenix-core: There are test failures.
[ERROR] 
[ERROR] Please refer to <https://builds.apache.org/job/Phoenix-4.x-HBase-1.3/ws/phoenix-core/target/failsafe-reports>
for the individual test results.
[ERROR] Please refer to dump files (if any exist) [date]-jvmRun[N].dump, [date].dumpstream
and [date]-jvmRun[N].dumpstream.
[ERROR] -> [Help 1]
[ERROR] 
[ERROR] To see the full stack trace of the errors, re-run Maven with the -e switch.
[ERROR] Re-run Maven using the -X switch to enable full debug logging.
[ERROR] 
[ERROR] For more information about the errors and possible solutions, please read the following
articles:
[ERROR] [Help 1] http://cwiki.apache.org/confluence/display/MAVEN/MojoFailureException
[ERROR] 
[ERROR] After correcting the problems, you can resume the build with the command
[ERROR]   mvn <goals> -rf :phoenix-core
Build step 'Invoke top-level Maven targets' marked build as failure
Archiving artifacts
[JIRA] Updating issue PHOENIX-4519
Recording test results

Mime
View raw message