phoenix-commits mailing list archives

Site index · List index
Message view « Date » · « Thread »
Top « Date » · « Thread »
From Apache Jenkins Server <jenk...@builds.apache.org>
Subject Build failed in Jenkins: Phoenix-omid2 #119
Date Thu, 11 Oct 2018 23:54:16 GMT
See <https://builds.apache.org/job/Phoenix-omid2/119/display/redirect>

------------------------------------------
Started by user mujtaba
[EnvInject] - Loading node environment variables.
Building remotely on ubuntu-eu3 (ubuntu xenial) in workspace <https://builds.apache.org/job/Phoenix-omid2/ws/>
Cloning the remote Git repository
Cloning repository https://git-wip-us.apache.org/repos/asf/phoenix.git
 > git init <https://builds.apache.org/job/Phoenix-omid2/ws/> # timeout=10
Fetching upstream changes from https://git-wip-us.apache.org/repos/asf/phoenix.git
 > git --version # timeout=10
 > git fetch --tags --progress https://git-wip-us.apache.org/repos/asf/phoenix.git +refs/heads/*:refs/remotes/origin/*
 > git config remote.origin.url https://git-wip-us.apache.org/repos/asf/phoenix.git # timeout=10
 > git config --add remote.origin.fetch +refs/heads/*:refs/remotes/origin/* # timeout=10
 > git config remote.origin.url https://git-wip-us.apache.org/repos/asf/phoenix.git # timeout=10
Fetching upstream changes from https://git-wip-us.apache.org/repos/asf/phoenix.git
 > git fetch --tags --progress https://git-wip-us.apache.org/repos/asf/phoenix.git +refs/heads/*:refs/remotes/origin/*
 > git rev-parse origin/omid2^{commit} # timeout=10
Checking out Revision c6a45bcf1e842fb8261ae1bdfd6a9283a2763cae (origin/omid2)
 > git config core.sparsecheckout # timeout=10
 > git checkout -f c6a45bcf1e842fb8261ae1bdfd6a9283a2763cae
Commit message: "Merge branch '4.x-HBase-1.3' into omid2"
 > git rev-list --no-walk c6a45bcf1e842fb8261ae1bdfd6a9283a2763cae # timeout=10
No emails were triggered.
[EnvInject] - Executing scripts and injecting environment variables after the SCM step.
[EnvInject] - Injecting as environment variables the properties content 
MAVEN_OPTS=-Xmx3G

[EnvInject] - Variables injected successfully.
[Phoenix-omid2] $ /bin/bash -xe /tmp/jenkins5661293419469929423.sh
+ rm -rf inomid
+ git clone https://git-wip-us.apache.org/repos/asf/incubator-omid.git inomid
Cloning into 'inomid'...
+ cd inomid
+ git checkout phoenix-integration
Switched to a new branch 'phoenix-integration'
Branch phoenix-integration set up to track remote branch phoenix-integration from origin.
+ /home/jenkins/tools/maven/latest3/bin/mvn install -DskipTests -P hbase-1
[INFO] Scanning for projects...
Downloading from central: https://repo.maven.apache.org/maven2/org/apache/hbase/hbase-client/1.2.5/hbase-client-1.2.5.pom
[ERROR] [ERROR] Some problems were encountered while processing the POMs:
[ERROR] Unresolveable build extension: Plugin org.apache.hbase:hbase-client:1.2.5 or one of
its dependencies could not be resolved: Failed to read artifact descriptor for org.apache.hbase:hbase-client:jar:1.2.5
@ 
 @ 
[ERROR] The build could not read 1 project -> [Help 1]
[ERROR]   
[ERROR]   The project org.apache.omid:omid:0.8.2.11-SNAPSHOT (<https://builds.apache.org/job/Phoenix-omid2/ws/inomid/pom.xml)>
has 1 error
[ERROR]     Unresolveable build extension: Plugin org.apache.hbase:hbase-client:1.2.5 or one
of its dependencies could not be resolved: Failed to read artifact descriptor for org.apache.hbase:hbase-client:jar:1.2.5:
Could not transfer artifact org.apache.hbase:hbase-client:pom:1.2.5 from/to central (https://repo.maven.apache.org/maven2):
Received fatal alert: protocol_version -> [Help 2]
[ERROR] 
[ERROR] To see the full stack trace of the errors, re-run Maven with the -e switch.
[ERROR] Re-run Maven using the -X switch to enable full debug logging.
[ERROR] 
[ERROR] For more information about the errors and possible solutions, please read the following
articles:
[ERROR] [Help 1] http://cwiki.apache.org/confluence/display/MAVEN/ProjectBuildingException
[ERROR] [Help 2] http://cwiki.apache.org/confluence/display/MAVEN/PluginManagerException
Build step 'Execute shell' marked build as failure
Archiving artifacts
Recording test results
ERROR: Step ‘Publish JUnit test result report’ failed: No test report files were found.
Configuration error?
Not sending mail to unregistered user ankitsinghal59@gmail.com
Not sending mail to unregistered user k.mehta@salesforce.com

Mime
View raw message