phoenix-commits mailing list archives

Site index · List index
Message view « Date » · « Thread »
Top « Date » · « Thread »
From Apache Jenkins Server <jenk...@builds.apache.org>
Subject Build failed in Jenkins: Phoenix-4.x-HBase-1.3 #243
Date Sat, 27 Oct 2018 02:06:49 GMT
See <https://builds.apache.org/job/Phoenix-4.x-HBase-1.3/243/display/redirect?page=changes>

Changes:

[karanmehta93] PHOENIX-4764 Cleanup metadata of child views for a base table that has

------------------------------------------
[...truncated 137.02 KB...]

[ERROR] testMetadataAlterRemainsAutoUpgradeDisabled(org.apache.phoenix.end2end.SystemCatalogCreationOnConnectionIT)
 Time elapsed: 69.179 s  <<< FAILURE!
java.lang.AssertionError: expected:<[SYSTEM.CATALOG, SYSTEM.SEQUENCE, SYSTEM.MUTEX, SYSTEM.CHILD_LINK,
SYSTEM.STATS, SYSTEM.FUNCTION, SYSTEM.LOG]> but was:<[SYSTEM.CATALOG, SYSTEM.SEQUENCE,
SYSTEM.MUTEX, SYSTEM.CHILD_LINK, SYSTEM.FUNCTION, SYSTEM.STATS, SYSTEM.TASK, SYSTEM.LOG]>
	at org.apache.phoenix.end2end.SystemCatalogCreationOnConnectionIT.firstConnectionAutoUpgradeDisabled(SystemCatalogCreationOnConnectionIT.java:542)
	at org.apache.phoenix.end2end.SystemCatalogCreationOnConnectionIT.firstConnectionAutoUpgradeToggle(SystemCatalogCreationOnConnectionIT.java:509)
	at org.apache.phoenix.end2end.SystemCatalogCreationOnConnectionIT.testMetadataAlterRemainsAutoUpgradeDisabled(SystemCatalogCreationOnConnectionIT.java:417)

[ERROR] testMigrateSysCatCreateOthers(org.apache.phoenix.end2end.SystemCatalogCreationOnConnectionIT)
 Time elapsed: 80.122 s  <<< FAILURE!
java.lang.AssertionError: expected:<[SYSTEM:STATS, SYSTEM:CATALOG, SYSTEM:FUNCTION, SYSTEM:LOG,
SYSTEM:MUTEX, SYSTEM:CHILD_LINK, SYSTEM:SEQUENCE]> but was:<[SYSTEM:STATS, SYSTEM:CATALOG,
SYSTEM:FUNCTION, SYSTEM:LOG, SYSTEM:CHILD_LINK, SYSTEM:MUTEX, SYSTEM:SEQUENCE, SYSTEM:TASK]>
	at org.apache.phoenix.end2end.SystemCatalogCreationOnConnectionIT.testMigrateSysCatCreateOthers(SystemCatalogCreationOnConnectionIT.java:269)

[ERROR] testUpgradeNotAllowed(org.apache.phoenix.end2end.SystemCatalogCreationOnConnectionIT)
 Time elapsed: 70.234 s  <<< FAILURE!
java.lang.AssertionError: expected:<[SYSTEM:STATS, SYSTEM:CATALOG, SYSTEM:FUNCTION, SYSTEM:LOG,
SYSTEM:MUTEX, SYSTEM:CHILD_LINK, SYSTEM:SEQUENCE]> but was:<[SYSTEM:STATS, SYSTEM:CATALOG,
SYSTEM:FUNCTION, SYSTEM:LOG, SYSTEM:CHILD_LINK, SYSTEM:MUTEX, SYSTEM:SEQUENCE, SYSTEM:TASK]>
	at org.apache.phoenix.end2end.SystemCatalogCreationOnConnectionIT.firstConnectionNSMappingServerEnabledClientEnabled(SystemCatalogCreationOnConnectionIT.java:557)
	at org.apache.phoenix.end2end.SystemCatalogCreationOnConnectionIT.testUpgradeNotAllowed(SystemCatalogCreationOnConnectionIT.java:232)

[ERROR] testTablesExistInconsistentNSMappingFails(org.apache.phoenix.end2end.SystemCatalogCreationOnConnectionIT)
 Time elapsed: 80.07 s  <<< FAILURE!
java.lang.AssertionError: expected:<[SYSTEM:STATS, SYSTEM:CATALOG, SYSTEM:FUNCTION, SYSTEM:LOG,
SYSTEM:MUTEX, SYSTEM:CHILD_LINK, SYSTEM:SEQUENCE]> but was:<[SYSTEM:STATS, SYSTEM:CATALOG,
SYSTEM:FUNCTION, SYSTEM:LOG, SYSTEM:CHILD_LINK, SYSTEM:MUTEX, SYSTEM:SEQUENCE, SYSTEM:TASK]>
	at org.apache.phoenix.end2end.SystemCatalogCreationOnConnectionIT.firstConnectionNSMappingServerEnabledClientEnabled(SystemCatalogCreationOnConnectionIT.java:557)
	at org.apache.phoenix.end2end.SystemCatalogCreationOnConnectionIT.testTablesExistInconsistentNSMappingFails(SystemCatalogCreationOnConnectionIT.java:299)

[ERROR] testUpgradeAttempted(org.apache.phoenix.end2end.SystemCatalogCreationOnConnectionIT)
 Time elapsed: 69.561 s  <<< FAILURE!
java.lang.AssertionError: expected:<[SYSTEM:STATS, SYSTEM:CATALOG, SYSTEM:FUNCTION, SYSTEM:LOG,
SYSTEM:MUTEX, SYSTEM:CHILD_LINK, SYSTEM:SEQUENCE]> but was:<[SYSTEM:STATS, SYSTEM:CATALOG,
SYSTEM:FUNCTION, SYSTEM:LOG, SYSTEM:CHILD_LINK, SYSTEM:MUTEX, SYSTEM:SEQUENCE, SYSTEM:TASK]>
	at org.apache.phoenix.end2end.SystemCatalogCreationOnConnectionIT.firstConnectionNSMappingServerEnabledClientEnabled(SystemCatalogCreationOnConnectionIT.java:557)
	at org.apache.phoenix.end2end.SystemCatalogCreationOnConnectionIT.testUpgradeAttempted(SystemCatalogCreationOnConnectionIT.java:211)

[ERROR] testMigrateToSystemNamespace(org.apache.phoenix.end2end.SystemCatalogCreationOnConnectionIT)
 Time elapsed: 70.055 s  <<< FAILURE!
java.lang.AssertionError: expected:<[SYSTEM.CATALOG, SYSTEM.SEQUENCE, SYSTEM.MUTEX, SYSTEM.CHILD_LINK,
SYSTEM.STATS, SYSTEM.FUNCTION, SYSTEM.LOG]> but was:<[SYSTEM.CATALOG, SYSTEM.SEQUENCE,
SYSTEM.MUTEX, SYSTEM.CHILD_LINK, SYSTEM.FUNCTION, SYSTEM.STATS, SYSTEM.TASK, SYSTEM.LOG]>
	at org.apache.phoenix.end2end.SystemCatalogCreationOnConnectionIT.firstConnectionNSMappingServerEnabledClientEnabledMappingDisabled(SystemCatalogCreationOnConnectionIT.java:574)
	at org.apache.phoenix.end2end.SystemCatalogCreationOnConnectionIT.testMigrateToSystemNamespace(SystemCatalogCreationOnConnectionIT.java:193)

[ERROR] testSysTablesExistInconsistentNSMappingFails(org.apache.phoenix.end2end.SystemCatalogCreationOnConnectionIT)
 Time elapsed: 70.262 s  <<< FAILURE!
java.lang.AssertionError: expected:<[SYSTEM.CATALOG, SYSTEM.SEQUENCE, SYSTEM.MUTEX, SYSTEM.CHILD_LINK,
SYSTEM.STATS, SYSTEM.FUNCTION, SYSTEM.LOG]> but was:<[SYSTEM.CATALOG, SYSTEM.SEQUENCE,
SYSTEM.MUTEX, SYSTEM.CHILD_LINK, SYSTEM.FUNCTION, SYSTEM.STATS, SYSTEM.TASK, SYSTEM.LOG]>
	at org.apache.phoenix.end2end.SystemCatalogCreationOnConnectionIT.firstConnectionNSMappingServerDisabledClientDisabled(SystemCatalogCreationOnConnectionIT.java:634)
	at org.apache.phoenix.end2end.SystemCatalogCreationOnConnectionIT.testSysTablesExistInconsistentNSMappingFails(SystemCatalogCreationOnConnectionIT.java:340)

[ERROR] testMigrateToSystemNamespaceAndUpgradeSysCat(org.apache.phoenix.end2end.SystemCatalogCreationOnConnectionIT)
 Time elapsed: 68.004 s  <<< FAILURE!
java.lang.AssertionError: expected:<[SYSTEM.CATALOG, SYSTEM.SEQUENCE, SYSTEM.MUTEX, SYSTEM.CHILD_LINK,
SYSTEM.STATS, SYSTEM.FUNCTION, SYSTEM.LOG]> but was:<[SYSTEM.CATALOG, SYSTEM.SEQUENCE,
SYSTEM.MUTEX, SYSTEM.CHILD_LINK, SYSTEM.FUNCTION, SYSTEM.STATS, SYSTEM.TASK, SYSTEM.LOG]>
	at org.apache.phoenix.end2end.SystemCatalogCreationOnConnectionIT.firstConnectionNSMappingServerEnabledClientEnabledMappingDisabled(SystemCatalogCreationOnConnectionIT.java:574)
	at org.apache.phoenix.end2end.SystemCatalogCreationOnConnectionIT.testMigrateToSystemNamespaceAndUpgradeSysCat(SystemCatalogCreationOnConnectionIT.java:282)

[ERROR] testNSMappingDisabledNoUpgradeRequired(org.apache.phoenix.end2end.SystemCatalogCreationOnConnectionIT)
 Time elapsed: 67.276 s  <<< FAILURE!
java.lang.AssertionError: expected:<[SYSTEM.CATALOG, SYSTEM.SEQUENCE, SYSTEM.MUTEX, SYSTEM.CHILD_LINK,
SYSTEM.STATS, SYSTEM.FUNCTION, SYSTEM.LOG]> but was:<[SYSTEM.CATALOG, SYSTEM.SEQUENCE,
SYSTEM.MUTEX, SYSTEM.CHILD_LINK, SYSTEM.FUNCTION, SYSTEM.STATS, SYSTEM.TASK, SYSTEM.LOG]>
	at org.apache.phoenix.end2end.SystemCatalogCreationOnConnectionIT.firstConnectionNSMappingServerDisabledClientDisabled(SystemCatalogCreationOnConnectionIT.java:634)
	at org.apache.phoenix.end2end.SystemCatalogCreationOnConnectionIT.testNSMappingDisabledNoUpgradeRequired(SystemCatalogCreationOnConnectionIT.java:381)

[INFO] Running org.apache.phoenix.end2end.index.MutableIndexFailureIT
[INFO] Tests run: 4, Failures: 0, Errors: 0, Skipped: 0, Time elapsed: 684.568 s - in org.apache.phoenix.end2end.TableDDLPermissionsIT
[INFO] Running org.apache.phoenix.end2end.index.MutableIndexFailureWithNamespaceIT
[WARNING] Tests run: 40, Failures: 0, Errors: 0, Skipped: 16, Time elapsed: 448.535 s - in
org.apache.phoenix.end2end.index.ImmutableIndexIT
[INFO] Running org.apache.phoenix.end2end.index.MutableIndexRebuilderIT
[INFO] Tests run: 1, Failures: 0, Errors: 0, Skipped: 0, Time elapsed: 74.104 s - in org.apache.phoenix.end2end.index.MutableIndexRebuilderIT
[INFO] Tests run: 7, Failures: 0, Errors: 0, Skipped: 0, Time elapsed: 173.78 s - in org.apache.phoenix.end2end.index.MutableIndexFailureWithNamespaceIT
[INFO] Tests run: 13, Failures: 0, Errors: 0, Skipped: 0, Time elapsed: 260.543 s - in org.apache.phoenix.end2end.index.MutableIndexFailureIT
[INFO] Running org.apache.phoenix.end2end.index.MutableIndexReplicationIT
[INFO] Running org.apache.phoenix.end2end.index.PartialIndexRebuilderIT
[INFO] Running org.apache.phoenix.end2end.index.PhoenixMRJobSubmitterIT
[INFO] Tests run: 1, Failures: 0, Errors: 0, Skipped: 0, Time elapsed: 43.906 s - in org.apache.phoenix.end2end.index.MutableIndexReplicationIT
[INFO] Tests run: 1, Failures: 0, Errors: 0, Skipped: 0, Time elapsed: 14.024 s - in org.apache.phoenix.end2end.index.PhoenixMRJobSubmitterIT
[INFO] Running org.apache.phoenix.end2end.index.txn.TxWriteFailureIT
[INFO] Running org.apache.phoenix.execute.PartialCommitIT
[INFO] Tests run: 44, Failures: 0, Errors: 0, Skipped: 0, Time elapsed: 642.225 s - in org.apache.phoenix.end2end.index.LocalIndexIT
[INFO] Tests run: 8, Failures: 0, Errors: 0, Skipped: 0, Time elapsed: 67.828 s - in org.apache.phoenix.end2end.index.txn.TxWriteFailureIT
[INFO] Running org.apache.phoenix.hbase.index.FailForUnsupportedHBaseVersionsIT
[INFO] Tests run: 6, Failures: 0, Errors: 0, Skipped: 0, Time elapsed: 90.244 s - in org.apache.phoenix.execute.PartialCommitIT
[INFO] Tests run: 2, Failures: 0, Errors: 0, Skipped: 0, Time elapsed: 35.974 s - in org.apache.phoenix.hbase.index.FailForUnsupportedHBaseVersionsIT
[INFO] Running org.apache.phoenix.execute.UpsertSelectOverlappingBatchesIT
[INFO] Running org.apache.phoenix.iterate.RoundRobinResultIteratorWithStatsIT
[INFO] Tests run: 1, Failures: 0, Errors: 0, Skipped: 0, Time elapsed: 7.213 s - in org.apache.phoenix.iterate.RoundRobinResultIteratorWithStatsIT
[INFO] Running org.apache.phoenix.iterate.ScannerLeaseRenewalIT
[INFO] Tests run: 3, Failures: 0, Errors: 0, Skipped: 0, Time elapsed: 86.491 s - in org.apache.phoenix.execute.UpsertSelectOverlappingBatchesIT
[INFO] Running org.apache.phoenix.monitoring.PhoenixLoggingMetricsIT
[INFO] Running org.apache.phoenix.monitoring.PhoenixMetricsIT
[INFO] Tests run: 4, Failures: 0, Errors: 0, Skipped: 0, Time elapsed: 46.276 s - in org.apache.phoenix.monitoring.PhoenixLoggingMetricsIT
[INFO] Tests run: 2, Failures: 0, Errors: 0, Skipped: 0, Time elapsed: 169.887 s - in org.apache.phoenix.iterate.ScannerLeaseRenewalIT
[INFO] Running org.apache.phoenix.rpc.PhoenixClientRpcIT
[INFO] Tests run: 2, Failures: 0, Errors: 0, Skipped: 0, Time elapsed: 13.765 s - in org.apache.phoenix.rpc.PhoenixClientRpcIT
[INFO] Tests run: 21, Failures: 0, Errors: 0, Skipped: 0, Time elapsed: 140.014 s - in org.apache.phoenix.monitoring.PhoenixMetricsIT
[INFO] Running org.apache.phoenix.rpc.PhoenixServerRpcIT
[INFO] Tests run: 2, Failures: 0, Errors: 0, Skipped: 0, Time elapsed: 29.002 s - in org.apache.phoenix.rpc.PhoenixServerRpcIT
[INFO] Tests run: 25, Failures: 0, Errors: 0, Skipped: 0, Time elapsed: 711.876 s - in org.apache.phoenix.end2end.index.PartialIndexRebuilderIT
[INFO] 
[INFO] Results:
[INFO] 
[ERROR] Failures: 
[ERROR]   MigrateSystemTablesToSystemNamespaceIT.oldClientsAfterSystemTableMigrationShouldFail:179
[ERROR]   MigrateSystemTablesToSystemNamespaceIT.onlyOneClientCanMigrate:214
[ERROR]   SystemCatalogCreationOnConnectionIT.testMetadataAlterRemainsAutoUpgradeDisabled:417->firstConnectionAutoUpgradeToggle:509->firstConnectionAutoUpgradeDisabled:542
expected:<[SYSTEM.CATALOG, SYSTEM.SEQUENCE, SYSTEM.MUTEX, SYSTEM.CHILD_LINK, SYSTEM.STATS,
SYSTEM.FUNCTION, SYSTEM.LOG]> but was:<[SYSTEM.CATALOG, SYSTEM.SEQUENCE, SYSTEM.MUTEX,
SYSTEM.CHILD_LINK, SYSTEM.FUNCTION, SYSTEM.STATS, SYSTEM.TASK, SYSTEM.LOG]>
[ERROR]   SystemCatalogCreationOnConnectionIT.testMetadataAlterRemainsAutoUpgradeEnabled:427->firstConnectionAutoUpgradeToggle:507->firstConnectionNSMappingServerDisabledClientDisabled:634
expected:<[SYSTEM.CATALOG, SYSTEM.SEQUENCE, SYSTEM.MUTEX, SYSTEM.CHILD_LINK, SYSTEM.STATS,
SYSTEM.FUNCTION, SYSTEM.LOG]> but was:<[SYSTEM.CATALOG, SYSTEM.SEQUENCE, SYSTEM.MUTEX,
SYSTEM.CHILD_LINK, SYSTEM.FUNCTION, SYSTEM.STATS, SYSTEM.TASK, SYSTEM.LOG]>
[ERROR]   SystemCatalogCreationOnConnectionIT.testMigrateSysCatCreateOthers:269 expected:<[SYSTEM:STATS,
SYSTEM:CATALOG, SYSTEM:FUNCTION, SYSTEM:LOG, SYSTEM:MUTEX, SYSTEM:CHILD_LINK, SYSTEM:SEQUENCE]>
but was:<[SYSTEM:STATS, SYSTEM:CATALOG, SYSTEM:FUNCTION, SYSTEM:LOG, SYSTEM:CHILD_LINK,
SYSTEM:MUTEX, SYSTEM:SEQUENCE, SYSTEM:TASK]>
[ERROR]   SystemCatalogCreationOnConnectionIT.testMigrateToSystemNamespace:193->firstConnectionNSMappingServerEnabledClientEnabledMappingDisabled:574
expected:<[SYSTEM.CATALOG, SYSTEM.SEQUENCE, SYSTEM.MUTEX, SYSTEM.CHILD_LINK, SYSTEM.STATS,
SYSTEM.FUNCTION, SYSTEM.LOG]> but was:<[SYSTEM.CATALOG, SYSTEM.SEQUENCE, SYSTEM.MUTEX,
SYSTEM.CHILD_LINK, SYSTEM.FUNCTION, SYSTEM.STATS, SYSTEM.TASK, SYSTEM.LOG]>
[ERROR]   SystemCatalogCreationOnConnectionIT.testMigrateToSystemNamespaceAndUpgradeSysCat:282->firstConnectionNSMappingServerEnabledClientEnabledMappingDisabled:574
expected:<[SYSTEM.CATALOG, SYSTEM.SEQUENCE, SYSTEM.MUTEX, SYSTEM.CHILD_LINK, SYSTEM.STATS,
SYSTEM.FUNCTION, SYSTEM.LOG]> but was:<[SYSTEM.CATALOG, SYSTEM.SEQUENCE, SYSTEM.MUTEX,
SYSTEM.CHILD_LINK, SYSTEM.FUNCTION, SYSTEM.STATS, SYSTEM.TASK, SYSTEM.LOG]>
[ERROR]   SystemCatalogCreationOnConnectionIT.testNSMappingDisabledNoUpgradeRequired:381->firstConnectionNSMappingServerDisabledClientDisabled:634
expected:<[SYSTEM.CATALOG, SYSTEM.SEQUENCE, SYSTEM.MUTEX, SYSTEM.CHILD_LINK, SYSTEM.STATS,
SYSTEM.FUNCTION, SYSTEM.LOG]> but was:<[SYSTEM.CATALOG, SYSTEM.SEQUENCE, SYSTEM.MUTEX,
SYSTEM.CHILD_LINK, SYSTEM.FUNCTION, SYSTEM.STATS, SYSTEM.TASK, SYSTEM.LOG]>
[ERROR]   SystemCatalogCreationOnConnectionIT.testSysTablesExistInconsistentNSMappingFails:340->firstConnectionNSMappingServerDisabledClientDisabled:634
expected:<[SYSTEM.CATALOG, SYSTEM.SEQUENCE, SYSTEM.MUTEX, SYSTEM.CHILD_LINK, SYSTEM.STATS,
SYSTEM.FUNCTION, SYSTEM.LOG]> but was:<[SYSTEM.CATALOG, SYSTEM.SEQUENCE, SYSTEM.MUTEX,
SYSTEM.CHILD_LINK, SYSTEM.FUNCTION, SYSTEM.STATS, SYSTEM.TASK, SYSTEM.LOG]>
[ERROR]   SystemCatalogCreationOnConnectionIT.testTablesExistInconsistentNSMappingFails:299->firstConnectionNSMappingServerEnabledClientEnabled:557
expected:<[SYSTEM:STATS, SYSTEM:CATALOG, SYSTEM:FUNCTION, SYSTEM:LOG, SYSTEM:MUTEX, SYSTEM:CHILD_LINK,
SYSTEM:SEQUENCE]> but was:<[SYSTEM:STATS, SYSTEM:CATALOG, SYSTEM:FUNCTION, SYSTEM:LOG,
SYSTEM:CHILD_LINK, SYSTEM:MUTEX, SYSTEM:SEQUENCE, SYSTEM:TASK]>
[ERROR]   SystemCatalogCreationOnConnectionIT.testUpgradeAttempted:211->firstConnectionNSMappingServerEnabledClientEnabled:557
expected:<[SYSTEM:STATS, SYSTEM:CATALOG, SYSTEM:FUNCTION, SYSTEM:LOG, SYSTEM:MUTEX, SYSTEM:CHILD_LINK,
SYSTEM:SEQUENCE]> but was:<[SYSTEM:STATS, SYSTEM:CATALOG, SYSTEM:FUNCTION, SYSTEM:LOG,
SYSTEM:CHILD_LINK, SYSTEM:MUTEX, SYSTEM:SEQUENCE, SYSTEM:TASK]>
[ERROR]   SystemCatalogCreationOnConnectionIT.testUpgradeNotAllowed:232->firstConnectionNSMappingServerEnabledClientEnabled:557
expected:<[SYSTEM:STATS, SYSTEM:CATALOG, SYSTEM:FUNCTION, SYSTEM:LOG, SYSTEM:MUTEX, SYSTEM:CHILD_LINK,
SYSTEM:SEQUENCE]> but was:<[SYSTEM:STATS, SYSTEM:CATALOG, SYSTEM:FUNCTION, SYSTEM:LOG,
SYSTEM:CHILD_LINK, SYSTEM:MUTEX, SYSTEM:SEQUENCE, SYSTEM:TASK]>
[ERROR] Errors: 
[ERROR]   IndexToolIT.testSecondaryIndex:150 » Runtime org.apache.thrift.TException: Una...
[ERROR]   IndexToolIT.testSecondaryIndex:150 » Runtime org.apache.thrift.TException: Una...
[ERROR]   IndexToolIT.testSecondaryIndex:150 » Runtime org.apache.thrift.TException: Una...
[ERROR]   IndexToolIT.testSecondaryIndex:150 » Runtime org.apache.thrift.TException: Una...
[ERROR]   IndexToolIT.testSecondaryIndex:150 » Runtime org.apache.thrift.TException: Una...
[ERROR]   IndexToolIT.testSecondaryIndex:150 » Runtime org.apache.thrift.TException: Una...
[ERROR]   IndexToolIT.testSecondaryIndex:150 » Runtime org.apache.thrift.TException: Una...
[ERROR]   IndexToolIT.testSecondaryIndex:150 » Runtime org.apache.thrift.TException: Una...
[ERROR]   IndexToolIT.testSecondaryIndex:150 » Runtime org.apache.thrift.TException: Una...
[ERROR]   IndexToolIT.testSecondaryIndex:150 » Runtime org.apache.thrift.TException: Una...
[ERROR]   IndexToolIT.testSecondaryIndex:150 » Runtime org.apache.thrift.TException: Una...
[ERROR]   IndexToolIT.testSecondaryIndex:150 » Runtime org.apache.thrift.TException: Una...
[ERROR]   IndexToolIT.testSecondaryIndex:150 » Runtime org.apache.thrift.TException: Una...
[ERROR]   IndexToolIT.testSecondaryIndex:150 » Runtime org.apache.thrift.TException: Una...
[ERROR]   IndexToolIT.testSecondaryIndex:150 » Runtime org.apache.thrift.TException: Una...
[ERROR]   IndexToolIT.testSecondaryIndex:150 » Runtime org.apache.thrift.TException: Una...
[INFO] 
[ERROR] Tests run: 717, Failures: 12, Errors: 16, Skipped: 44
[INFO] 
[INFO] 
[INFO] --- maven-failsafe-plugin:2.20:integration-test (SplitSystemCatalogTests) @ phoenix-core
---
[INFO] 
[INFO] -------------------------------------------------------
[INFO]  T E S T S
[INFO] -------------------------------------------------------
[INFO] Running org.apache.phoenix.end2end.AlterTableWithViewsIT
[INFO] Running org.apache.phoenix.end2end.AlterMultiTenantTableWithViewsIT
[INFO] Running org.apache.phoenix.end2end.DropTableWithViewsIT
[INFO] Tests run: 4, Failures: 0, Errors: 0, Skipped: 0, Time elapsed: 70.938 s - in org.apache.phoenix.end2end.DropTableWithViewsIT
[INFO] Running org.apache.phoenix.end2end.TenantSpecificViewIndexIT
[INFO] Tests run: 9, Failures: 0, Errors: 0, Skipped: 0, Time elapsed: 153.986 s - in org.apache.phoenix.end2end.AlterMultiTenantTableWithViewsIT
[INFO] Running org.apache.phoenix.end2end.TenantSpecificViewIndexSaltedIT
[INFO] Tests run: 10, Failures: 0, Errors: 0, Skipped: 0, Time elapsed: 203.416 s - in org.apache.phoenix.end2end.TenantSpecificViewIndexIT
[INFO] Running org.apache.phoenix.end2end.ViewIT
[INFO] Tests run: 4, Failures: 0, Errors: 0, Skipped: 0, Time elapsed: 81.018 s - in org.apache.phoenix.end2end.TenantSpecificViewIndexSaltedIT
[INFO] Running org.apache.phoenix.end2end.index.ViewIndexIT
[WARNING] Tests run: 14, Failures: 0, Errors: 0, Skipped: 2, Time elapsed: 148.727 s - in
org.apache.phoenix.end2end.index.ViewIndexIT
[ERROR] Tests run: 128, Failures: 0, Errors: 1, Skipped: 0, Time elapsed: 790.276 s <<<
FAILURE! - in org.apache.phoenix.end2end.ViewIT
[ERROR] testRecreateDroppedTableWithChildViews[ViewIT_transactionProvider=TEPHRA, columnEncoded=false](org.apache.phoenix.end2end.ViewIT)
 Time elapsed: 6.583 s  <<< ERROR!
org.apache.phoenix.schema.TableNotFoundException: ERROR 1012 (42M03): Table undefined.
	at org.apache.phoenix.end2end.ViewIT.testRecreateDroppedTableWithChildViews(ViewIT.java:520)

[ERROR] Tests run: 104, Failures: 0, Errors: 8, Skipped: 0, Time elapsed: 1,206.019 s <<<
FAILURE! - in org.apache.phoenix.end2end.AlterTableWithViewsIT
[ERROR] testMakeBaseTableTransactional[AlterTableWithViewsIT_columnEncoded=false, multiTenant=false,
salted=false](org.apache.phoenix.end2end.AlterTableWithViewsIT)  Time elapsed: 15.637 s  <<<
ERROR!
java.lang.RuntimeException: org.apache.thrift.TException: Unable to discover transaction service.
	at org.apache.phoenix.end2end.AlterTableWithViewsIT.testMakeBaseTableTransactional(AlterTableWithViewsIT.java:946)
Caused by: org.apache.thrift.TException: Unable to discover transaction service.
	at org.apache.phoenix.end2end.AlterTableWithViewsIT.testMakeBaseTableTransactional(AlterTableWithViewsIT.java:946)

[ERROR] testMakeBaseTableTransactional[AlterTableWithViewsIT_columnEncoded=false, multiTenant=false,
salted=true](org.apache.phoenix.end2end.AlterTableWithViewsIT)  Time elapsed: 13.081 s  <<<
ERROR!
java.lang.RuntimeException: org.apache.thrift.TException: Unable to discover transaction service.
	at org.apache.phoenix.end2end.AlterTableWithViewsIT.testMakeBaseTableTransactional(AlterTableWithViewsIT.java:946)
Caused by: org.apache.thrift.TException: Unable to discover transaction service.
	at org.apache.phoenix.end2end.AlterTableWithViewsIT.testMakeBaseTableTransactional(AlterTableWithViewsIT.java:946)

[ERROR] testMakeBaseTableTransactional[AlterTableWithViewsIT_columnEncoded=false, multiTenant=true,
salted=false](org.apache.phoenix.end2end.AlterTableWithViewsIT)  Time elapsed: 17.128 s  <<<
ERROR!
java.lang.RuntimeException: org.apache.thrift.TException: Unable to discover transaction service.
	at org.apache.phoenix.end2end.AlterTableWithViewsIT.testMakeBaseTableTransactional(AlterTableWithViewsIT.java:946)
Caused by: org.apache.thrift.TException: Unable to discover transaction service.
	at org.apache.phoenix.end2end.AlterTableWithViewsIT.testMakeBaseTableTransactional(AlterTableWithViewsIT.java:946)

[ERROR] testMakeBaseTableTransactional[AlterTableWithViewsIT_columnEncoded=false, multiTenant=true,
salted=true](org.apache.phoenix.end2end.AlterTableWithViewsIT)  Time elapsed: 15.098 s  <<<
ERROR!
java.lang.RuntimeException: org.apache.thrift.TException: Unable to discover transaction service.
	at org.apache.phoenix.end2end.AlterTableWithViewsIT.testMakeBaseTableTransactional(AlterTableWithViewsIT.java:946)
Caused by: org.apache.thrift.TException: Unable to discover transaction service.
	at org.apache.phoenix.end2end.AlterTableWithViewsIT.testMakeBaseTableTransactional(AlterTableWithViewsIT.java:946)

[ERROR] testMakeBaseTableTransactional[AlterTableWithViewsIT_columnEncoded=true, multiTenant=false,
salted=false](org.apache.phoenix.end2end.AlterTableWithViewsIT)  Time elapsed: 12.812 s  <<<
ERROR!
java.lang.RuntimeException: org.apache.thrift.TException: Unable to discover transaction service.
	at org.apache.phoenix.end2end.AlterTableWithViewsIT.testMakeBaseTableTransactional(AlterTableWithViewsIT.java:946)
Caused by: org.apache.thrift.TException: Unable to discover transaction service.
	at org.apache.phoenix.end2end.AlterTableWithViewsIT.testMakeBaseTableTransactional(AlterTableWithViewsIT.java:946)

[ERROR] testMakeBaseTableTransactional[AlterTableWithViewsIT_columnEncoded=true, multiTenant=false,
salted=true](org.apache.phoenix.end2end.AlterTableWithViewsIT)  Time elapsed: 14.77 s  <<<
ERROR!
java.lang.RuntimeException: org.apache.thrift.TException: Unable to discover transaction service.
	at org.apache.phoenix.end2end.AlterTableWithViewsIT.testMakeBaseTableTransactional(AlterTableWithViewsIT.java:946)
Caused by: org.apache.thrift.TException: Unable to discover transaction service.
	at org.apache.phoenix.end2end.AlterTableWithViewsIT.testMakeBaseTableTransactional(AlterTableWithViewsIT.java:946)

[ERROR] testMakeBaseTableTransactional[AlterTableWithViewsIT_columnEncoded=true, multiTenant=true,
salted=false](org.apache.phoenix.end2end.AlterTableWithViewsIT)  Time elapsed: 15.277 s  <<<
ERROR!
java.lang.RuntimeException: org.apache.thrift.TException: Unable to discover transaction service.
	at org.apache.phoenix.end2end.AlterTableWithViewsIT.testMakeBaseTableTransactional(AlterTableWithViewsIT.java:946)
Caused by: org.apache.thrift.TException: Unable to discover transaction service.
	at org.apache.phoenix.end2end.AlterTableWithViewsIT.testMakeBaseTableTransactional(AlterTableWithViewsIT.java:946)

[ERROR] testMakeBaseTableTransactional[AlterTableWithViewsIT_columnEncoded=true, multiTenant=true,
salted=true](org.apache.phoenix.end2end.AlterTableWithViewsIT)  Time elapsed: 15.167 s  <<<
ERROR!
java.lang.RuntimeException: org.apache.thrift.TException: Unable to discover transaction service.
	at org.apache.phoenix.end2end.AlterTableWithViewsIT.testMakeBaseTableTransactional(AlterTableWithViewsIT.java:946)
Caused by: org.apache.thrift.TException: Unable to discover transaction service.
	at org.apache.phoenix.end2end.AlterTableWithViewsIT.testMakeBaseTableTransactional(AlterTableWithViewsIT.java:946)

[INFO] 
[INFO] Results:
[INFO] 
[ERROR] Errors: 
[ERROR]   AlterTableWithViewsIT.testMakeBaseTableTransactional:946 » Runtime org.apache....
[ERROR]   AlterTableWithViewsIT.testMakeBaseTableTransactional:946 » Runtime org.apache....
[ERROR]   AlterTableWithViewsIT.testMakeBaseTableTransactional:946 » Runtime org.apache....
[ERROR]   AlterTableWithViewsIT.testMakeBaseTableTransactional:946 » Runtime org.apache....
[ERROR]   AlterTableWithViewsIT.testMakeBaseTableTransactional:946 » Runtime org.apache....
[ERROR]   AlterTableWithViewsIT.testMakeBaseTableTransactional:946 » Runtime org.apache....
[ERROR]   AlterTableWithViewsIT.testMakeBaseTableTransactional:946 » Runtime org.apache....
[ERROR]   AlterTableWithViewsIT.testMakeBaseTableTransactional:946 » Runtime org.apache....
[ERROR]   ViewIT.testRecreateDroppedTableWithChildViews:520 » TableNotFound ERROR 1012 (...
[INFO] 
[ERROR] Tests run: 273, Failures: 0, Errors: 9, Skipped: 2
[INFO] 
[INFO] 
[INFO] --- maven-failsafe-plugin:2.20:verify (ParallelStatsEnabledTest) @ phoenix-core ---
[INFO] ------------------------------------------------------------------------
[INFO] Reactor Summary:
[INFO] 
[INFO] Apache Phoenix 4.14.0-HBase-1.3 .................... SUCCESS [  1.829 s]
[INFO] Phoenix Core ....................................... FAILURE [  04:19 h]
[INFO] Phoenix - Flume .................................... SKIPPED
[INFO] Phoenix - Kafka .................................... SKIPPED
[INFO] Phoenix - Pig ...................................... SKIPPED
[INFO] Phoenix Query Server Client ........................ SKIPPED
[INFO] Phoenix Query Server ............................... SKIPPED
[INFO] Phoenix - Pherf .................................... SKIPPED
[INFO] Phoenix - Spark .................................... SKIPPED
[INFO] Phoenix - Hive ..................................... SKIPPED
[INFO] Phoenix Client ..................................... SKIPPED
[INFO] Phoenix Server ..................................... SKIPPED
[INFO] Phoenix Assembly ................................... SKIPPED
[INFO] Phoenix - Tracing Web Application .................. SKIPPED
[INFO] Phoenix Load Balancer 4.14.0-HBase-1.3 ............. SKIPPED
[INFO] ------------------------------------------------------------------------
[INFO] BUILD FAILURE
[INFO] ------------------------------------------------------------------------
[INFO] Total time: 04:19 h
[INFO] Finished at: 2018-10-27T02:00:41Z
[INFO] ------------------------------------------------------------------------
[ERROR] Failed to execute goal org.apache.maven.plugins:maven-failsafe-plugin:2.20:verify
(ParallelStatsEnabledTest) on project phoenix-core: There are test failures.
[ERROR] 
[ERROR] Please refer to <https://builds.apache.org/job/Phoenix-4.x-HBase-1.3/ws/phoenix-core/target/failsafe-reports>
for the individual test results.
[ERROR] Please refer to dump files (if any exist) [date]-jvmRun[N].dump, [date].dumpstream
and [date]-jvmRun[N].dumpstream.
[ERROR] -> [Help 1]
[ERROR] 
[ERROR] To see the full stack trace of the errors, re-run Maven with the -e switch.
[ERROR] Re-run Maven using the -X switch to enable full debug logging.
[ERROR] 
[ERROR] For more information about the errors and possible solutions, please read the following
articles:
[ERROR] [Help 1] http://cwiki.apache.org/confluence/display/MAVEN/MojoFailureException
[ERROR] 
[ERROR] After correcting the problems, you can resume the build with the command
[ERROR]   mvn <goals> -rf :phoenix-core
Build step 'Invoke top-level Maven targets' marked build as failure
Archiving artifacts
[JIRA] Updating issue PHOENIX-4764
Recording test results

Mime
View raw message