phoenix-commits mailing list archives

Site index · List index
Message view « Date » · « Thread »
Top « Date » · « Thread »
From Apache Jenkins Server <jenk...@builds.apache.org>
Subject Build failed in Jenkins: Phoenix | Master #2228
Date Wed, 31 Oct 2018 19:59:20 GMT
See <https://builds.apache.org/job/Phoenix-master/2228/display/redirect?page=changes>

Changes:

[elserj] PHOENIX-4909 Missing the phoenix-loadbalancer module dependency in

------------------------------------------
[...truncated 1.43 MB...]
[WARNING] Tests run: 28, Failures: 0, Errors: 0, Skipped: 4, Time elapsed: 100.921 s - in
org.apache.phoenix.end2end.NonColumnEncodedImmutableNonTxStatsCollectorIT
[WARNING] Tests run: 28, Failures: 0, Errors: 0, Skipped: 4, Time elapsed: 101.328 s - in
org.apache.phoenix.end2end.NonColumnEncodedImmutableTxStatsCollectorIT
[INFO] Running org.apache.phoenix.end2end.PartialResultServerConfigurationIT
[INFO] Running org.apache.phoenix.end2end.PhoenixDriverIT
[INFO] Tests run: 1, Failures: 0, Errors: 0, Skipped: 0, Time elapsed: 32.172 s - in org.apache.phoenix.end2end.PartialResultServerConfigurationIT
[INFO] Tests run: 4, Failures: 0, Errors: 0, Skipped: 0, Time elapsed: 55.017 s - in org.apache.phoenix.end2end.PhoenixDriverIT
[INFO] Tests run: 3, Failures: 0, Errors: 0, Skipped: 0, Time elapsed: 456.154 s - in org.apache.phoenix.end2end.LocalIndexSplitMergeIT
[INFO] Running org.apache.phoenix.end2end.QueryLoggerIT
[INFO] Running org.apache.phoenix.end2end.QueryWithLimitIT
[INFO] Running org.apache.phoenix.end2end.QueryTimeoutIT
[INFO] Tests run: 2, Failures: 0, Errors: 0, Skipped: 0, Time elapsed: 5.061 s - in org.apache.phoenix.end2end.QueryWithLimitIT
[INFO] Tests run: 2, Failures: 0, Errors: 0, Skipped: 0, Time elapsed: 7.467 s - in org.apache.phoenix.end2end.QueryTimeoutIT
[INFO] Tests run: 7, Failures: 0, Errors: 0, Skipped: 0, Time elapsed: 50.22 s - in org.apache.phoenix.end2end.QueryLoggerIT
[INFO] Running org.apache.phoenix.end2end.RebuildIndexConnectionPropsIT
[INFO] Running org.apache.phoenix.end2end.RegexBulkLoadToolIT
[INFO] Tests run: 1, Failures: 0, Errors: 0, Skipped: 0, Time elapsed: 0.473 s - in org.apache.phoenix.end2end.RebuildIndexConnectionPropsIT
[INFO] Running org.apache.phoenix.end2end.RenewLeaseIT
[INFO] Running org.apache.phoenix.end2end.SequencePointInTimeIT
[INFO] Tests run: 1, Failures: 0, Errors: 0, Skipped: 0, Time elapsed: 0.112 s - in org.apache.phoenix.end2end.SequencePointInTimeIT
[INFO] Tests run: 1, Failures: 0, Errors: 0, Skipped: 0, Time elapsed: 26.472 s - in org.apache.phoenix.end2end.RenewLeaseIT
[INFO] Tests run: 10, Failures: 0, Errors: 0, Skipped: 0, Time elapsed: 66.657 s - in org.apache.phoenix.end2end.RegexBulkLoadToolIT
[INFO] Running org.apache.phoenix.end2end.SpillableGroupByIT
[INFO] Running org.apache.phoenix.end2end.SplitIT
[INFO] Running org.apache.phoenix.end2end.StatsEnabledSplitSystemCatalogIT
[INFO] Tests run: 3, Failures: 0, Errors: 0, Skipped: 0, Time elapsed: 9.145 s - in org.apache.phoenix.end2end.SpillableGroupByIT
[INFO] Tests run: 12, Failures: 0, Errors: 0, Skipped: 0, Time elapsed: 49.726 s - in org.apache.phoenix.end2end.StatsEnabledSplitSystemCatalogIT
[INFO] Running org.apache.phoenix.end2end.SysTableNamespaceMappedStatsCollectorIT
[INFO] Running org.apache.phoenix.end2end.SystemCatalogCreationOnConnectionIT
[INFO] Tests run: 12, Failures: 0, Errors: 0, Skipped: 0, Time elapsed: 129.611 s - in org.apache.phoenix.end2end.SplitIT
[WARNING] Tests run: 28, Failures: 0, Errors: 0, Skipped: 4, Time elapsed: 100.214 s - in
org.apache.phoenix.end2end.SysTableNamespaceMappedStatsCollectorIT
[INFO] Running org.apache.phoenix.end2end.SystemTablePermissionsIT
[INFO] Running org.apache.phoenix.end2end.SystemCatalogIT
[INFO] Tests run: 1, Failures: 0, Errors: 0, Skipped: 0, Time elapsed: 46.709 s - in org.apache.phoenix.end2end.SystemCatalogIT
[INFO] Running org.apache.phoenix.end2end.TableDDLPermissionsIT
[INFO] Tests run: 2, Failures: 0, Errors: 0, Skipped: 0, Time elapsed: 84.708 s - in org.apache.phoenix.end2end.SystemTablePermissionsIT
[INFO] Tests run: 96, Failures: 0, Errors: 0, Skipped: 0, Time elapsed: 951.413 s - in org.apache.phoenix.end2end.IndexToolIT
[INFO] Running org.apache.phoenix.end2end.TableSnapshotReadsMapReduceIT
[INFO] Tests run: 3, Failures: 0, Errors: 0, Skipped: 0, Time elapsed: 22.412 s - in org.apache.phoenix.end2end.TableSnapshotReadsMapReduceIT
[INFO] Running org.apache.phoenix.end2end.UpdateCacheAcrossDifferentClientsIT
[INFO] Tests run: 6, Failures: 0, Errors: 0, Skipped: 0, Time elapsed: 28.931 s - in org.apache.phoenix.end2end.UpdateCacheAcrossDifferentClientsIT
[INFO] Running org.apache.phoenix.end2end.UserDefinedFunctionsIT
[INFO] Running org.apache.phoenix.end2end.index.ImmutableIndexIT
[INFO] Tests run: 16, Failures: 0, Errors: 0, Skipped: 0, Time elapsed: 116.896 s - in org.apache.phoenix.end2end.UserDefinedFunctionsIT
[INFO] Running org.apache.phoenix.end2end.index.LocalIndexIT
[ERROR] Tests run: 4, Failures: 0, Errors: 2, Skipped: 0, Time elapsed: 299.482 s <<<
FAILURE! - in org.apache.phoenix.end2end.TableDDLPermissionsIT
[ERROR] testAutomaticGrantWithIndexAndView[isNamespaceMapped=false](org.apache.phoenix.end2end.TableDDLPermissionsIT)
 Time elapsed: 138.761 s  <<< ERROR!
java.lang.reflect.UndeclaredThrowableException
	at org.apache.phoenix.end2end.TableDDLPermissionsIT.testAutomaticGrantWithIndexAndView(TableDDLPermissionsIT.java:237)
Caused by: org.apache.phoenix.schema.TableNotFoundException: ERROR 1012 (42M03): Table undefined.
	at org.apache.phoenix.end2end.TableDDLPermissionsIT.testAutomaticGrantWithIndexAndView(TableDDLPermissionsIT.java:237)

[ERROR] testAutomaticGrantWithIndexAndView[isNamespaceMapped=true](org.apache.phoenix.end2end.TableDDLPermissionsIT)
 Time elapsed: 124.365 s  <<< ERROR!
java.lang.reflect.UndeclaredThrowableException
	at org.apache.phoenix.end2end.TableDDLPermissionsIT.testAutomaticGrantWithIndexAndView(TableDDLPermissionsIT.java:237)
Caused by: org.apache.phoenix.schema.TableNotFoundException: ERROR 1012 (42M03): Table undefined.
	at org.apache.phoenix.end2end.TableDDLPermissionsIT.testAutomaticGrantWithIndexAndView(TableDDLPermissionsIT.java:237)

[INFO] Running org.apache.phoenix.end2end.index.MutableIndexFailureIT
[INFO] Tests run: 14, Failures: 0, Errors: 0, Skipped: 0, Time elapsed: 628.548 s - in org.apache.phoenix.end2end.SystemCatalogCreationOnConnectionIT
[INFO] Running org.apache.phoenix.end2end.index.MutableIndexFailureWithNamespaceIT
[INFO] Tests run: 13, Failures: 0, Errors: 0, Skipped: 0, Time elapsed: 157.691 s - in org.apache.phoenix.end2end.index.MutableIndexFailureIT
[INFO] Running org.apache.phoenix.end2end.index.MutableIndexRebuilderIT
[WARNING] Tests run: 40, Failures: 0, Errors: 0, Skipped: 16, Time elapsed: 352.136 s - in
org.apache.phoenix.end2end.index.ImmutableIndexIT
[INFO] Tests run: 1, Failures: 0, Errors: 0, Skipped: 0, Time elapsed: 51.699 s - in org.apache.phoenix.end2end.index.MutableIndexRebuilderIT
[INFO] Tests run: 7, Failures: 0, Errors: 0, Skipped: 0, Time elapsed: 98.05 s - in org.apache.phoenix.end2end.index.MutableIndexFailureWithNamespaceIT
[INFO] Running org.apache.phoenix.end2end.index.MutableIndexReplicationIT
[INFO] Tests run: 1, Failures: 0, Errors: 0, Skipped: 0, Time elapsed: 7.43 s - in org.apache.phoenix.end2end.index.MutableIndexReplicationIT
[INFO] Running org.apache.phoenix.end2end.index.PartialIndexRebuilderIT
[INFO] Running org.apache.phoenix.end2end.index.PhoenixMRJobSubmitterIT
[INFO] Tests run: 1, Failures: 0, Errors: 0, Skipped: 0, Time elapsed: 7.557 s - in org.apache.phoenix.end2end.index.PhoenixMRJobSubmitterIT
[INFO] Running org.apache.phoenix.end2end.index.txn.TxWriteFailureIT
[INFO] Tests run: 8, Failures: 0, Errors: 0, Skipped: 0, Time elapsed: 37.063 s - in org.apache.phoenix.end2end.index.txn.TxWriteFailureIT
[INFO] Running org.apache.phoenix.execute.PartialCommitIT
[INFO] Running org.apache.phoenix.execute.UpsertSelectOverlappingBatchesIT
[INFO] Tests run: 6, Failures: 0, Errors: 0, Skipped: 0, Time elapsed: 43.017 s - in org.apache.phoenix.execute.PartialCommitIT
[INFO] Tests run: 44, Failures: 0, Errors: 0, Skipped: 0, Time elapsed: 434.02 s - in org.apache.phoenix.end2end.index.LocalIndexIT
[INFO] Running org.apache.phoenix.hbase.index.FailForUnsupportedHBaseVersionsIT
[INFO] Tests run: 2, Failures: 0, Errors: 0, Skipped: 0, Time elapsed: 20.951 s - in org.apache.phoenix.hbase.index.FailForUnsupportedHBaseVersionsIT
[INFO] Tests run: 3, Failures: 0, Errors: 0, Skipped: 0, Time elapsed: 64.564 s - in org.apache.phoenix.execute.UpsertSelectOverlappingBatchesIT
[INFO] Running org.apache.phoenix.iterate.RoundRobinResultIteratorWithStatsIT
[INFO] Running org.apache.phoenix.iterate.ScannerLeaseRenewalIT
[INFO] Tests run: 1, Failures: 0, Errors: 0, Skipped: 0, Time elapsed: 4.983 s - in org.apache.phoenix.iterate.RoundRobinResultIteratorWithStatsIT
[INFO] Running org.apache.phoenix.monitoring.PhoenixLoggingMetricsIT
[INFO] Running org.apache.phoenix.monitoring.PhoenixMetricsDisabledIT
[INFO] Tests run: 1, Failures: 0, Errors: 0, Skipped: 0, Time elapsed: 0.006 s - in org.apache.phoenix.monitoring.PhoenixMetricsDisabledIT
[INFO] Tests run: 4, Failures: 0, Errors: 0, Skipped: 0, Time elapsed: 23.417 s - in org.apache.phoenix.monitoring.PhoenixLoggingMetricsIT
[INFO] Running org.apache.phoenix.monitoring.PhoenixMetricsIT
[INFO] Running org.apache.phoenix.rpc.PhoenixClientRpcIT
[INFO] Tests run: 2, Failures: 0, Errors: 0, Skipped: 0, Time elapsed: 3.368 s - in org.apache.phoenix.rpc.PhoenixClientRpcIT
[INFO] Tests run: 25, Failures: 0, Errors: 0, Skipped: 0, Time elapsed: 327.911 s - in org.apache.phoenix.end2end.index.PartialIndexRebuilderIT
[INFO] Running org.apache.phoenix.rpc.PhoenixServerRpcIT
[INFO] Tests run: 2, Failures: 0, Errors: 0, Skipped: 0, Time elapsed: 13.718 s - in org.apache.phoenix.rpc.PhoenixServerRpcIT
[INFO] Tests run: 21, Failures: 0, Errors: 0, Skipped: 0, Time elapsed: 61.541 s - in org.apache.phoenix.monitoring.PhoenixMetricsIT
[INFO] Tests run: 2, Failures: 0, Errors: 0, Skipped: 0, Time elapsed: 162.006 s - in org.apache.phoenix.iterate.ScannerLeaseRenewalIT
[INFO] 
[INFO] Results:
[INFO] 
[ERROR] Errors: 
[ERROR]   TableDDLPermissionsIT.testAutomaticGrantWithIndexAndView:237->BasePermissionsIT.verifyAllowed:689->BasePermissionsIT.verifyAllowed:696
» UndeclaredThrowable
[ERROR]   TableDDLPermissionsIT.testAutomaticGrantWithIndexAndView:237->BasePermissionsIT.verifyAllowed:689->BasePermissionsIT.verifyAllowed:696
» UndeclaredThrowable
[INFO] 
[ERROR] Tests run: 719, Failures: 0, Errors: 2, Skipped: 48
[INFO] 
[INFO] 
[INFO] --- maven-failsafe-plugin:2.20:integration-test (SplitSystemCatalogTests) @ phoenix-core
---
[INFO] 
[INFO] -------------------------------------------------------
[INFO]  T E S T S
[INFO] -------------------------------------------------------
[INFO] Running org.apache.phoenix.end2end.AlterTableWithViewsIT
[INFO] Running org.apache.phoenix.end2end.AlterMultiTenantTableWithViewsIT
[INFO] Running org.apache.phoenix.end2end.DropTableWithViewsIT
[INFO] Tests run: 4, Failures: 0, Errors: 0, Skipped: 0, Time elapsed: 18.116 s - in org.apache.phoenix.end2end.DropTableWithViewsIT
[INFO] Tests run: 9, Failures: 0, Errors: 0, Skipped: 0, Time elapsed: 70.624 s - in org.apache.phoenix.end2end.AlterMultiTenantTableWithViewsIT
[INFO] Running org.apache.phoenix.end2end.TenantSpecificViewIndexIT
[ERROR] Tests run: 1, Failures: 0, Errors: 1, Skipped: 0, Time elapsed: 0.007 s <<<
FAILURE! - in org.apache.phoenix.end2end.TenantSpecificViewIndexIT
[ERROR] org.apache.phoenix.end2end.TenantSpecificViewIndexIT  Time elapsed: 0.006 s  <<<
ERROR!
java.io.IOException: java.lang.NullPointerException

[INFO] Running org.apache.phoenix.end2end.TenantSpecificViewIndexSaltedIT
[INFO] Tests run: 4, Failures: 0, Errors: 0, Skipped: 0, Time elapsed: 32.467 s - in org.apache.phoenix.end2end.TenantSpecificViewIndexSaltedIT
[INFO] Running org.apache.phoenix.end2end.ViewIT
[INFO] Running org.apache.phoenix.end2end.index.ViewIndexIT
[WARNING] Tests run: 14, Failures: 0, Errors: 0, Skipped: 2, Time elapsed: 46.484 s - in org.apache.phoenix.end2end.index.ViewIndexIT
[ERROR] Tests run: 128, Failures: 0, Errors: 5, Skipped: 0, Time elapsed: 365.349 s <<<
FAILURE! - in org.apache.phoenix.end2end.ViewIT
[ERROR] testRecreateDroppedTableWithChildViews[ViewIT_transactionProvider=TEPHRA, columnEncoded=false](org.apache.phoenix.end2end.ViewIT)
 Time elapsed: 2.048 s  <<< ERROR!
org.apache.phoenix.schema.TableNotFoundException: ERROR 1012 (42M03): Table undefined.
	at org.apache.phoenix.end2end.ViewIT.testRecreateDroppedTableWithChildViews(ViewIT.java:530)

[ERROR] testCreateViewMappedToExistingHbaseTableWithNamespaceMappingEnabled[ViewIT_transactionProvider=TEPHRA,
columnEncoded=false](org.apache.phoenix.end2end.ViewIT)  Time elapsed: 20.302 s  <<<
ERROR!
org.apache.phoenix.schema.TableNotFoundException: ERROR 1012 (42M03): Table undefined. tableName=NS_N000068.TBL_N000069
	at org.apache.phoenix.end2end.ViewIT.testCreateViewMappedToExistingHbaseTableWithNamespaceMappingEnabled(ViewIT.java:976)

[ERROR] testCreateViewMappedToExistingHbaseTableWithNamespaceMappingEnabled[ViewIT_transactionProvider=TEPHRA,
columnEncoded=true](org.apache.phoenix.end2end.ViewIT)  Time elapsed: 20.221 s  <<<
ERROR!
org.apache.phoenix.schema.TableNotFoundException: ERROR 1012 (42M03): Table undefined. tableName=NS_N000166.TBL_N000167
	at org.apache.phoenix.end2end.ViewIT.testCreateViewMappedToExistingHbaseTableWithNamespaceMappingEnabled(ViewIT.java:976)

[ERROR] testCreateViewMappedToExistingHbaseTableWithNamespaceMappingEnabled[ViewIT_transactionProvider=null,
columnEncoded=false](org.apache.phoenix.end2end.ViewIT)  Time elapsed: 20.677 s  <<<
ERROR!
org.apache.phoenix.schema.TableNotFoundException: ERROR 1012 (42M03): Table undefined. tableName=NS_N000264.TBL_N000265
	at org.apache.phoenix.end2end.ViewIT.testCreateViewMappedToExistingHbaseTableWithNamespaceMappingEnabled(ViewIT.java:976)

[ERROR] testCreateViewMappedToExistingHbaseTableWithNamespaceMappingEnabled[ViewIT_transactionProvider=null,
columnEncoded=true](org.apache.phoenix.end2end.ViewIT)  Time elapsed: 20.358 s  <<<
ERROR!
org.apache.phoenix.schema.TableNotFoundException: ERROR 1012 (42M03): Table undefined. tableName=NS_N000362.TBL_N000363
	at org.apache.phoenix.end2end.ViewIT.testCreateViewMappedToExistingHbaseTableWithNamespaceMappingEnabled(ViewIT.java:976)

[INFO] Tests run: 104, Failures: 0, Errors: 0, Skipped: 0, Time elapsed: 734.708 s - in org.apache.phoenix.end2end.AlterTableWithViewsIT
[INFO] 
[INFO] Results:
[INFO] 
[ERROR] Errors: 
[ERROR]   TenantSpecificViewIndexIT.org.apache.phoenix.end2end.TenantSpecificViewIndexIT »
IO
[ERROR]   ViewIT.testCreateViewMappedToExistingHbaseTableWithNamespaceMappingEnabled:976 »
TableNotFound
[ERROR]   ViewIT.testCreateViewMappedToExistingHbaseTableWithNamespaceMappingEnabled:976 »
TableNotFound
[ERROR]   ViewIT.testCreateViewMappedToExistingHbaseTableWithNamespaceMappingEnabled:976 »
TableNotFound
[ERROR]   ViewIT.testCreateViewMappedToExistingHbaseTableWithNamespaceMappingEnabled:976 »
TableNotFound
[ERROR]   ViewIT.testRecreateDroppedTableWithChildViews:530 » TableNotFound ERROR 1012 (...
[INFO] 
[ERROR] Tests run: 264, Failures: 0, Errors: 6, Skipped: 2
[INFO] 
[INFO] 
[INFO] --- maven-failsafe-plugin:2.20:verify (ParallelStatsEnabledTest) @ phoenix-core ---
[INFO] ------------------------------------------------------------------------
[INFO] Reactor Summary:
[INFO] 
[INFO] Apache Phoenix 5.1.0-HBase-2.0-SNAPSHOT ............ SUCCESS [  3.162 s]
[INFO] Phoenix Core ....................................... FAILURE [  02:39 h]
[INFO] Phoenix - Flume .................................... SKIPPED
[INFO] Phoenix - Kafka .................................... SKIPPED
[INFO] Phoenix - Pig ...................................... SKIPPED
[INFO] Phoenix Query Server Client ........................ SKIPPED
[INFO] Phoenix Query Server ............................... SKIPPED
[INFO] Phoenix - Pherf .................................... SKIPPED
[INFO] Phoenix - Spark .................................... SKIPPED
[INFO] Phoenix - Hive ..................................... SKIPPED
[INFO] Phoenix Client ..................................... SKIPPED
[INFO] Phoenix Server ..................................... SKIPPED
[INFO] Phoenix Load Balancer .............................. SKIPPED
[INFO] Phoenix Assembly ................................... SKIPPED
[INFO] Phoenix - Tracing Web Application 5.1.0-HBase-2.0-SNAPSHOT SKIPPED
[INFO] ------------------------------------------------------------------------
[INFO] BUILD FAILURE
[INFO] ------------------------------------------------------------------------
[INFO] Total time: 02:39 h
[INFO] Finished at: 2018-10-31T19:54:36Z
[INFO] ------------------------------------------------------------------------
[ERROR] Failed to execute goal org.apache.maven.plugins:maven-failsafe-plugin:2.20:verify
(ParallelStatsEnabledTest) on project phoenix-core: There are test failures.
[ERROR] 
[ERROR] Please refer to <https://builds.apache.org/job/Phoenix-master/ws/phoenix-core/target/failsafe-reports>
for the individual test results.
[ERROR] Please refer to dump files (if any exist) [date]-jvmRun[N].dump, [date].dumpstream
and [date]-jvmRun[N].dumpstream.
[ERROR] org.apache.maven.surefire.booter.SurefireBooterForkException: ExecutionException The
forked VM terminated without properly saying goodbye. VM crash or System.exit called?
[ERROR] Command was /bin/sh -c cd <https://builds.apache.org/job/Phoenix-master/ws/phoenix-core>
&& /usr/local/asfpackages/java/jdk1.8.0_172/jre/bin/java -enableassertions -Xmx2000m
-XX:MaxPermSize=256m -Djava.security.egd=file:/dev/./urandom '-Djava.library.path=${hadoop.library.path}:/usr/java/packages/lib/amd64:/usr/lib64:/lib64:/lib:/usr/lib'
-XX:+HeapDumpOnOutOfMemoryError -XX:HeapDumpPath=./target/ -jar <https://builds.apache.org/job/Phoenix-master/2228/artifact/phoenix-core/target/surefire/surefirebooter5151371335204914302.jar>
<https://builds.apache.org/job/Phoenix-master/ws/phoenix-core/target/surefire> 2018-10-31T17-18-11_156-jvmRun4
surefire4052565432032536152tmp surefire_482755857730748041356tmp
[ERROR] Process Exit Code: 0
[ERROR] 	at org.apache.maven.plugin.surefire.booterclient.ForkStarter.awaitResultsDone(ForkStarter.java:494)
[ERROR] 	at org.apache.maven.plugin.surefire.booterclient.ForkStarter.runSuitesForkPerTestSet(ForkStarter.java:441)
[ERROR] 	at org.apache.maven.plugin.surefire.booterclient.ForkStarter.run(ForkStarter.java:292)
[ERROR] 	at org.apache.maven.plugin.surefire.booterclient.ForkStarter.run(ForkStarter.java:243)
[ERROR] 	at org.apache.maven.plugin.surefire.AbstractSurefireMojo.executeProvider(AbstractSurefireMojo.java:1077)
[ERROR] 	at org.apache.maven.plugin.surefire.AbstractSurefireMojo.executeAfterPreconditionsChecked(AbstractSurefireMojo.java:907)
[ERROR] 	at org.apache.maven.plugin.surefire.AbstractSurefireMojo.execute(AbstractSurefireMojo.java:785)
[ERROR] 	at org.apache.maven.plugin.DefaultBuildPluginManager.executeMojo(DefaultBuildPluginManager.java:137)
[ERROR] 	at org.apache.maven.lifecycle.internal.MojoExecutor.execute(MojoExecutor.java:208)
[ERROR] 	at org.apache.maven.lifecycle.internal.MojoExecutor.execute(MojoExecutor.java:154)
[ERROR] 	at org.apache.maven.lifecycle.internal.MojoExecutor.execute(MojoExecutor.java:146)
[ERROR] 	at org.apache.maven.lifecycle.internal.LifecycleModuleBuilder.buildProject(LifecycleModuleBuilder.java:117)
[ERROR] 	at org.apache.maven.lifecycle.internal.LifecycleModuleBuilder.buildProject(LifecycleModuleBuilder.java:81)
[ERROR] 	at org.apache.maven.lifecycle.internal.builder.singlethreaded.SingleThreadedBuilder.build(SingleThreadedBuilder.java:56)
[ERROR] 	at org.apache.maven.lifecycle.internal.LifecycleStarter.execute(LifecycleStarter.java:128)
[ERROR] 	at org.apache.maven.DefaultMaven.doExecute(DefaultMaven.java:305)
[ERROR] 	at org.apache.maven.DefaultMaven.doExecute(DefaultMaven.java:192)
[ERROR] 	at org.apache.maven.DefaultMaven.execute(DefaultMaven.java:105)
[ERROR] 	at org.apache.maven.cli.MavenCli.execute(MavenCli.java:954)
[ERROR] 	at org.apache.maven.cli.MavenCli.doMain(MavenCli.java:288)
[ERROR] 	at org.apache.maven.cli.MavenCli.main(MavenCli.java:192)
[ERROR] 	at sun.reflect.NativeMethodAccessorImpl.invoke0(Native Method)
[ERROR] 	at sun.reflect.NativeMethodAccessorImpl.invoke(NativeMethodAccessorImpl.java:62)
[ERROR] 	at sun.reflect.DelegatingMethodAccessorImpl.invoke(DelegatingMethodAccessorImpl.java:43)
[ERROR] 	at java.lang.reflect.Method.invoke(Method.java:498)
[ERROR] 	at org.codehaus.plexus.classworlds.launcher.Launcher.launchEnhanced(Launcher.java:289)
[ERROR] 	at org.codehaus.plexus.classworlds.launcher.Launcher.launch(Launcher.java:229)
[ERROR] 	at org.codehaus.plexus.classworlds.launcher.Launcher.mainWithExitCode(Launcher.java:415)
[ERROR] 	at org.codehaus.plexus.classworlds.launcher.Launcher.main(Launcher.java:356)
[ERROR] Caused by: org.apache.maven.surefire.booter.SurefireBooterForkException: The forked
VM terminated without properly saying goodbye. VM crash or System.exit called?
[ERROR] Command was /bin/sh -c cd <https://builds.apache.org/job/Phoenix-master/ws/phoenix-core>
&& /usr/local/asfpackages/java/jdk1.8.0_172/jre/bin/java -enableassertions -Xmx2000m
-XX:MaxPermSize=256m -Djava.security.egd=file:/dev/./urandom '-Djava.library.path=${hadoop.library.path}:/usr/java/packages/lib/amd64:/usr/lib64:/lib64:/lib:/usr/lib'
-XX:+HeapDumpOnOutOfMemoryError -XX:HeapDumpPath=./target/ -jar <https://builds.apache.org/job/Phoenix-master/2228/artifact/phoenix-core/target/surefire/surefirebooter5151371335204914302.jar>
<https://builds.apache.org/job/Phoenix-master/ws/phoenix-core/target/surefire> 2018-10-31T17-18-11_156-jvmRun4
surefire4052565432032536152tmp surefire_482755857730748041356tmp
[ERROR] Process Exit Code: 0
[ERROR] 	at org.apache.maven.plugin.surefire.booterclient.ForkStarter.fork(ForkStarter.java:679)
[ERROR] 	at org.apache.maven.plugin.surefire.booterclient.ForkStarter.fork(ForkStarter.java:533)
[ERROR] 	at org.apache.maven.plugin.surefire.booterclient.ForkStarter.access$600(ForkStarter.java:117)
[ERROR] 	at org.apache.maven.plugin.surefire.booterclient.ForkStarter$2.call(ForkStarter.java:429)
[ERROR] 	at org.apache.maven.plugin.surefire.booterclient.ForkStarter$2.call(ForkStarter.java:406)
[ERROR] 	at java.util.concurrent.FutureTask.run(FutureTask.java:266)
[ERROR] 	at java.util.concurrent.ThreadPoolExecutor.runWorker(ThreadPoolExecutor.java:1149)
[ERROR] 	at java.util.concurrent.ThreadPoolExecutor$Worker.run(ThreadPoolExecutor.java:624)
[ERROR] 	at java.lang.Thread.run(Thread.java:748)
[ERROR] 
[ERROR] -> [Help 1]
[ERROR] 
[ERROR] To see the full stack trace of the errors, re-run Maven with the -e switch.
[ERROR] Re-run Maven using the -X switch to enable full debug logging.
[ERROR] 
[ERROR] For more information about the errors and possible solutions, please read the following
articles:
[ERROR] [Help 1] http://cwiki.apache.org/confluence/display/MAVEN/MojoFailureException
[ERROR] 
[ERROR] After correcting the problems, you can resume the build with the command
[ERROR]   mvn <goals> -rf :phoenix-core
Build step 'Invoke top-level Maven targets' marked build as failure
Archiving artifacts
Recording test results
Not sending mail to unregistered user rchintaguntla@HW15978.local
Not sending mail to unregistered user ankitsinghal59@gmail.com

Mime
View raw message