phoenix-commits mailing list archives

Site index · List index
Message view « Date » · « Thread »
Top « Date » · « Thread »
From Apache Jenkins Server <jenk...@builds.apache.org>
Subject Build failed in Jenkins: Phoenix-omid2 #120
Date Sun, 14 Oct 2018 06:50:59 GMT
See <https://builds.apache.org/job/Phoenix-omid2/120/display/redirect>

------------------------------------------
Started by user ohads
[EnvInject] - Loading node environment variables.
Building remotely on H22 (ubuntu xenial) in workspace <https://builds.apache.org/job/Phoenix-omid2/ws/>
 > git rev-parse --is-inside-work-tree # timeout=10
Fetching changes from the remote Git repository
 > git config remote.origin.url https://git-wip-us.apache.org/repos/asf/phoenix.git # timeout=10
Fetching upstream changes from https://git-wip-us.apache.org/repos/asf/phoenix.git
 > git --version # timeout=10
 > git fetch --tags --progress https://git-wip-us.apache.org/repos/asf/phoenix.git +refs/heads/*:refs/remotes/origin/*
 > git rev-parse origin/omid2^{commit} # timeout=10
Checking out Revision c6a45bcf1e842fb8261ae1bdfd6a9283a2763cae (origin/omid2)
 > git config core.sparsecheckout # timeout=10
 > git checkout -f c6a45bcf1e842fb8261ae1bdfd6a9283a2763cae
Commit message: "Merge branch '4.x-HBase-1.3' into omid2"
 > git rev-list --no-walk c6a45bcf1e842fb8261ae1bdfd6a9283a2763cae # timeout=10
No emails were triggered.
[EnvInject] - Executing scripts and injecting environment variables after the SCM step.
[EnvInject] - Injecting as environment variables the properties content 
MAVEN_OPTS=-Xmx3G

[EnvInject] - Variables injected successfully.
[Phoenix-omid2] $ /bin/bash -xe /tmp/jenkins3350692592333908586.sh
+ rm -rf inomid
+ git clone https://git-wip-us.apache.org/repos/asf/incubator-omid.git inomid
Cloning into 'inomid'...
+ cd inomid
+ git checkout phoenix-integration
Switched to a new branch 'phoenix-integration'
Branch phoenix-integration set up to track remote branch phoenix-integration from origin.
+ /home/jenkins/tools/maven/latest3/bin/mvn install -DskipTests -P hbase-1
[INFO] Scanning for projects...
Downloading from central: https://repo.maven.apache.org/maven2/org/codehaus/jettison/jettison/1.3.3/jettison-1.3.3.pom
Downloading from apache release: https://repository.apache.org/content/repositories/releases/org/codehaus/jettison/jettison/1.3.3/jettison-1.3.3.pom
Downloading from java.net: http://download.java.net/maven/2/org/codehaus/jettison/jettison/1.3.3/jettison-1.3.3.pom
Downloading from repository.jboss.org: http://repository.jboss.org/nexus/content/groups/public-jboss/org/codehaus/jettison/jettison/1.3.3/jettison-1.3.3.pom
Progress (1): 3.7/4.3 kBProgress (1): 4.3 kB                        Downloaded from repository.jboss.org:
http://repository.jboss.org/nexus/content/groups/public-jboss/org/codehaus/jettison/jettison/1.3.3/jettison-1.3.3.pom
(4.3 kB at 19 kB/s)
Downloading from central: https://repo.maven.apache.org/maven2/org/jruby/joni/joni/2.1.2/joni-2.1.2.jar
Downloading from apache release: https://repository.apache.org/content/repositories/releases/org/jruby/joni/joni/2.1.2/joni-2.1.2.jar
Downloading from java.net: http://download.java.net/maven/2/org/jruby/joni/joni/2.1.2/joni-2.1.2.jar
Downloading from repository.jboss.org: http://repository.jboss.org/nexus/content/groups/public-jboss/org/jruby/joni/joni/2.1.2/joni-2.1.2.jar
Downloaded from repository.jboss.org: http://repository.jboss.org/nexus/content/groups/public-jboss/org/jruby/joni/joni/2.1.2/joni-2.1.2.jar
(0 B at 0 B/s)
[INFO] ------------------------------------------------------------------------
[INFO] Reactor Build Order:
[INFO] 
[INFO] Omid                                                               [pom]
[INFO] Common                                                             [jar]
[INFO] State Machine                                                      [jar]
[INFO] Commit Table                                                       [jar]
[INFO] Metrics                                                            [jar]
[INFO] Transaction Client                                                 [jar]
[INFO] Shims Aggregator for HBase                                         [pom]
[INFO] Shims layer for HBase 1.x                                          [jar]
[INFO] HBase Common                                                       [jar]
[INFO] HBase Commit Table                                                 [jar]
[INFO] Codahale Metrics                                                   [jar]
[INFO] Benchmarks                                                         [jar]
[INFO] Timestamp Storage                                                  [jar]
[INFO] HBase tools                                                        [jar]
[INFO] TSO and TO Servers                                                 [jar]
[INFO] HBase Client                                                       [jar]
[INFO] HBase Coprocessors                                                 [jar]
[INFO] Omid Client Examples                                               [jar]
[INFO] Omid Packaging                                                     [pom]
[INFO] 
[INFO] ------------------------< org.apache.omid:omid >------------------------
[INFO] Building Omid 0.8.2.11-SNAPSHOT                                   [1/19]
[INFO] --------------------------------[ pom ]---------------------------------
[INFO] 
[INFO] --- license-maven-plugin:2.11:check (check-license) @ omid ---
Downloading from central: https://repo.maven.apache.org/maven2/org/springframework/spring-core/3.1.3.RELEASE/spring-core-3.1.3.RELEASE.pom
Downloading from central: https://repo.maven.apache.org/maven2/com/mycila/mycila-xmltool/4.4.ga/mycila-xmltool-4.4.ga.pom
[INFO] ------------------------------------------------------------------------
[INFO] Reactor Summary:
[INFO] 
[INFO] Omid 0.8.2.11-SNAPSHOT ............................. FAILURE [  0.643 s]
[INFO] Common ............................................. SKIPPED
[INFO] State Machine ...................................... SKIPPED
[INFO] Commit Table ....................................... SKIPPED
[INFO] Metrics ............................................ SKIPPED
[INFO] Transaction Client ................................. SKIPPED
[INFO] Shims Aggregator for HBase ......................... SKIPPED
[INFO] Shims layer for HBase 1.x .......................... SKIPPED
[INFO] HBase Common ....................................... SKIPPED
[INFO] HBase Commit Table ................................. SKIPPED
[INFO] Codahale Metrics ................................... SKIPPED
[INFO] Benchmarks ......................................... SKIPPED
[INFO] Timestamp Storage .................................. SKIPPED
[INFO] HBase tools ........................................ SKIPPED
[INFO] TSO and TO Servers ................................. SKIPPED
[INFO] HBase Client ....................................... SKIPPED
[INFO] HBase Coprocessors ................................. SKIPPED
[INFO] Omid Client Examples ............................... SKIPPED
[INFO] Omid Packaging 0.8.2.1-SNAPSHOT .................... SKIPPED
[INFO] ------------------------------------------------------------------------
[INFO] BUILD FAILURE
[INFO] ------------------------------------------------------------------------
[INFO] Total time: 7.553 s
[INFO] Finished at: 2018-10-14T06:50:30Z
[INFO] ------------------------------------------------------------------------
[ERROR] Failed to execute goal com.mycila:license-maven-plugin:2.11:check (check-license)
on project omid: Execution check-license of goal com.mycila:license-maven-plugin:2.11:check
failed: Plugin com.mycila:license-maven-plugin:2.11 or one of its dependencies could not be
resolved: Failed to collect dependencies at com.mycila:license-maven-plugin:jar:2.11 ->
org.springframework:spring-core:jar:3.1.3.RELEASE: Failed to read artifact descriptor for
org.springframework:spring-core:jar:3.1.3.RELEASE: Could not transfer artifact org.springframework:spring-core:pom:3.1.3.RELEASE
from/to central (https://repo.maven.apache.org/maven2): Received fatal alert: protocol_version
-> [Help 1]
[ERROR] 
[ERROR] To see the full stack trace of the errors, re-run Maven with the -e switch.
[ERROR] Re-run Maven using the -X switch to enable full debug logging.
[ERROR] 
[ERROR] For more information about the errors and possible solutions, please read the following
articles:
[ERROR] [Help 1] http://cwiki.apache.org/confluence/display/MAVEN/PluginResolutionException
Build step 'Execute shell' marked build as failure
Archiving artifacts
Recording test results
ERROR: Step ?Publish JUnit test result report? failed: No test report files were found. Configuration
error?
Not sending mail to unregistered user ankitsinghal59@gmail.com
Not sending mail to unregistered user k.mehta@salesforce.com

Mime
View raw message