phoenix-commits mailing list archives

Site index · List index
Message view « Date » · « Thread »
Top « Date » · « Thread »
From Apache Jenkins Server <jenk...@builds.apache.org>
Subject Build failed in Jenkins: Phoenix-4.x-HBase-1.2 #443
Date Fri, 07 Sep 2018 17:51:41 GMT
See <https://builds.apache.org/job/Phoenix-4.x-HBase-1.2/443/display/redirect?page=changes>

Changes:

[karanmehta93] PHOENIX-4894 Missing Apache license in two QueryServer classes

------------------------------------------
[...truncated 5.17 KB...]
[WARNING] Reporting configuration should be done in <reporting> section, not in maven-site-plugin
<configuration> as reportPlugins parameter.
[WARNING] 
[WARNING] Some problems were encountered while building the effective model for org.apache.phoenix:phoenix-queryserver-client:jar:4.14.0-HBase-1.2
[WARNING] Reporting configuration should be done in <reporting> section, not in maven-site-plugin
<configuration> as reportPlugins parameter.
[WARNING] 
[WARNING] Some problems were encountered while building the effective model for org.apache.phoenix:phoenix-queryserver:jar:4.14.0-HBase-1.2
[WARNING] Reporting configuration should be done in <reporting> section, not in maven-site-plugin
<configuration> as reportPlugins parameter.
[WARNING] 
[WARNING] Some problems were encountered while building the effective model for org.apache.phoenix:phoenix-pherf:jar:4.14.0-HBase-1.2
[WARNING] Reporting configuration should be done in <reporting> section, not in maven-site-plugin
<configuration> as reportPlugins parameter.
[WARNING] 
[WARNING] Some problems were encountered while building the effective model for org.apache.phoenix:phoenix-spark:jar:4.14.0-HBase-1.2
[WARNING] Reporting configuration should be done in <reporting> section, not in maven-site-plugin
<configuration> as reportPlugins parameter.
[WARNING] 
[WARNING] Some problems were encountered while building the effective model for org.apache.phoenix:phoenix-hive:jar:4.14.0-HBase-1.2
[WARNING] Reporting configuration should be done in <reporting> section, not in maven-site-plugin
<configuration> as reportPlugins parameter.
[WARNING] 
[WARNING] Some problems were encountered while building the effective model for org.apache.phoenix:phoenix-client:jar:4.14.0-HBase-1.2
[WARNING] Reporting configuration should be done in <reporting> section, not in maven-site-plugin
<configuration> as reportPlugins parameter. @ org.apache.phoenix:phoenix-client:[unknown-version],
<https://builds.apache.org/job/Phoenix-4.x-HBase-1.2/ws/phoenix-client/pom.xml,> line
52, column 24
[WARNING] 
[WARNING] Some problems were encountered while building the effective model for org.apache.phoenix:phoenix-server:jar:4.14.0-HBase-1.2
[WARNING] Reporting configuration should be done in <reporting> section, not in maven-site-plugin
<configuration> as reportPlugins parameter. @ org.apache.phoenix:phoenix-server:[unknown-version],
<https://builds.apache.org/job/Phoenix-4.x-HBase-1.2/ws/phoenix-server/pom.xml,> line
50, column 24
[WARNING] 
[WARNING] Some problems were encountered while building the effective model for org.apache.phoenix:phoenix-assembly:pom:4.14.0-HBase-1.2
[WARNING] Reporting configuration should be done in <reporting> section, not in maven-site-plugin
<configuration> as reportPlugins parameter.
[WARNING] 
[WARNING] Some problems were encountered while building the effective model for org.apache.phoenix:phoenix-tracing-webapp:jar:4.14.0-HBase-1.2
[WARNING] Reporting configuration should be done in <reporting> section, not in maven-site-plugin
<configuration> as reportPlugins parameter.
[WARNING] 
[WARNING] Some problems were encountered while building the effective model for org.apache.phoenix:phoenix-load-balancer:jar:4.14.0-HBase-1.2
[WARNING] Reporting configuration should be done in <reporting> section, not in maven-site-plugin
<configuration> as reportPlugins parameter.
[WARNING] 
[WARNING] Some problems were encountered while building the effective model for org.apache.phoenix:phoenix:pom:4.14.0-HBase-1.2
[WARNING] Reporting configuration should be done in <reporting> section, not in maven-site-plugin
<configuration> as reportPlugins parameter. @ line 467, column 24
[WARNING] 
[WARNING] It is highly recommended to fix these problems because they threaten the stability
of your build.
[WARNING] 
[WARNING] For this reason, future Maven versions might no longer support building such malformed
projects.
[WARNING] 
[INFO] ------------------------------------------------------------------------
[INFO] Reactor Build Order:
[INFO] 
[INFO] Apache Phoenix                                                     [pom]
[INFO] Phoenix Core                                                       [jar]
[INFO] Phoenix - Flume                                                    [jar]
[INFO] Phoenix - Kafka                                                    [jar]
[INFO] Phoenix - Pig                                                      [jar]
[INFO] Phoenix Query Server Client                                        [jar]
[INFO] Phoenix Query Server                                               [jar]
[INFO] Phoenix - Pherf                                                    [jar]
[INFO] Phoenix - Spark                                                    [jar]
[INFO] Phoenix - Hive                                                     [jar]
[INFO] Phoenix Client                                                     [jar]
[INFO] Phoenix Server                                                     [jar]
[INFO] Phoenix Assembly                                                   [pom]
[INFO] Phoenix - Tracing Web Application                                  [jar]
[INFO] Phoenix Load Balancer                                              [jar]
[INFO] 
[INFO] ---------------------< org.apache.phoenix:phoenix >---------------------
[INFO] Building Apache Phoenix 4.14.0-HBase-1.2                          [1/15]
[INFO] --------------------------------[ pom ]---------------------------------
[INFO] 
[INFO] --- maven-clean-plugin:2.5:clean (default-clean) @ phoenix ---
[INFO] Deleting <https://builds.apache.org/job/Phoenix-4.x-HBase-1.2/ws/target>
[INFO] 
[INFO] --- maven-checkstyle-plugin:2.13:check (validate) @ phoenix ---
[INFO] 
[INFO] --- maven-remote-resources-plugin:1.5:process (default) @ phoenix ---
[INFO] 
[INFO] --- maven-source-plugin:2.2.1:jar-no-fork (attach-sources) @ phoenix ---
[INFO] 
[INFO] --- maven-jar-plugin:2.4:test-jar (default) @ phoenix ---
[WARNING] JAR will be empty - no content was marked for inclusion!
[INFO] Building jar: <https://builds.apache.org/job/Phoenix-4.x-HBase-1.2/443/artifact/target/phoenix-4.14.0-HBase-1.2-tests.jar>
[INFO] 
[INFO] --- maven-site-plugin:3.2:attach-descriptor (attach-descriptor) @ phoenix ---
[INFO] 
[INFO] --- maven-install-plugin:2.5.2:install (default-install) @ phoenix ---
[INFO] Installing <https://builds.apache.org/job/Phoenix-4.x-HBase-1.2/ws/pom.xml> to
/home/jenkins/.m2/repository/org/apache/phoenix/phoenix/4.14.0-HBase-1.2/phoenix-4.14.0-HBase-1.2.pom
[INFO] Installing <https://builds.apache.org/job/Phoenix-4.x-HBase-1.2/443/artifact/target/phoenix-4.14.0-HBase-1.2-tests.jar>
to /home/jenkins/.m2/repository/org/apache/phoenix/phoenix/4.14.0-HBase-1.2/phoenix-4.14.0-HBase-1.2-tests.jar
[INFO] 
[INFO] ------------------< org.apache.phoenix:phoenix-core >-------------------
[INFO] Building Phoenix Core 4.14.0-HBase-1.2                            [2/15]
[INFO] --------------------------------[ jar ]---------------------------------
[INFO] 
[INFO] --- maven-clean-plugin:2.5:clean (default-clean) @ phoenix-core ---
[INFO] Deleting <https://builds.apache.org/job/Phoenix-4.x-HBase-1.2/ws/phoenix-core/target>
[INFO] 
[INFO] --- maven-checkstyle-plugin:2.13:check (validate) @ phoenix-core ---
[INFO] 
[INFO] --- build-helper-maven-plugin:1.9.1:add-test-source (add-test-source) @ phoenix-core
---
[INFO] Test Source directory: <https://builds.apache.org/job/Phoenix-4.x-HBase-1.2/ws/phoenix-core/src/it/java>
added.
[INFO] 
[INFO] --- build-helper-maven-plugin:1.9.1:add-test-resource (add-test-resource) @ phoenix-core
---
[INFO] 
[INFO] --- build-helper-maven-plugin:1.9.1:add-source (add-source) @ phoenix-core ---
[INFO] Source directory: <https://builds.apache.org/job/Phoenix-4.x-HBase-1.2/ws/phoenix-core/target/generated-sources/antlr3>
added.
[INFO] Source directory: <https://builds.apache.org/job/Phoenix-4.x-HBase-1.2/ws/phoenix-core/src/main/antlr3>
added.
[INFO] 
[INFO] --- antlr3-maven-plugin:3.5.2:antlr (default) @ phoenix-core ---
[INFO] ANTLR: Processing source directory <https://builds.apache.org/job/Phoenix-4.x-HBase-1.2/ws/phoenix-core/src/main/antlr3>
ANTLR Parser Generator  Version 3.5.2
Output file <https://builds.apache.org/job/Phoenix-4.x-HBase-1.2/ws/phoenix-core/target/generated-sources/antlr3/org/apache/phoenix/parse/PhoenixSQLParser.java>
does not exist: must build <https://builds.apache.org/job/Phoenix-4.x-HBase-1.2/ws/phoenix-core/src/main/antlr3/PhoenixSQL.g>
PhoenixSQL.g
[INFO] 
[INFO] --- maven-dependency-plugin:2.1:build-classpath (create-phoenix-generated-classpath)
@ phoenix-core ---
[INFO] Wrote classpath file '<https://builds.apache.org/job/Phoenix-4.x-HBase-1.2/ws/phoenix-core/target/cached_classpath.txt'.>
[INFO] 
[INFO] --- maven-remote-resources-plugin:1.5:process (default) @ phoenix-core ---
[INFO] 
[INFO] --- maven-resources-plugin:2.6:resources (default-resources) @ phoenix-core ---
[INFO] Using 'UTF-8' encoding to copy filtered resources.
[INFO] Copying 1 resource to META-INF/services
[INFO] Copying 3 resources
[INFO] 
[INFO] --- maven-compiler-plugin:3.0:compile (default-compile) @ phoenix-core ---
[INFO] Changes detected - recompiling the module!
[INFO] Compiling 1087 source files to <https://builds.apache.org/job/Phoenix-4.x-HBase-1.2/ws/phoenix-core/target/classes>
[INFO] -------------------------------------------------------------
[WARNING] COMPILATION WARNING : 
[INFO] -------------------------------------------------------------
[WARNING] <https://builds.apache.org/job/Phoenix-4.x-HBase-1.2/ws/phoenix-core/src/main/java/org/apache/phoenix/execute/DescVarLengthFastByteComparisons.java>:[25,16]
sun.misc.Unsafe is internal proprietary API and may be removed in a future release
[WARNING] <https://builds.apache.org/job/Phoenix-4.x-HBase-1.2/ws/phoenix-core/src/main/java/org/apache/phoenix/execute/DescVarLengthFastByteComparisons.java>:[116,26]
sun.misc.Unsafe is internal proprietary API and may be removed in a future release
[WARNING] <https://builds.apache.org/job/Phoenix-4.x-HBase-1.2/ws/phoenix-core/src/main/java/org/apache/phoenix/execute/DescVarLengthFastByteComparisons.java>:[122,30]
sun.misc.Unsafe is internal proprietary API and may be removed in a future release
[WARNING] <https://builds.apache.org/job/Phoenix-4.x-HBase-1.2/ws/phoenix-core/src/main/java/org/apache/phoenix/execute/DescVarLengthFastByteComparisons.java>:[126,39]
sun.misc.Unsafe is internal proprietary API and may be removed in a future release
[WARNING] <https://builds.apache.org/job/Phoenix-4.x-HBase-1.2/ws/phoenix-core/src/main/java/org/apache/phoenix/compile/FromCompiler.java>:
Some input files use or override a deprecated API.
[WARNING] <https://builds.apache.org/job/Phoenix-4.x-HBase-1.2/ws/phoenix-core/src/main/java/org/apache/phoenix/compile/FromCompiler.java>:
Recompile with -Xlint:deprecation for details.
[WARNING] <https://builds.apache.org/job/Phoenix-4.x-HBase-1.2/ws/phoenix-core/src/main/java/org/apache/phoenix/parse/FunctionParseNode.java>:
Some input files use unchecked or unsafe operations.
[WARNING] <https://builds.apache.org/job/Phoenix-4.x-HBase-1.2/ws/phoenix-core/src/main/java/org/apache/phoenix/parse/FunctionParseNode.java>:
Recompile with -Xlint:unchecked for details.
[INFO] 8 warnings 
[INFO] -------------------------------------------------------------
[INFO] -------------------------------------------------------------
[ERROR] COMPILATION ERROR : 
[INFO] -------------------------------------------------------------
[ERROR] <https://builds.apache.org/job/Phoenix-4.x-HBase-1.2/ws/phoenix-core/src/main/java/org/apache/phoenix/util/csv/CsvUpsertExecutor.java>:[24,17]
cannot find symbol
  symbol:   class Base64
  location: package java.util
[ERROR] <https://builds.apache.org/job/Phoenix-4.x-HBase-1.2/ws/phoenix-core/src/main/java/org/apache/phoenix/util/json/JsonUpsertExecutor.java>:[25,17]
cannot find symbol
  symbol:   class Base64
  location: package java.util
[ERROR] <https://builds.apache.org/job/Phoenix-4.x-HBase-1.2/ws/phoenix-core/src/main/java/org/apache/phoenix/mapreduce/CsvBulkImportUtil.java>:[20,17]
cannot find symbol
  symbol:   class Base64
  location: package java.util
[ERROR] <https://builds.apache.org/job/Phoenix-4.x-HBase-1.2/ws/phoenix-core/src/main/java/org/apache/phoenix/mapreduce/util/PhoenixConfigurationUtil.java>:[27,17]
cannot find symbol
  symbol:   class Base64
  location: package java.util
[ERROR] <https://builds.apache.org/job/Phoenix-4.x-HBase-1.2/ws/phoenix-core/src/main/java/org/apache/phoenix/schema/types/PVarbinary.java>:[22,17]
cannot find symbol
  symbol:   class Base64
  location: package java.util
[ERROR] <https://builds.apache.org/job/Phoenix-4.x-HBase-1.2/ws/phoenix-core/src/main/java/org/apache/phoenix/util/csv/CsvUpsertExecutor.java>:[192,34]
cannot find symbol
  symbol:   variable Base64
  location: class org.apache.phoenix.util.csv.CsvUpsertExecutor.SimpleDatatypeConversionFunction
[ERROR] <https://builds.apache.org/job/Phoenix-4.x-HBase-1.2/ws/phoenix-core/src/main/java/org/apache/phoenix/util/json/JsonUpsertExecutor.java>:[215,30]
cannot find symbol
  symbol:   variable Base64
  location: class org.apache.phoenix.util.json.JsonUpsertExecutor.SimpleDatatypeConversionFunction
[ERROR] <https://builds.apache.org/job/Phoenix-4.x-HBase-1.2/ws/phoenix-core/src/main/java/org/apache/phoenix/mapreduce/CsvBulkImportUtil.java>:[73,42]
cannot find symbol
  symbol:   variable Base64
  location: class org.apache.phoenix.mapreduce.CsvBulkImportUtil
[ERROR] <https://builds.apache.org/job/Phoenix-4.x-HBase-1.2/ws/phoenix-core/src/main/java/org/apache/phoenix/mapreduce/CsvBulkImportUtil.java>:[82,27]
cannot find symbol
  symbol:   variable Base64
  location: class org.apache.phoenix.mapreduce.CsvBulkImportUtil
[ERROR] <https://builds.apache.org/job/Phoenix-4.x-HBase-1.2/ws/phoenix-core/src/main/java/org/apache/phoenix/mapreduce/util/PhoenixConfigurationUtil.java>:[510,16]
cannot find symbol
  symbol:   variable Base64
  location: class org.apache.phoenix.mapreduce.util.PhoenixConfigurationUtil
[ERROR] <https://builds.apache.org/job/Phoenix-4.x-HBase-1.2/ws/phoenix-core/src/main/java/org/apache/phoenix/mapreduce/util/PhoenixConfigurationUtil.java>:[517,60]
cannot find symbol
  symbol:   variable Base64
  location: class org.apache.phoenix.mapreduce.util.PhoenixConfigurationUtil
[ERROR] <https://builds.apache.org/job/Phoenix-4.x-HBase-1.2/ws/phoenix-core/src/main/java/org/apache/phoenix/schema/types/PVarbinary.java>:[134,25]
cannot find symbol
  symbol:   variable Base64
  location: class org.apache.phoenix.schema.types.PVarbinary
[INFO] 12 errors 
[INFO] -------------------------------------------------------------
[INFO] ------------------------------------------------------------------------
[INFO] Reactor Summary:
[INFO] 
[INFO] Apache Phoenix 4.14.0-HBase-1.2 .................... SUCCESS [  1.811 s]
[INFO] Phoenix Core ....................................... FAILURE [ 22.860 s]
[INFO] Phoenix - Flume .................................... SKIPPED
[INFO] Phoenix - Kafka .................................... SKIPPED
[INFO] Phoenix - Pig ...................................... SKIPPED
[INFO] Phoenix Query Server Client ........................ SKIPPED
[INFO] Phoenix Query Server ............................... SKIPPED
[INFO] Phoenix - Pherf .................................... SKIPPED
[INFO] Phoenix - Spark .................................... SKIPPED
[INFO] Phoenix - Hive ..................................... SKIPPED
[INFO] Phoenix Client ..................................... SKIPPED
[INFO] Phoenix Server ..................................... SKIPPED
[INFO] Phoenix Assembly ................................... SKIPPED
[INFO] Phoenix - Tracing Web Application .................. SKIPPED
[INFO] Phoenix Load Balancer 4.14.0-HBase-1.2 ............. SKIPPED
[INFO] ------------------------------------------------------------------------
[INFO] BUILD FAILURE
[INFO] ------------------------------------------------------------------------
[INFO] Total time: 26.154 s
[INFO] Finished at: 2018-09-07T17:51:15Z
[INFO] ------------------------------------------------------------------------
[ERROR] Failed to execute goal org.apache.maven.plugins:maven-compiler-plugin:3.0:compile
(default-compile) on project phoenix-core: Compilation failure: Compilation failure: 
[ERROR] <https://builds.apache.org/job/Phoenix-4.x-HBase-1.2/ws/phoenix-core/src/main/java/org/apache/phoenix/util/csv/CsvUpsertExecutor.java>:[24,17]
cannot find symbol
[ERROR]   symbol:   class Base64
[ERROR]   location: package java.util
[ERROR] <https://builds.apache.org/job/Phoenix-4.x-HBase-1.2/ws/phoenix-core/src/main/java/org/apache/phoenix/util/json/JsonUpsertExecutor.java>:[25,17]
cannot find symbol
[ERROR]   symbol:   class Base64
[ERROR]   location: package java.util
[ERROR] <https://builds.apache.org/job/Phoenix-4.x-HBase-1.2/ws/phoenix-core/src/main/java/org/apache/phoenix/mapreduce/CsvBulkImportUtil.java>:[20,17]
cannot find symbol
[ERROR]   symbol:   class Base64
[ERROR]   location: package java.util
[ERROR] <https://builds.apache.org/job/Phoenix-4.x-HBase-1.2/ws/phoenix-core/src/main/java/org/apache/phoenix/mapreduce/util/PhoenixConfigurationUtil.java>:[27,17]
cannot find symbol
[ERROR]   symbol:   class Base64
[ERROR]   location: package java.util
[ERROR] <https://builds.apache.org/job/Phoenix-4.x-HBase-1.2/ws/phoenix-core/src/main/java/org/apache/phoenix/schema/types/PVarbinary.java>:[22,17]
cannot find symbol
[ERROR]   symbol:   class Base64
[ERROR]   location: package java.util
[ERROR] <https://builds.apache.org/job/Phoenix-4.x-HBase-1.2/ws/phoenix-core/src/main/java/org/apache/phoenix/util/csv/CsvUpsertExecutor.java>:[192,34]
cannot find symbol
[ERROR]   symbol:   variable Base64
[ERROR]   location: class org.apache.phoenix.util.csv.CsvUpsertExecutor.SimpleDatatypeConversionFunction
[ERROR] <https://builds.apache.org/job/Phoenix-4.x-HBase-1.2/ws/phoenix-core/src/main/java/org/apache/phoenix/util/json/JsonUpsertExecutor.java>:[215,30]
cannot find symbol
[ERROR]   symbol:   variable Base64
[ERROR]   location: class org.apache.phoenix.util.json.JsonUpsertExecutor.SimpleDatatypeConversionFunction
[ERROR] <https://builds.apache.org/job/Phoenix-4.x-HBase-1.2/ws/phoenix-core/src/main/java/org/apache/phoenix/mapreduce/CsvBulkImportUtil.java>:[73,42]
cannot find symbol
[ERROR]   symbol:   variable Base64
[ERROR]   location: class org.apache.phoenix.mapreduce.CsvBulkImportUtil
[ERROR] <https://builds.apache.org/job/Phoenix-4.x-HBase-1.2/ws/phoenix-core/src/main/java/org/apache/phoenix/mapreduce/CsvBulkImportUtil.java>:[82,27]
cannot find symbol
[ERROR]   symbol:   variable Base64
[ERROR]   location: class org.apache.phoenix.mapreduce.CsvBulkImportUtil
[ERROR] <https://builds.apache.org/job/Phoenix-4.x-HBase-1.2/ws/phoenix-core/src/main/java/org/apache/phoenix/mapreduce/util/PhoenixConfigurationUtil.java>:[510,16]
cannot find symbol
[ERROR]   symbol:   variable Base64
[ERROR]   location: class org.apache.phoenix.mapreduce.util.PhoenixConfigurationUtil
[ERROR] <https://builds.apache.org/job/Phoenix-4.x-HBase-1.2/ws/phoenix-core/src/main/java/org/apache/phoenix/mapreduce/util/PhoenixConfigurationUtil.java>:[517,60]
cannot find symbol
[ERROR]   symbol:   variable Base64
[ERROR]   location: class org.apache.phoenix.mapreduce.util.PhoenixConfigurationUtil
[ERROR] <https://builds.apache.org/job/Phoenix-4.x-HBase-1.2/ws/phoenix-core/src/main/java/org/apache/phoenix/schema/types/PVarbinary.java>:[134,25]
cannot find symbol
[ERROR]   symbol:   variable Base64
[ERROR]   location: class org.apache.phoenix.schema.types.PVarbinary
[ERROR] -> [Help 1]
[ERROR] 
[ERROR] To see the full stack trace of the errors, re-run Maven with the -e switch.
[ERROR] Re-run Maven using the -X switch to enable full debug logging.
[ERROR] 
[ERROR] For more information about the errors and possible solutions, please read the following
articles:
[ERROR] [Help 1] http://cwiki.apache.org/confluence/display/MAVEN/MojoFailureException
[ERROR] 
[ERROR] After correcting the problems, you can resume the build with the command
[ERROR]   mvn <goals> -rf :phoenix-core
Build step 'Invoke top-level Maven targets' marked build as failure
Archiving artifacts
Recording test results
ERROR: Step ?Publish JUnit test result report? failed: No test report files were found. Configuration
error?
Not sending mail to unregistered user k.mehta@salesforce.com
Not sending mail to unregistered user ankitsinghal59@gmail.com

Mime
View raw message