phoenix-commits mailing list archives

Site index · List index
Message view « Date » · « Thread »
Top « Date » · « Thread »
From Apache Jenkins Server <jenk...@builds.apache.org>
Subject Build failed in Jenkins: Phoenix | Master #2139
Date Wed, 26 Sep 2018 18:47:52 GMT
See <https://builds.apache.org/job/Phoenix-master/2139/display/redirect?page=changes>

Changes:

[larsh] PHOENIX-4849 Phoenix may generate incorrectly replace

------------------------------------------
[...truncated 582.75 KB...]
Downloading from central: https://repo.maven.apache.org/maven2/com/google/guava/guava/13.0.1/guava-13.0.1.jar
Downloading from central: https://repo.maven.apache.org/maven2/joda-time/joda-time/1.6/joda-time-1.6.jar
Downloaded from central: https://repo.maven.apache.org/maven2/it/unimi/dsi/fastutil/6.5.6/fastutil-6.5.6.jar (0 B at 0 B/s)
Downloading from central: https://repo.maven.apache.org/maven2/org/mockito/mockito-all/1.8.5/mockito-all-1.8.5.jar
Downloaded from central: https://repo.maven.apache.org/maven2/org/ow2/asm/asm-all/5.0.2/asm-all-5.0.2.jar (0 B at 0 B/s)
Downloading from central: https://repo.maven.apache.org/maven2/com/github/stephenc/high-scale-lib/high-scale-lib/1.1.1/high-scale-lib-1.1.1.jar
Progress (1): 0/1.4 MBProgress (1): 0/1.4 MBProgress (1): 0/1.4 MBProgress (1): 0/1.4 MBProgress (1): 0/1.4 MBProgress (1): 0/1.4 MBProgress (1): 0/1.4 MBProgress (1): 0/1.4 MBProgress (2): 0/1.4 MB | 2.2/96 kBProgress (2): 0/1.4 MB | 2.2/96 kBProgress (2): 0/1.4 MB | 5.0/96 kBProgress (2): 0/1.4 MB | 5.0/96 kBProgress (2): 0/1.4 MB | 7.7/96 kBProgress (2): 0/1.4 MB | 7.7/96 kBProgress (2): 0/1.4 MB | 10/96 kB Progress (2): 0/1.4 MB | 10/96 kBProgress (2): 0/1.4 MB | 13/96 kBProgress (2): 0/1.4 MB | 16/96 kBProgress (2): 0/1.4 MB | 19/96 kBProgress (2): 0/1.4 MB | 21/96 kBProgress (2): 0/1.4 MB | 24/96 kBProgress (2): 0/1.4 MB | 27/96 kBProgress (2): 0/1.4 MB | 30/96 kBProgress (2): 0/1.4 MB | 32/96 kBProgress (2): 0/1.4 MB | 32/96 kBProgress (2): 0/1.4 MB | 32/96 kBProgress (2): 0/1.4 MB | 32/96 kBProgress (2): 0/1.4 MB | 32/96 kBProgress (2): 0/1.4 MB | 36/96 kBProgress (2): 0/1.4 MB | 40/96 kBProgress (2): 0/1.4 MB | 45/96 kBProgress (2): 0/1.4 MB | 49/96 kBProgress (2): 0.1/1.4 MB | 49/96 kBProgress (2): 0.1/1.4 MB | 49/96 kBProgress (2): 0.1/1.4 MB | 49/96 kBProgress (2): 0.1/1.4 MB | 49/96 kBProgress (2): 0.1/1.4 MB | 53/96 kBProgress (2): 0.1/1.4 MB | 57/96 kBProgress (2): 0.1/1.4 MB | 61/96 kBProgress (2): 0.1/1.4 MB | 65/96 kBProgress (2): 0.1/1.4 MB | 69/96 kBProgress (2): 0.1/1.4 MB | 69/96 kBProgress (2): 0.1/1.4 MB | 73/96 kBProgress (2): 0.1/1.4 MB | 73/96 kBProgress (2): 0.1/1.4 MB | 77/96 kBProgress (2): 0.1/1.4 MB | 77/96 kBProgress (2): 0.1/1.4 MB | 81/96 kBProgress (2): 0.1/1.4 MB | 81/96 kBProgress (2): 0.1/1.4 MB | 81/96 kBProgress (2): 0.1/1.4 MB | 81/96 kBProgress (2): 0.1/1.4 MB | 85/96 kBProgress (2): 0.1/1.4 MB | 85/96 kBProgress (2): 0.1/1.4 MB | 90/96 kBProgress (2): 0.1/1.4 MB | 90/96 kBProgress (2): 0.1/1.4 MB | 94/96 kBProgress (2): 0.1/1.4 MB | 96 kB   Progress (2): 0.1/1.4 MB | 96 kBProgress (2): 0.1/1.4 MB | 96 kBProgress (2): 0.1/1.4 MB | 96 kBProgress (2): 0.1/1.4 MB | 96 kBProgress (2): 0.1/1.4 MB | 96 kBProgress (2): 0.1/1.4 MB | 96 kBProgress (2): 0.1/1.4 MB | 96 kBProgress (2): 0.1/1.4 MB | 96 kBProgress (2): 0.1/1.4 MB | 96 kBProgress (2): 0.1/1.4 MB | 96 kBProgress (2): 0.1/1.4 MB | 96 kB                                Downloaded from central: https://repo.maven.apache.org/maven2/sqlline/sqlline/1.2.0/sqlline-1.2.0.jar (0 B at 0 B/s)
Progress (2): 0.1/1.4 MB | 96 kB                                Downloading from central: https://repo.maven.apache.org/maven2/com/yammer/metrics/metrics-core/2.1.2/metrics-core-2.1.2.jar
Downloaded from central: https://repo.maven.apache.org/maven2/com/github/stephenc/high-scale-lib/high-scale-lib/1.1.1/high-scale-lib-1.1.1.jar (96 kB at 2.5 MB/s)
Downloading from central: https://repo.maven.apache.org/maven2/org/glassfish/jersey/core/jersey-client/2.25.1/jersey-client-2.25.1.jar
Progress (1): 0.2/1.4 MBProgress (1): 0.2/1.4 MBProgress (1): 0.2/1.4 MBProgress (1): 0.2/1.4 MBProgress (1): 0.2/1.4 MBProgress (2): 0.2/1.4 MB | 0/1.9 MBProgress (2): 0.2/1.4 MB | 0/1.9 MBProgress (2): 0.2/1.4 MB | 0/1.9 MBProgress (2): 0.2/1.4 MB | 0/1.9 MBProgress (2): 0.2/1.4 MB | 0/1.9 MBProgress (2): 0.2/1.4 MB | 0/1.9 MBProgress (2): 0.2/1.4 MB | 0/1.9 MBProgress (2): 0.2/1.4 MB | 0/1.9 MBProgress (2): 0.2/1.4 MB | 0/1.9 MBProgress (2): 0.2/1.4 MB | 0/1.9 MBProgress (2): 0.2/1.4 MB | 0/1.9 MBProgress (2): 0.2/1.4 MB | 0/1.9 MBProgress (2): 0.2/1.4 MB | 0/1.9 MBProgress (2): 0.2/1.4 MB | 0/1.9 MBProgress (2): 0.2/1.4 MB | 0/1.9 MBProgress (2): 0.2/1.4 MB | 0/1.9 MBProgress (2): 0.2/1.4 MB | 0/1.9 MBProgress (2): 0.2/1.4 MB | 0/1.9 MBProgress (2): 0.2/1.4 MB | 0/1.9 MBProgress (2): 0.2/1.4 MB | 0/1.9 MBProgress (2): 0.2/1.4 MB | 0/1.9 MBProgress (2): 0.2/1.4 MB | 0/1.9 MB                                   Downloaded from central: https://repo.maven.apache.org/maven2/org/glassfish/jersey/core/jersey-client/2.25.1/jersey-client-2.25.1.jar (0 B at 0 B/s)
Progress (2): 0.2/1.4 MB | 0/1.9 MB                                   Downloading from central: https://repo.maven.apache.org/maven2/org/glassfish/jersey/core/jersey-common/2.25.1/jersey-common-2.25.1.jar
Progress (3): 0.2/1.4 MB | 0/1.9 MB | 4.1/82 kBProgress (3): 0.2/1.4 MB | 0/1.9 MB | 7.7/82 kBProgress (3): 0.2/1.4 MB | 0/1.9 MB | 12/82 kB Progress (3): 0.2/1.4 MB | 0/1.9 MB | 12/82 kBProgress (3): 0.2/1.4 MB | 0/1.9 MB | 16/82 kBProgress (3): 0.2/1.4 MB | 0/1.9 MB | 16/82 kBProgress (3): 0.2/1.4 MB | 0/1.9 MB | 16/82 kBProgress (3): 0.2/1.4 MB | 0/1.9 MB | 16/82 kB                                              Downloaded from central: https://repo.maven.apache.org/maven2/joda-time/joda-time/1.6/joda-time-1.6.jar (0 B at 0 B/s)
Progress (3): 0.2/1.4 MB | 0/1.9 MB | 20/82 kBProgress (3): 0.2/1.4 MB | 0/1.9 MB | 20/82 kB                                              Downloading from central: https://repo.maven.apache.org/maven2/org/glassfish/jersey/bundles/repackaged/jersey-guava/2.25.1/jersey-guava-2.25.1.jar
Progress (3): 0.2/1.4 MB | 0/1.9 MB | 20/82 kBProgress (3): 0.2/1.4 MB | 0/1.9 MB | 24/82 kBProgress (3): 0.2/1.4 MB | 0/1.9 MB | 24/82 kBProgress (3): 0.2/1.4 MB | 0/1.9 MB | 24/82 kBProgress (3): 0.2/1.4 MB | 0/1.9 MB | 24/82 kBProgress (3): 0.2/1.4 MB | 0/1.9 MB | 28/82 kBProgress (3): 0.2/1.4 MB | 0/1.9 MB | 28/82 kBProgress (3): 0.2/1.4 MB | 0/1.9 MB | 32/82 kBProgress (3): 0.2/1.4 MB | 0/1.9 MB | 32/82 kBProgress (3): 0.2/1.4 MB | 0/1.9 MB | 32/82 kBProgress (3): 0.2/1.4 MB | 0/1.9 MB | 36/82 kBProgress (3): 0.2/1.4 MB | 0/1.9 MB | 36/82 kBProgress (3): 0.2/1.4 MB | 0/1.9 MB | 40/82 kBProgress (3): 0.3/1.4 MB | 0/1.9 MB | 40/82 kBProgress (3): 0.3/1.4 MB | 0.1/1.9 MB | 40/82 kBProgress (3): 0.3/1.4 MB | 0.1/1.9 MB | 40/82 kBProgress (3): 0.3/1.4 MB | 0.1/1.9 MB | 45/82 kBProgress (3): 0.3/1.4 MB | 0.1/1.9 MB | 45/82 kBProgress (3): 0.3/1.4 MB | 0.1/1.9 MB | 45/82 kBProgress (3): 0.3/1.4 MB | 0.1/1.9 MB | 49/82 kBProgress (3): 0.3/1.4 MB | 0.1/1.9 MB | 49/82 kBProgress (3): 0.3/1.4 MB | 0.1/1.9 MB | 49/82 kBProgress (3): 0.3/1.4 MB | 0.1/1.9 MB | 53/82 kB                                                Downloaded from central: https://repo.maven.apache.org/maven2/org/glassfish/jersey/core/jersey-common/2.25.1/jersey-common-2.25.1.jar (0 B at 0 B/s)
Downloading from central: https://repo.maven.apache.org/maven2/org/glassfish/hk2/hk2-api/2.5.0-b32/hk2-api-2.5.0-b32.jar
Progress (3): 0.3/1.4 MB | 0.1/1.9 MB | 53/82 kBProgress (3): 0.3/1.4 MB | 0.1/1.9 MB | 53/82 kBProgress (3): 0.3/1.4 MB | 0.1/1.9 MB | 57/82 kBProgress (3): 0.3/1.4 MB | 0.1/1.9 MB | 57/82 kBProgress (3): 0.3/1.4 MB | 0.1/1.9 MB | 57/82 kBProgress (3): 0.3/1.4 MB | 0.1/1.9 MB | 57/82 kBProgress (3): 0.3/1.4 MB | 0.1/1.9 MB | 61/82 kBProgress (3): 0.3/1.4 MB | 0.1/1.9 MB | 61/82 kBProgress (3): 0.3/1.4 MB | 0.1/1.9 MB | 61/82 kBProgress (3): 0.3/1.4 MB | 0.1/1.9 MB | 65/82 kBProgress (3): 0.3/1.4 MB | 0.1/1.9 MB | 65/82 kBProgress (3): 0.3/1.4 MB | 0.1/1.9 MB | 65/82 kBProgress (3): 0.3/1.4 MB | 0.1/1.9 MB | 69/82 kBProgress (3): 0.3/1.4 MB | 0.1/1.9 MB | 69/82 kBProgress (3): 0.3/1.4 MB | 0.1/1.9 MB | 73/82 kBProgress (3): 0.3/1.4 MB | 0.1/1.9 MB | 73/82 kBProgress (3): 0.3/1.4 MB | 0.1/1.9 MB | 77/82 kBProgress (3): 0.3/1.4 MB | 0.1/1.9 MB | 77/82 kBProgress (3): 0.3/1.4 MB | 0.1/1.9 MB | 81/82 kBProgress (3): 0.3/1.4 MB | 0.1/1.9 MB | 81/82 kBProgress (3): 0.3/1.4 MB | 0.1/1.9 MB | 82 kB   Progress (3): 0.3/1.4 MB | 0.1/1.9 MB | 82 kBProgress (3): 0.3/1.4 MB | 0.1/1.9 MB | 82 kBProgress (3): 0.3/1.4 MB | 0.1/1.9 MB | 82 kBProgress (3): 0.3/1.4 MB | 0.1/1.9 MB | 82 kBProgress (3): 0.3/1.4 MB | 0.1/1.9 MB | 82 kBProgress (3): 0.3/1.4 MB | 0.1/1.9 MB | 82 kBProgress (3): 0.3/1.4 MB | 0.1/1.9 MB | 82 kBProgress (3): 0.3/1.4 MB | 0.1/1.9 MB | 82 kBProgress (3): 0.3/1.4 MB | 0.1/1.9 MB | 82 kBProgress (3): 0.3/1.4 MB | 0.1/1.9 MB | 82 kBProgress (3): 0.3/1.4 MB | 0.1/1.9 MB | 82 kBProgress (3): 0.3/1.4 MB | 0.1/1.9 MB | 82 kBProgress (3): 0.3/1.4 MB | 0.1/1.9 MB | 82 kB                                             Downloaded from central: https://repo.maven.apache.org/maven2/org/glassfish/hk2/hk2-api/2.5.0-b32/hk2-api-2.5.0-b32.jar (0 B at 0 B/s)
Progress (3): 0.3/1.4 MB | 0.1/1.9 MB | 82 kB                                             Downloading from central: https://repo.maven.apache.org/maven2/org/glassfish/hk2/hk2-utils/2.5.0-b32/hk2-utils-2.5.0-b32.jar
Downloaded from central: https://repo.maven.apache.org/maven2/org/glassfish/jersey/bundles/repackaged/jersey-guava/2.25.1/jersey-guava-2.25.1.jar (0 B at 0 B/s)
Progress (3): 0.3/1.4 MB | 0.1/1.9 MB | 82 kB                                             Downloading from central: https://repo.maven.apache.org/maven2/org/glassfish/hk2/external/aopalliance-repackaged/2.5.0-b32/aopalliance-repackaged-2.5.0-b32.jar
Progress (3): 0.3/1.4 MB | 0.1/1.9 MB | 82 kBProgress (3): 0.3/1.4 MB | 0.1/1.9 MB | 82 kBProgress (3): 0.3/1.4 MB | 0.1/1.9 MB | 82 kBProgress (3): 0.3/1.4 MB | 0.1/1.9 MB | 82 kBProgress (3): 0.3/1.4 MB | 0.1/1.9 MB | 82 kBProgress (3): 0.3/1.4 MB | 0.1/1.9 MB | 82 kBProgress (3): 0.3/1.4 MB | 0.1/1.9 MB | 82 kBProgress (3): 0.3/1.4 MB | 0.1/1.9 MB | 82 kBProgress (3): 0.3/1.4 MB | 0.1/1.9 MB | 82 kBProgress (3): 0.3/1.4 MB | 0.1/1.9 MB | 82 kB                                             Downloaded from central: https://repo.maven.apache.org/maven2/com/yammer/metrics/metrics-core/2.1.2/metrics-core-2.1.2.jar (82 kB at 1.3 MB/s)
Progress (2): 0.3/1.4 MB | 0.1/1.9 MBProgress (2): 0.3/1.4 MB | 0.1/1.9 MB                                     Downloading from central: https://repo.maven.apache.org/maven2/org/glassfish/hk2/external/javax.inject/2.5.0-b32/javax.inject-2.5.0-b32.jar
Progress (2): 0.3/1.4 MB | 0.1/1.9 MBProgress (2): 0.4/1.4 MB | 0.1/1.9 MBProgress (2): 0.4/1.4 MB | 0.2/1.9 MBProgress (2): 0.4/1.4 MB | 0.2/1.9 MBProgress (2): 0.4/1.4 MB | 0.2/1.9 MBProgress (2): 0.4/1.4 MB | 0.2/1.9 MBProgress (2): 0.4/1.4 MB | 0.2/1.9 MBProgress (2): 0.4/1.4 MB | 0.2/1.9 MB                                     Downloaded from central: https://repo.maven.apache.org/maven2/org/glassfish/hk2/hk2-utils/2.5.0-b32/hk2-utils-2.5.0-b32.jar (0 B at 0 B/s)
Progress (2): 0.4/1.4 MB | 0.2/1.9 MB                                     Downloading from central: https://repo.maven.apache.org/maven2/org/glassfish/hk2/hk2-locator/2.5.0-b32/hk2-locator-2.5.0-b32.jar
Progress (2): 0.4/1.4 MB | 0.2/1.9 MBProgress (2): 0.4/1.4 MB | 0.2/1.9 MBProgress (2): 0.4/1.4 MB | 0.2/1.9 MBProgress (2): 0.4/1.4 MB | 0.2/1.9 MBProgress (2): 0.4/1.4 MB | 0.2/1.9 MBProgress (2): 0.4/1.4 MB | 0.2/1.9 MBProgress (2): 0.4/1.4 MB | 0.2/1.9 MBProgress (2): 0.4/1.4 MB | 0.2/1.9 MBProgress (2): 0.4/1.4 MB | 0.2/1.9 MBProgress (2): 0.4/1.4 MB | 0.2/1.9 MBProgress (2): 0.4/1.4 MB | 0.2/1.9 MBProgress (2): 0.4/1.4 MB | 0.2/1.9 MBProgress (2): 0.4/1.4 MB | 0.2/1.9 MBProgress (2): 0.4/1.4 MB | 0.2/1.9 MBProgress (2): 0.4/1.4 MB | 0.2/1.9 MB                                     Downloaded from central: https://repo.maven.apache.org/maven2/org/glassfish/hk2/external/aopalliance-repackaged/2.5.0-b32/aopalliance-repackaged-2.5.0-b32.jar (0 B at 0 B/s)
Progress (2): 0.4/1.4 MB | 0.2/1.9 MBProgress (2): 0.4/1.4 MB | 0.2/1.9 MB                                     Downloaded from central: https://repo.maven.apache.org/maven2/org/glassfish/hk2/external/javax.inject/2.5.0-b32/javax.inject-2.5.0-b32.jar (0 B at 0 B/s)
Progress (2): 0.4/1.4 MB | 0.2/1.9 MBProgress (2): 0.4/1.4 MB | 0.2/1.9 MB                                     Downloading from central: https://repo.maven.apache.org/maven2/org/jruby/jcodings/jcodings/1.0.18/jcodings-1.0.18.jar
Progress (2): 0.4/1.4 MB | 0.2/1.9 MBProgress (2): 0.4/1.4 MB | 0.2/1.9 MB                                     Downloading from central: https://repo.maven.apache.org/maven2/org/glassfish/jersey/core/jersey-server/2.25.1/jersey-server-2.25.1.jar
Downloaded from central: https://repo.maven.apache.org/maven2/org/glassfish/hk2/hk2-locator/2.5.0-b32/hk2-locator-2.5.0-b32.jar (0 B at 0 B/s)
Progress (2): 0.4/1.4 MB | 0.2/1.9 MBProgress (2): 0.4/1.4 MB | 0.2/1.9 MB                                     Downloading from central: https://repo.maven.apache.org/maven2/org/glassfish/jersey/media/jersey-media-jaxb/2.25.1/jersey-media-jaxb-2.25.1.jar
Progress (2): 0.4/1.4 MB | 0.2/1.9 MBProgress (2): 0.4/1.4 MB | 0.2/1.9 MBProgress (2): 0.4/1.4 MB | 0.2/1.9 MBProgress (2): 0.4/1.4 MB | 0.2/1.9 MBProgress (2): 0.4/1.4 MB | 0.2/1.9 MBProgress (2): 0.4/1.4 MB | 0.2/1.9 MBProgress (2): 0.4/1.4 MB | 0.2/1.9 MBProgress (2): 0.4/1.4 MB | 0.2/1.9 MBProgress (2): 0.4/1.4 MB | 0.2/1.9 MBProgress (2): 0.4/1.4 MB | 0.2/1.9 MBProgress (2): 0.4/1.4 MB | 0.2/1.9 MBProgress (2): 0.4/1.4 MB | 0.2/1.9 MBProgress (2): 0.4/1.4 MB | 0.2/1.9 MBProgress (2): 0.4/1.4 MB | 0.2/1.9 MBProgress (2): 0.4/1.4 MB | 0.2/1.9 MBProgress (2): 0.4/1.4 MB | 0.2/1.9 MBProgress (2): 0.4/1.4 MB | 0.2/1.9 MBProgress (2): 0.4/1.4 MB | 0.3/1.9 MBProgress (2): 0.4/1.4 MB | 0.3/1.9 MBProgress (2): 0.4/1.4 MB | 0.3/1.9 MBProgress (2): 0.5/1.4 MB | 0.3/1.9 MBProgress (2): 0.5/1.4 MB | 0.3/1.9 MBProgress (2): 0.5/1.4 MB | 0.3/1.9 MBProgress (2): 0.5/1.4 MB | 0.3/1.9 MB                                     Downloaded from central: https://repo.maven.apache.org/maven2/org/glassfish/jersey/core/jersey-server/2.25.1/jersey-server-2.25.1.jar (0 B at 0 B/s)
Downloading from central: https://repo.maven.apache.org/maven2/org/glassfish/jersey/containers/jersey-container-servlet-core/2.25.1/jersey-container-servlet-core-2.25.1.jar
Downloaded from central: https://repo.maven.apache.org/maven2/org/glassfish/jersey/media/jersey-media-jaxb/2.25.1/jersey-media-jaxb-2.25.1.jar (0 B at 0 B/s)
Progress (2): 0.5/1.4 MB | 0.3/1.9 MB                                     Downloading from central: https://repo.maven.apache.org/maven2/org/codehaus/jettison/jettison/1.3.8/jettison-1.3.8.jar
Progress (2): 0.5/1.4 MB | 0.3/1.9 MBProgress (2): 0.5/1.4 MB | 0.3/1.9 MBProgress (2): 0.5/1.4 MB | 0.3/1.9 MBProgress (2): 0.5/1.4 MB | 0.3/1.9 MBProgress (2): 0.5/1.4 MB | 0.3/1.9 MBProgress (2): 0.5/1.4 MB | 0.3/1.9 MBProgress (2): 0.5/1.4 MB | 0.3/1.9 MBProgress (2): 0.5/1.4 MB | 0.3/1.9 MBProgress (2): 0.5/1.4 MB | 0.3/1.9 MBProgress (2): 0.5/1.4 MB | 0.3/1.9 MBProgress (2): 0.5/1.4 MB | 0.3/1.9 MBProgress (2): 0.5/1.4 MB | 0.3/1.9 MBProgress (2): 0.5/1.4 MB | 0.3/1.9 MBProgress (2): 0.5/1.4 MB | 0.3/1.9 MBProgress (2): 0.5/1.4 MB | 0.3/1.9 MBProgress (2): 0.5/1.4 MB | 0.3/1.9 MBProgress (2): 0.5/1.4 MB | 0.3/1.9 MBProgress (2): 0.5/1.4 MB | 0.3/1.9 MBProgress (2): 0.5/1.4 MB | 0.3/1.9 MBProgress (2): 0.5/1.4 MB | 0.3/1.9 MBProgress (2): 0.5/1.4 MB | 0.3/1.9 MBProgress (2): 0.5/1.4 MB | 0.3/1.9 MBProgress (2): 0.5/1.4 MB | 0.3/1.9 MB                                     Downloaded from central: https://repo.maven.apache.org/maven2/org/jruby/jcodings/jcodings/1.0.18/jcodings-1.0.18.jar (0 B at 0 B/s)
Downloaded from central: https://repo.maven.apache.org/maven2/org/glassfish/jersey/containers/jersey-container-servlet-core/2.25.1/jersey-container-servlet-core-2.25.1.jar (0 B at 0 B/s)
Progress (2): 0.5/1.4 MB | 0.3/1.9 MBProgress (2): 0.5/1.4 MB | 0.3/1.9 MB                                     Downloading from central: https://repo.maven.apache.org/maven2/org/eclipse/jetty/jetty-http/9.3.19.v20170502/jetty-http-9.3.19.v20170502.jar
Progress (2): 0.5/1.4 MB | 0.3/1.9 MBProgress (2): 0.5/1.4 MB | 0.3/1.9 MB                                     Downloading from central: https://repo.maven.apache.org/maven2/org/eclipse/jetty/jetty-util/9.3.19.v20170502/jetty-util-9.3.19.v20170502.jar
Progress (2): 0.5/1.4 MB | 0.3/1.9 MBProgress (2): 0.5/1.4 MB | 0.3/1.9 MBProgress (2): 0.5/1.4 MB | 0.3/1.9 MBProgress (2): 0.5/1.4 MB | 0.3/1.9 MBProgress (3): 0.5/1.4 MB | 0.3/1.9 MB | 2.2/88 kBProgress (3): 0.5/1.4 MB | 0.3/1.9 MB | 5.0/88 kBProgress (3): 0.5/1.4 MB | 0.3/1.9 MB | 5.0/88 kBProgress (3): 0.5/1.4 MB | 0.3/1.9 MB | 5.0/88 kBProgress (3): 0.5/1.4 MB | 0.3/1.9 MB | 7.7/88 kBProgress (3): 0.5/1.4 MB | 0.3/1.9 MB | 7.7/88 kBProgress (3): 0.5/1.4 MB | 0.3/1.9 MB | 7.7/88 kBProgress (3): 0.5/1.4 MB | 0.3/1.9 MB | 7.7/88 kBProgress (3): 0.5/1.4 MB | 0.3/1.9 MB | 10/88 kB Progress (3): 0.5/1.4 MB | 0.3/1.9 MB | 10/88 kBProgress (3): 0.5/1.4 MB | 0.3/1.9 MB | 10/88 kBProgress (3): 0.5/1.4 MB | 0.3/1.9 MB | 13/88 kBProgress (3): 0.5/1.4 MB | 0.3/1.9 MB | 13/88 kBProgress (3): 0.5/1.4 MB | 0.3/1.9 MB | 13/88 kBProgress (3): 0.5/1.4 MB | 0.3/1.9 MB | 13/88 kBProgress (3): 0.6/1.4 MB | 0.3/1.9 MB | 13/88 kBProgress (3): 0.6/1.4 MB | 0.3/1.9 MB | 13/88 kBProgress (3): 0.6/1.4 MB | 0.3/1.9 MB | 13/88 kBProgress (3): 0.6/1.4 MB | 0.4/1.9 MB | 13/88 kBProgress (3): 0.6/1.4 MB | 0.4/1.9 MB | 13/88 kBProgress (3): 0.6/1.4 MB | 0.4/1.9 MB | 13/88 kBProgress (3): 0.6/1.4 MB | 0.4/1.9 MB | 13/88 kBProgress (3): 0.6/1.4 MB | 0.4/1.9 MB | 16/88 kB                                                Downloaded from central: https://repo.maven.apache.org/maven2/org/eclipse/jetty/jetty-http/9.3.19.v20170502/jetty-http-9.3.19.v20170502.jar (0 B at 0 B/s)
Progress (3): 0.6/1.4 MB | 0.4/1.9 MB | 19/88 kBProgress (3): 0.6/1.4 MB | 0.4/1.9 MB | 19/88 kBProgress (3): 0.6/1.4 MB | 0.4/1.9 MB | 19/88 kBProgress (3): 0.6/1.4 MB | 0.4/1.9 MB | 19/88 kBProgress (3): 0.6/1.4 MB | 0.4/1.9 MB | 21/88 kB                                                Downloading from central: https://repo.maven.apache.org/maven2/org/eclipse/jetty/jetty-security/9.3.19.v20170502/jetty-security-9.3.19.v20170502.jar
Progress (3): 0.6/1.4 MB | 0.4/1.9 MB | 24/88 kBProgress (3): 0.6/1.4 MB | 0.4/1.9 MB | 24/88 kBProgress (3): 0.6/1.4 MB | 0.4/1.9 MB | 27/88 kB                                                Downloaded from central: https://repo.maven.apache.org/maven2/org/eclipse/jetty/jetty-util/9.3.19.v20170502/jetty-util-9.3.19.v20170502.jar (0 B at 0 B/s)
Progress (3): 0.6/1.4 MB | 0.4/1.9 MB | 27/88 kB                                                Downloading from central: https://repo.maven.apache.org/maven2/org/eclipse/jetty/jetty-server/9.3.19.v20170502/jetty-server-9.3.19.v20170502.jar
Progress (3): 0.6/1.4 MB | 0.4/1.9 MB | 30/88 kBProgress (3): 0.6/1.4 MB | 0.4/1.9 MB | 30/88 kBProgress (3): 0.6/1.4 MB | 0.4/1.9 MB | 30/88 kBProgress (3): 0.6/1.4 MB | 0.4/1.9 MB | 32/88 kBProgress (3): 0.6/1.4 MB | 0.4/1.9 MB | 32/88 kBProgress (3): 0.6/1.4 MB | 0.4/1.9 MB | 32/88 kBProgress (3): 0.6/1.4 MB | 0.4/1.9 MB | 32/88 kBProgress (3): 0.6/1.4 MB | 0.4/1.9 MB | 32/88 kBProgress (3): 0.6/1.4 MB | 0.4/1.9 MB | 32/88 kBProgress (3): 0.6/1.4 MB | 0.4/1.9 MB | 32/88 kBProgress (3): 0.6/1.4 MB | 0.4/1.9 MB | 32/88 kBProgress (3): 0.6/1.4 MB | 0.4/1.9 MB | 32/88 kBProgress (3): 0.6/1.4 MB | 0.4/1.9 MB | 36/88 kBProgress (3): 0.6/1.4 MB | 0.4/1.9 MB | 36/88 kBProgress (3): 0.6/1.4 MB | 0.4/1.9 MB | 40/88 kBProgress (3): 0.6/1.4 MB | 0.4/1.9 MB | 40/88 kBProgress (3): 0.6/1.4 MB | 0.4/1.9 MB | 40/88 kBProgress (3): 0.6/1.4 MB | 0.4/1.9 MB | 40/88 kBProgress (3): 0.6/1.4 MB | 0.4/1.9 MB | 45/88 kBProgress (3): 0.6/1.4 MB | 0.4/1.9 MB | 45/88 kBProgress (3): 0.6/1.4 MB | 0.4/1.9 MB | 45/88 kBProgress (3): 0.6/1.4 MB | 0.4/1.9 MB | 45/88 kBProgress (3): 0.6/1.4 MB | 0.4/1.9 MB | 49/88 kBProgress (3): 0.6/1.4 MB | 0.4/1.9 MB | 49/88 kB                                                Downloaded from central: https://repo.maven.apache.org/maven2/org/eclipse/jetty/jetty-security/9.3.19.v20170502/jetty-security-9.3.19.v20170502.jar (0 B at 0 B/s)
Downloading from central: https://repo.maven.apache.org/maven2/org/eclipse/jetty/jetty-io/9.3.19.v20170502/jetty-io-9.3.19.v20170502.jar
Progress (3): 0.6/1.4 MB | 0.4/1.9 MB | 49/88 kBProgress (3): 0.6/1.4 MB | 0.4/1.9 MB | 53/88 kBProgress (3): 0.6/1.4 MB | 0.4/1.9 MB | 53/88 kBProgress (3): 0.6/1.4 MB | 0.4/1.9 MB | 57/88 kBProgress (3): 0.6/1.4 MB | 0.4/1.9 MB | 57/88 kB                                                Downloaded from central: https://repo.maven.apache.org/maven2/org/eclipse/jetty/jetty-server/9.3.19.v20170502/jetty-server-9.3.19.v20170502.jar (0 B at 0 B/s)
Progress (3): 0.6/1.4 MB | 0.4/1.9 MB | 57/88 kBProgress (3): 0.6/1.4 MB | 0.4/1.9 MB | 61/88 kBProgress (3): 0.6/1.4 MB | 0.4/1.9 MB | 61/88 kBProgress (3): 0.6/1.4 MB | 0.4/1.9 MB | 65/88 kBProgress (3): 0.6/1.4 MB | 0.4/1.9 MB | 65/88 kB                                                Downloading from central: https://repo.maven.apache.org/maven2/org/eclipse/jetty/jetty-servlet/9.3.19.v20170502/jetty-servlet-9.3.19.v20170502.jar
Progress (3): 0.6/1.4 MB | 0.4/1.9 MB | 65/88 kBProgress (3): 0.6/1.4 MB | 0.4/1.9 MB | 69/88 kBProgress (3): 0.6/1.4 MB | 0.4/1.9 MB | 69/88 kBProgress (3): 0.6/1.4 MB | 0.4/1.9 MB | 69/88 kBProgress (3): 0.6/1.4 MB | 0.4/1.9 MB | 69/88 kBProgress (3): 0.6/1.4 MB | 0.4/1.9 MB | 73/88 kBProgress (3): 0.6/1.4 MB | 0.4/1.9 MB | 73/88 kBProgress (3): 0.6/1.4 MB | 0.4/1.9 MB | 77/88 kBProgress (3): 0.6/1.4 MB | 0.4/1.9 MB | 77/88 kBProgress (3): 0.6/1.4 MB | 0.4/1.9 MB | 81/88 kBProgress (3): 0.6/1.4 MB | 0.4/1.9 MB | 81/88 kBProgress (3): 0.6/1.4 MB | 0.4/1.9 MB | 81/88 kBProgress (3): 0.6/1.4 MB | 0.4/1.9 MB | 85/88 kBProgress (3): 0.6/1.4 MB | 0.4/1.9 MB | 85/88 kBProgress (3): 0.6/1.4 MB | 0.4/1.9 MB | 88 kB   Progress (3): 0.6/1.4 MB | 0.4/1.9 MB | 88 kBProgress (3): 0.6/1.4 MB | 0.4/1.9 MB | 88 kBProgress (3): 0.6/1.4 MB | 0.4/1.9 MB | 88 kBProgress (3): 0.7/1.4 MB | 0.4/1.9 MB | 88 kBProgress (3): 0.7/1.4 MB | 0.4/1.9 MB | 88 kB                                             Downloaded from central: https://repo.maven.apache.org/maven2/org/eclipse/jetty/jetty-io/9.3.19.v20170502/jetty-io-9.3.19.v20170502.jar (0 B at 0 B/s)
Progress (3): 0.7/1.4 MB | 0.4/1.9 MB | 88 kB                                             Downloading from central: https://repo.maven.apache.org/maven2/com/fasterxml/jackson/jaxrs/jackson-jaxrs-json-provider/2.7.8/jackson-jaxrs-json-provider-2.7.8.jar
Progress (3): 0.7/1.4 MB | 0.5/1.9 MB | 88 kBProgress (3): 0.7/1.4 MB | 0.5/1.9 MB | 88 kBProgress (3): 0.7/1.4 MB | 0.5/1.9 MB | 88 kBProgress (3): 0.7/1.4 MB | 0.5/1.9 MB | 88 kBProgress (3): 0.7/1.4 MB | 0.5/1.9 MB | 88 kBProgress (3): 0.7/1.4 MB | 0.5/1.9 MB | 88 kBProgress (3): 0.7/1.4 MB | 0.5/1.9 MB | 88 kB                                             Downloaded from central: https://repo.maven.apache.org/maven2/org/eclipse/jetty/jetty-servlet/9.3.19.v20170502/jetty-servlet-9.3.19.v20170502.jar (0 B at 0 B/s)
Progress (3): 0.7/1.4 MB | 0.5/1.9 MB | 88 kBProgress (3): 0.7/1.4 MB | 0.5/1.9 MB | 88 kB                                             Downloading from central: https://repo.maven.apache.org/maven2/com/fasterxml/jackson/jaxrs/jackson-jaxrs-base/2.7.8/jackson-jaxrs-base-2.7.8.jar
Progress (3): 0.7/1.4 MB | 0.5/1.9 MB | 88 kBProgress (3): 0.7/1.4 MB | 0.5/1.9 MB | 88 kBProgress (3): 0.7/1.4 MB | 0.5/1.9 MB | 88 kBProgress (3): 0.7/1.4 MB | 0.5/1.9 MB | 88 kBProgress (3): 0.7/1.4 MB | 0.5/1.9 MB | 88 kBProgress (3): 0.7/1.4 MB | 0.5/1.9 MB | 88 kBProgress (3): 0.7/1.4 MB | 0.5/1.9 MB | 88 kBProgress (3): 0.7/1.4 MB | 0.5/1.9 MB | 88 kBProgress (3): 0.7/1.4 MB | 0.5/1.9 MB | 88 kBProgress (3): 0.7/1.4 MB | 0.5/1.9 MB | 88 kBProgress (3): 0.7/1.4 MB | 0.5/1.9 MB | 88 kBProgress (3): 0.7/1.4 MB | 0.5/1.9 MB | 88 kBProgress (3): 0.7/1.4 MB | 0.5/1.9 MB | 88 kBProgress (3): 0.7/1.4 MB | 0.5/1.9 MB | 88 kBProgress (3): 0.7/1.4 MB | 0.5/1.9 MB | 88 kBProgress (3): 0.7/1.4 MB | 0.5/1.9 MB | 88 kB                                             Downloaded from central: https://repo.maven.apache.org/maven2/org/codehaus/jettison/jettison/1.3.8/jettison-1.3.8.jar (88 kB at 798 kB/s)
Progress (2): 0.7/1.4 MB | 0.5/1.9 MB                                     Downloading from central: https://repo.maven.apache.org/maven2/com/codahale/metrics/metrics-core/3.0.1/metrics-core-3.0.1.jar
Progress (2): 0.7/1.4 MB | 0.5/1.9 MBProgress (2): 0.7/1.4 MB | 0.5/1.9 MBProgress (2): 0.7/1.4 MB | 0.5/1.9 MBProgress (2): 0.7/1.4 MB | 0.5/1.9 MBProgress (2): 0.7/1.4 MB | 0.5/1.9 MBProgress (2): 0.7/1.4 MB | 0.5/1.9 MBProgress (2): 0.7/1.4 MB | 0.5/1.9 MBProgress (2): 0.7/1.4 MB | 0.5/1.9 MBProgress (2): 0.7/1.4 MB | 0.5/1.9 MBProgress (2): 0.7/1.4 MB | 0.5/1.9 MBProgress (2): 0.7/1.4 MB | 0.5/1.9 MBProgress (2): 0.7/1.4 MB | 0.5/1.9 MBProgress (3): 0.7/1.4 MB | 0.5/1.9 MB | 4.1/17 kBProgress (3): 0.7/1.4 MB | 0.5/1.9 MB | 4.1/17 kBProgress (3): 0.7/1.4 MB | 0.5/1.9 MB | 4.1/17 kBProgress (3): 0.7/1.4 MB | 0.5/1.9 MB | 4.1/17 kBProgress (3): 0.7/1.4 MB | 0.5/1.9 MB | 8.2/17 kBProgress (3): 0.7/1.4 MB | 0.5/1.9 MB | 8.2/17 kBProgress (3): 0.7/1.4 MB | 0.5/1.9 MB | 12/17 kB Progress (3): 0.7/1.4 MB | 0.5/1.9 MB | 12/17 kBProgress (3): 0.7/1.4 MB | 0.5/1.9 MB | 16/17 kBProgress (4): 0.7/1.4 MB | 0.5/1.9 MB | 16/17 kB | 2.2/30 kBProgress (4): 0.7/1.4 MB | 0.5/1.9 MB | 17 kB | 2.2/30 kB   Progress (4): 0.7/1.4 MB | 0.5/1.9 MB | 17 kB | 2.2/30 kBProgress (4): 0.7/1.4 MB | 0.5/1.9 MB | 17 kB | 2.2/30 kBProgress (4): 0.7/1.4 MB | 0.5/1.9 MB | 17 kB | 5.0/30 kBProgress (4): 0.7/1.4 MB | 0.5/1.9 MB | 17 kB | 5.0/30 kBProgress (4): 0.7/1.4 MB | 0.5/1.9 MB | 17 kB | 5.0/30 kBProgress (4): 0.7/1.4 MB | 0.6/1.9 MB | 17 kB | 5.0/30 kBProgress (4): 0.7/1.4 MB | 0.6/1.9 MB | 17 kB | 7.7/30 kBProgress (4): 0.7/1.4 MB | 0.6/1.9 MB | 17 kB | 7.7/30 kBProgress (4): 0.7/1.4 MB | 0.6/1.9 MB | 17 kB | 7.7/30 kBProgress (4): 0.7/1.4 MB | 0.6/1.9 MB | 17 kB | 10/30 kB Progress (4): 0.8/1.4 MB | 0.6/1.9 MB | 17 kB | 10/30 kBProgress (4): 0.8/1.4 MB | 0.6/1.9 MB | 17 kB | 13/30 kBProgress (4): 0.8/1.4 MB | 0.6/1.9 MB | 17 kB | 13/30 kBProgress (4): 0.8/1.4 MB | 0.6/1.9 MB | 17 kB | 16/30 kBProgress (4): 0.8/1.4 MB | 0.6/1.9 MB | 17 kB | 16/30 kBProgress (5): 0.8/1.4 MB | 0.6/1.9 MB | 17 kB | 16/30 kB | 2.2/85 kBProgress (5): 0.8/1.4 MB | 0.6/1.9 MB | 17 kB | 19/30 kB | 2.2/85 kBProgress (5): 0.8/1.4 MB | 0.6/1.9 MB | 17 kB | 19/30 kB | 2.2/85 kBProgress (5): 0.8/1.4 MB | 0.6/1.9 MB | 17 kB | 19/30 kB | 5.0/85 kBProgress (5): 0.8/1.4 MB | 0.6/1.9 MB | 17 kB | 19/30 kB | 5.0/85 kBProgress (5): 0.8/1.4 MB | 0.6/1.9 MB | 17 kB | 19/30 kB | 5.0/85 kBProgress (5): 0.8/1.4 MB | 0.6/1.9 MB | 17 kB | 21/30 kB | 5.0/85 kBProgress (5): 0.8/1.4 MB | 0.6/1.9 MB | 17 kB | 21/30 kB | 5.0/85 kBProgress (5): 0.8/1.4 MB | 0.6/1.9 MB | 17 kB | 21/30 kB | 7.7/85 kBProgress (5): 0.8/1.4 MB | 0.6/1.9 MB | 17 kB | 21/30 kB | 7.7/85 kBProgress (5): 0.8/1.4 MB | 0.6/1.9 MB | 17 kB | 24/30 kB | 7.7/85 kBProgress (5): 0.8/1.4 MB | 0.6/1.9 MB | 17 kB | 24/30 kB | 10/85 kB Progress (5): 0.8/1.4 MB | 0.6/1.9 MB | 17 kB | 27/30 kB | 10/85 kBProgress (5): 0.8/1.4 MB | 0.6/1.9 MB | 17 kB | 27/30 kB | 10/85 kBProgress (5): 0.8/1.4 MB | 0.6/1.9 MB | 17 kB | 30/30 kB | 10/85 kBProgress (5): 0.8/1.4 MB | 0.6/1.9 MB | 17 kB | 30/30 kB | 10/85 kBProgress (5): 0.8/1.4 MB | 0.6/1.9 MB | 17 kB | 30 kB | 10/85 kB   Progress (5): 0.8/1.4 MB | 0.6/1.9 MB | 17 kB | 30 kB | 13/85 kBProgress (5): 0.8/1.4 MB | 0.6/1.9 MB | 17 kB | 30 kB | 13/85 kBProgress (5): 0.8/1.4 MB | 0.6/1.9 MB | 17 kB | 30 kB | 13/85 kBProgress (5): 0.8/1.4 MB | 0.6/1.9 MB | 17 kB | 30 kB | 13/85 kBProgress (5): 0.8/1.4 MB | 0.6/1.9 MB | 17 kB | 30 kB | 13/85 kBProgress (5): 0.8/1.4 MB | 0.6/1.9 MB | 17 kB | 30 kB | 16/85 kBProgress (5): 0.8/1.4 MB | 0.6/1.9 MB | 17 kB | 30 kB | 16/85 kBProgress (5): 0.8/1.4 MB | 0.6/1.9 MB | 17 kB | 30 kB | 16/85 kBProgress (5): 0.8/1.4 MB | 0.6/1.9 MB | 17 kB | 30 kB | 19/85 kB                                                                Downloaded from central: https://repo.maven.apache.org/maven2/com/fasterxml/jackson/jaxrs/jackson-jaxrs-json-provider/2.7.8/jackson-jaxrs-json-provider-2.7.8.jar (17 kB at 138 kB/s)
Progress (4): 0.8/1.4 MB | 0.6/1.9 MB | 30 kB | 19/85 kB                                                        Downloading from central: https://repo.maven.apache.org/maven2/com/clearspring/analytics/stream/2.9.5/stream-2.9.5.jar
Progress (4): 0.8/1.4 MB | 0.6/1.9 MB | 30 kB | 19/85 kBProgress (4): 0.8/1.4 MB | 0.6/1.9 MB | 30 kB | 21/85 kBProgress (4): 0.8/1.4 MB | 0.6/1.9 MB | 30 kB | 21/85 kBProgress (4): 0.8/1.4 MB | 0.6/1.9 MB | 30 kB | 21/85 kBProgress (4): 0.8/1.4 MB | 0.6/1.9 MB | 30 kB | 21/85 kBProgress (4): 0.8/1.4 MB | 0.6/1.9 MB | 30 kB | 24/85 kBProgress (4): 0.8/1.4 MB | 0.6/1.9 MB | 30 kB | 24/85 kBProgress (4): 0.8/1.4 MB | 0.6/1.9 MB | 30 kB | 24/85 kBProgress (4): 0.8/1.4 MB | 0.6/1.9 MB | 30 kB | 27/85 kBProgress (4): 0.8/1.4 MB | 0.6/1.9 MB | 30 kB | 27/85 kBProgress (4): 0.8/1.4 MB | 0.6/1.9 MB | 30 kB | 30/85 kBProgress (4): 0.8/1.4 MB | 0.6/1.9 MB | 30 kB | 30/85 kBProgress (4): 0.8/1.4 MB | 0.6/1.9 MB | 30 kB | 30/85 kBProgress (4): 0.8/1.4 MB | 0.6/1.9 MB | 30 kB | 32/85 kBProgress (4): 0.8/1.4 MB | 0.6/1.9 MB | 30 kB | 32/85 kBProgress (4): 0.8/1.4 MB | 0.6/1.9 MB | 30 kB | 32/85 kBProgress (4): 0.8/1.4 MB | 0.6/1.9 MB | 30 kB | 32/85 kBProgress (4): 0.8/1.4 MB | 0.6/1.9 MB | 30 kB | 32/85 kBProgress (4): 0.8/1.4 MB | 0.6/1.9 MB | 30 kB | 32/85 kBProgress (4): 0.8/1.4 MB | 0.6/1.9 MB | 30 kB | 32/85 kBProgress (4): 0.8/1.4 MB | 0.6/1.9 MB | 30 kB | 32/85 kBProgress (4): 0.8/1.4 MB | 0.6/1.9 MB | 30 kB | 32/85 kB                                                        Downloaded from central: https://repo.maven.apache.org/maven2/com/fasterxml/jackson/jaxrs/jackson-jaxrs-base/2.7.8/jackson-jaxrs-base-2.7.8.jar (30 kB at 238 kB/s)
Progress (3): 0.8/1.4 MB | 0.6/1.9 MB | 32/85 kB                                                Downloading from central: https://repo.maven.apache.org/maven2/com/salesforce/i18n/i18n-util/1.0.4/i18n-util-1.0.4.jar
Progress (3): 0.8/1.4 MB | 0.6/1.9 MB | 36/85 kBProgress (3): 0.8/1.4 MB | 0.6/1.9 MB | 36/85 kBProgress (3): 0.8/1.4 MB | 0.6/1.9 MB | 36/85 kBProgress (3): 0.8/1.4 MB | 0.6/1.9 MB | 36/85 kBProgress (3): 0.8/1.4 MB | 0.6/1.9 MB | 40/85 kBProgress (3): 0.8/1.4 MB | 0.6/1.9 MB | 40/85 kBProgress (3): 0.8/1.4 MB | 0.6/1.9 MB | 40/85 kBProgress (3): 0.8/1.4 MB | 0.6/1.9 MB | 40/85 kBProgress (3): 0.8/1.4 MB | 0.6/1.9 MB | 45/85 kBProgress (3): 0.8/1.4 MB | 0.6/1.9 MB | 49/85 kBProgress (3): 0.8/1.4 MB | 0.6/1.9 MB | 49/85 kBProgress (3): 0.8/1.4 MB | 0.6/1.9 MB | 49/85 kBProgress (3): 0.8/1.4 MB | 0.7/1.9 MB | 49/85 kBProgress (3): 0.8/1.4 MB | 0.7/1.9 MB | 49/85 kBProgress (3): 0.8/1.4 MB | 0.7/1.9 MB | 49/85 kBProgress (3): 0.8/1.4 MB | 0.7/1.9 MB | 49/85 kBProgress (3): 0.8/1.4 MB | 0.7/1.9 MB | 53/85 kBProgress (3): 0.8/1.4 MB | 0.7/1.9 MB | 53/85 kBProgress (3): 0.8/1.4 MB | 0.7/1.9 MB | 53/85 kBProgress (3): 0.8/1.4 MB | 0.7/1.9 MB | 57/85 kBProgress (3): 0.8/1.4 MB | 0.7/1.9 MB | 57/85 kBProgress (3): 0.9/1.4 MB | 0.7/1.9 MB | 57/85 kBProgress (3): 0.9/1.4 MB | 0.7/1.9 MB | 57/85 kBProgress (3): 0.9/1.4 MB | 0.7/1.9 MB | 61/85 kBProgress (3): 0.9/1.4 MB | 0.7/1.9 MB | 61/85 kBProgress (3): 0.9/1.4 MB | 0.7/1.9 MB | 65/85 kBProgress (3): 0.9/1.4 MB | 0.7/1.9 MB | 65/85 kBProgress (3): 0.9/1.4 MB | 0.7/1.9 MB | 65/85 kB                                                Downloaded from central: https://repo.maven.apache.org/maven2/com/clearspring/analytics/stream/2.9.5/stream-2.9.5.jar (0 B at 0 B/s)
Progress (3): 0.9/1.4 MB | 0.7/1.9 MB | 69/85 kBProgress (3): 0.9/1.4 MB | 0.7/1.9 MB | 69/85 kBProgress (3): 0.9/1.4 MB | 0.7/1.9 MB | 69/85 kBProgress (3): 0.9/1.4 MB | 0.7/1.9 MB | 69/85 kBProgress (3): 0.9/1.4 MB | 0.7/1.9 MB | 73/85 kB                                                Downloading from central: https://repo.maven.apache.org/maven2/com/ibm/icu/icu4j/60.2/icu4j-60.2.jar
Progress (3): 0.9/1.4 MB | 0.7/1.9 MB | 77/85 kB                                                Downloaded from central: https://repo.maven.apache.org/maven2/com/salesforce/i18n/i18n-util/1.0.4/i18n-util-1.0.4.jar (0 B at 0 B/s)
Progress (3): 0.9/1.4 MB | 0.7/1.9 MB | 77/85 kBProgress (3): 0.9/1.4 MB | 0.7/1.9 MB | 77/85 kB                                                Downloading from central: https://repo.maven.apache.org/maven2/com/ibm/icu/icu4j-localespi/60.2/icu4j-localespi-60.2.jar
Progress (3): 0.9/1.4 MB | 0.7/1.9 MB | 81/85 kBProgress (3): 0.9/1.4 MB | 0.7/1.9 MB | 81/85 kBProgress (3): 0.9/1.4 MB | 0.7/1.9 MB | 81/85 kBProgress (3): 0.9/1.4 MB | 0.7/1.9 MB | 85 kB   Progress (3): 0.9/1.4 MB | 0.7/1.9 MB | 85 kBProgress (3): 0.9/1.4 MB | 0.7/1.9 MB | 85 kBProgress (3): 0.9/1.4 MB | 0.7/1.9 MB | 85 kBProgress (3): 0.9/1.4 MB | 0.7/1.9 MB | 85 kBProgress (3): 0.9/1.4 MB | 0.7/1.9 MB | 85 kBProgress (3): 0.9/1.4 MB | 0.7/1.9 MB | 85 kBProgress (3): 0.9/1.4 MB | 0.7/1.9 MB | 85 kBProgress (3): 0.9/1.4 MB | 0.7/1.9 MB | 85 kBProgress (3): 0.9/1.4 MB | 0.7/1.9 MB | 85 kBProgress (3): 0.9/1.4 MB | 0.7/1.9 MB | 85 kBProgress (3): 0.9/1.4 MB | 0.7/1.9 MB | 85 kBProgress (3): 0.9/1.4 MB | 0.7/1.9 MB | 85 kBProgress (3): 0.9/1.4 MB | 0.7/1.9 MB | 85 kBProgress (3): 0.9/1.4 MB | 0.7/1.9 MB | 85 kBProgress (3): 0.9/1.4 MB | 0.7/1.9 MB | 85 kBProgress (3): 0.9/1.4 MB | 0.7/1.9 MB | 85 kBProgress (3): 0.9/1.4 MB | 0.7/1.9 MB | 85 kBProgress (3): 0.9/1.4 MB | 0.7/1.9 MB | 85 kBProgress (3): 0.9/1.4 MB | 0.7/1.9 MB | 85 kBProgress (3): 0.9/1.4 MB | 0.7/1.9 MB | 85 kBProgress (3): 0.9/1.4 MB | 0.7/1.9 MB | 85 kBProgress (3): 0.9/1.4 MB | 0.7/1.9 MB | 85 kBProgress (3): 0.9/1.4 MB | 0.7/1.9 MB | 85 kBProgress (3): 0.9/1.4 MB | 0.7/1.9 MB | 85 kBProgress (3): 0.9/1.4 MB | 0.7/1.9 MB | 85 kBProgress (3): 0.9/1.4 MB | 0.7/1.9 MB | 85 kB                                             Downloaded from central: https://repo.maven.apache.org/maven2/com/ibm/icu/icu4j/60.2/icu4j-60.2.jar (0 B at 0 B/s)
Progress (3): 0.9/1.4 MB | 0.8/1.9 MB | 85 kB                                             Downloading from central: https://repo.maven.apache.org/maven2/com/ibm/icu/icu4j-charset/60.2/icu4j-charset-60.2.jar
Progress (3): 0.9/1.4 MB | 0.8/1.9 MB | 85 kB                                             Downloaded from central: https://repo.maven.apache.org/maven2/com/ibm/icu/icu4j-localespi/60.2/icu4j-localespi-60.2.jar (0 B at 0 B/s)
Progress (3): 0.9/1.4 MB | 0.8/1.9 MB | 85 kBProgress (3): 0.9/1.4 MB | 0.8/1.9 MB | 85 kBProgress (3): 0.9/1.4 MB | 0.8/1.9 MB | 85 kB                                             Downloaded from central: https://repo.maven.apache.org/maven2/com/codahale/metrics/metrics-core/3.0.1/metrics-core-3.0.1.jar (85 kB at 606 kB/s)
Downloading from central: https://repo.maven.apache.org/maven2/com/lmax/disruptor/3.3.6/disruptor-3.3.6.jar
Progress (2): 0.9/1.4 MB | 0.8/1.9 MBProgress (2): 0.9/1.4 MB | 0.8/1.9 MBProgress (2): 0.9/1.4 MB | 0.8/1.9 MBProgress (2): 0.9/1.4 MB | 0.8/1.9 MBProgress (2): 0.9/1.4 MB | 0.8/1.9 MBProgress (2): 0.9/1.4 MB | 0.8/1.9 MBProgress (2): 0.9/1.4 MB | 0.8/1.9 MBProgress (2): 0.9/1.4 MB | 0.8/1.9 MBProgress (2): 0.9/1.4 MB | 0.8/1.9 MBProgress (2): 0.9/1.4 MB | 0.8/1.9 MBProgress (2): 0.9/1.4 MB | 0.8/1.9 MBProgress (2): 0.9/1.4 MB | 0.8/1.9 MBProgress (2): 1.0/1.4 MB | 0.8/1.9 MBProgress (2): 1.0/1.4 MB | 0.8/1.9 MBProgress (2): 1.0/1.4 MB | 0.8/1.9 MBProgress (2): 1.0/1.4 MB | 0.8/1.9 MBProgress (2): 1.0/1.4 MB | 0.8/1.9 MBProgress (2): 1.0/1.4 MB | 0.8/1.9 MBProgress (2): 1.0/1.4 MB | 0.8/1.9 MBProgress (2): 1.0/1.4 MB | 0.8/1.9 MBProgress (2): 1.0/1.4 MB | 0.8/1.9 MBProgress (2): 1.0/1.4 MB | 0.8/1.9 MBProgress (2): 1.0/1.4 MB | 0.8/1.9 MBProgress (2): 1.0/1.4 MB | 0.8/1.9 MBProgress (2): 1.0/1.4 MB | 0.8/1.9 MBProgress (2): 1.0/1.4 MB | 0.8/1.9 MBProgress (2): 1.0/1.4 MB | 0.8/1.9 MBProgress (2): 1.0/1.4 MB | 0.8/1.9 MBProgress (2): 1.0/1.4 MB | 0.8/1.9 MBProgress (2): 1.0/1.4 MB | 0.8/1.9 MB                                     Downloaded from central: https://repo.maven.apache.org/maven2/com/lmax/disruptor/3.3.6/disruptor-3.3.6.jar (0 B at 0 B/s)
Progress (2): 1.0/1.4 MB | 0.8/1.9 MBProgress (2): 1.0/1.4 MB | 0.8/1.9 MBProgress (2): 1.0/1.4 MB | 0.8/1.9 MBProgress (2): 1.0/1.4 MB | 0.8/1.9 MBProgress (2): 1.0/1.4 MB | 0.8/1.9 MBProgress (2): 1.0/1.4 MB | 0.8/1.9 MBProgress (2): 1.0/1.4 MB | 0.8/1.9 MBProgress (2): 1.0/1.4 MB | 0.8/1.9 MBProgress (2): 1.0/1.4 MB | 0.8/1.9 MBProgress (2): 1.0/1.4 MB | 0.8/1.9 MBProgress (2): 1.0/1.4 MB | 0.8/1.9 MBProgress (2): 1.0/1.4 MB | 0.9/1.9 MBProgress (2): 1.0/1.4 MB | 0.9/1.9 MBProgress (2): 1.0/1.4 MB | 0.9/1.9 MB                                     Downloaded from central: https://repo.maven.apache.org/maven2/com/ibm/icu/icu4j-charset/60.2/icu4j-charset-60.2.jar (0 B at 0 B/s)
Progress (2): 1.0/1.4 MB | 0.9/1.9 MBProgress (2): 1.0/1.4 MB | 0.9/1.9 MBProgress (2): 1.0/1.4 MB | 0.9/1.9 MBProgress (2): 1.0/1.4 MB | 0.9/1.9 MBProgress (2): 1.0/1.4 MB | 0.9/1.9 MBProgress (2): 1.0/1.4 MB | 0.9/1.9 MBProgress (2): 1.0/1.4 MB | 0.9/1.9 MBProgress (2): 1.0/1.4 MB | 0.9/1.9 MBProgress (2): 1.0/1.4 MB | 0.9/1.9 MBProgress (2): 1.0/1.4 MB | 0.9/1.9 MBProgress (2): 1.0/1.4 MB | 0.9/1.9 MBProgress (2): 1.0/1.4 MB | 0.9/1.9 MBProgress (2): 1.0/1.4 MB | 0.9/1.9 MBProgress (2): 1.0/1.4 MB | 0.9/1.9 MBProgress (2): 1.0/1.4 MB | 0.9/1.9 MBProgress (2): 1.0/1.4 MB | 0.9/1.9 MBProgress (2): 1.0/1.4 MB | 0.9/1.9 MBProgress (2): 1.0/1.4 MB | 0.9/1.9 MBProgress (2): 1.0/1.4 MB | 0.9/1.9 MBProgress (2): 1.0/1.4 MB | 0.9/1.9 MBProgress (2): 1.1/1.4 MB | 0.9/1.9 MBProgress (2): 1.1/1.4 MB | 0.9/1.9 MBProgress (2): 1.1/1.4 MB | 0.9/1.9 MBProgress (2): 1.1/1.4 MB | 0.9/1.9 MBProgress (2): 1.1/1.4 MB | 0.9/1.9 MBProgress (2): 1.1/1.4 MB | 0.9/1.9 MBProgress (2): 1.1/1.4 MB | 0.9/1.9 MBProgress (2): 1.1/1.4 MB | 0.9/1.9 MBProgress (2): 1.1/1.4 MB | 0.9/1.9 MBProgress (2): 1.1/1.4 MB | 0.9/1.9 MBProgress (2): 1.1/1.4 MB | 0.9/1.9 MBProgress (2): 1.1/1.4 MB | 0.9/1.9 MBProgress (2): 1.1/1.4 MB | 0.9/1.9 MBProgress (2): 1.1/1.4 MB | 0.9/1.9 MBProgress (2): 1.1/1.4 MB | 0.9/1.9 MBProgress (2): 1.1/1.4 MB | 0.9/1.9 MBProgress (2): 1.1/1.4 MB | 0.9/1.9 MBProgress (2): 1.1/1.4 MB | 0.9/1.9 MBProgress (2): 1.1/1.4 MB | 0.9/1.9 MBProgress (2): 1.1/1.4 MB | 0.9/1.9 MBProgress (2): 1.1/1.4 MB | 0.9/1.9 MBProgress (2): 1.1/1.4 MB | 0.9/1.9 MBProgress (2): 1.1/1.4 MB | 0.9/1.9 MBProgress (2): 1.1/1.4 MB | 0.9/1.9 MBProgress (2): 1.1/1.4 MB | 0.9/1.9 MBProgress (2): 1.1/1.4 MB | 0.9/1.9 MBProgress (2): 1.1/1.4 MB | 0.9/1.9 MBProgress (2): 1.1/1.4 MB | 0.9/1.9 MBProgress (2): 1.1/1.4 MB | 1.0/1.9 MBProgress (2): 1.1/1.4 MB | 1.0/1.9 MBProgress (2): 1.1/1.4 MB | 1.0/1.9 MBProgress (2): 1.1/1.4 MB | 1.0/1.9 MBProgress (2): 1.1/1.4 MB | 1.0/1.9 MBProgress (2): 1.1/1.4 MB | 1.0/1.9 MBProgress (2): 1.1/1.4 MB | 1.0/1.9 MBProgress (2): 1.1/1.4 MB | 1.0/1.9 MBProgress (2): 1.1/1.4 MB | 1.0/1.9 MBProgress (2): 1.1/1.4 MB | 1.0/1.9 MBProgress (2): 1.1/1.4 MB | 1.0/1.9 MBProgress (2): 1.1/1.4 MB | 1.0/1.9 MBProgress (2): 1.1/1.4 MB | 1.0/1.9 MBProgress (2): 1.1/1.4 MB | 1.0/1.9 MBProgress (2): 1.1/1.4 MB | 1.0/1.9 MBProgress (2): 1.1/1.4 MB | 1.0/1.9 MBProgress (2): 1.1/1.4 MB | 1.0/1.9 MBProgress (2): 1.1/1.4 MB | 1.0/1.9 MBProgress (2): 1.1/1.4 MB | 1.0/1.9 MBProgress (2): 1.1/1.4 MB | 1.0/1.9 MBProgress (2): 1.2/1.4 MB | 1.0/1.9 MBProgress (2): 1.2/1.4 MB | 1.0/1.9 MBProgress (2): 1.2/1.4 MB | 1.0/1.9 MBProgress (2): 1.2/1.4 MB | 1.0/1.9 MBProgress (2): 1.2/1.4 MB | 1.0/1.9 MBProgress (2): 1.2/1.4 MB | 1.0/1.9 MBProgress (2): 1.2/1.4 MB | 1.0/1.9 MBProgress (2): 1.2/1.4 MB | 1.0/1.9 MBProgress (2): 1.2/1.4 MB | 1.0/1.9 MBProgress (2): 1.2/1.4 MB | 1.0/1.9 MBProgress (2): 1.2/1.4 MB | 1.0/1.9 MBProgress (2): 1.2/1.4 MB | 1.0/1.9 MBProgress (2): 1.2/1.4 MB | 1.0/1.9 MBProgress (2): 1.2/1.4 MB | 1.0/1.9 MBProgress (2): 1.2/1.4 MB | 1.0/1.9 MBProgress (2): 1.2/1.4 MB | 1.0/1.9 MBProgress (2): 1.2/1.4 MB | 1.0/1.9 MBProgress (2): 1.2/1.4 MB | 1.0/1.9 MBProgress (2): 1.2/1.4 MB | 1.0/1.9 MBProgress (2): 1.2/1.4 MB | 1.0/1.9 MBProgress (2): 1.2/1.4 MB | 1.0/1.9 MBProgress (2): 1.2/1.4 MB | 1.0/1.9 MBProgress (2): 1.2/1.4 MB | 1.0/1.9 MBProgress (2): 1.2/1.4 MB | 1.0/1.9 MBProgress (2): 1.2/1.4 MB | 1.0/1.9 MBProgress (2): 1.2/1.4 MB | 1.0/1.9 MBProgress (2): 1.2/1.4 MB | 1.0/1.9 MBProgress (2): 1.2/1.4 MB | 1.0/1.9 MBProgress (2): 1.2/1.4 MB | 1.1/1.9 MBProgress (2): 1.2/1.4 MB | 1.1/1.9 MBProgress (2): 1.2/1.4 MB | 1.1/1.9 MBProgress (2): 1.2/1.4 MB | 1.1/1.9 MBProgress (2): 1.2/1.4 MB | 1.1/1.9 MBProgress (2): 1.2/1.4 MB | 1.1/1.9 MBProgress (2): 1.2/1.4 MB | 1.1/1.9 MBProgress (2): 1.2/1.4 MB | 1.1/1.9 MBProgress (2): 1.2/1.4 MB | 1.1/1.9 MBProgress (2): 1.2/1.4 MB | 1.1/1.9 MBProgress (2): 1.2/1.4 MB | 1.1/1.9 MBProgress (2): 1.2/1.4 MB | 1.1/1.9 MBProgress (2): 1.2/1.4 MB | 1.1/1.9 MBProgress (2): 1.2/1.4 MB | 1.1/1.9 MBProgress (2): 1.2/1.4 MB | 1.1/1.9 MBProgress (2): 1.2/1.4 MB | 1.1/1.9 MBProgress (2): 1.2/1.4 MB | 1.1/1.9 MBProgress (2): 1.2/1.4 MB | 1.1/1.9 MBProgress (2): 1.2/1.4 MB | 1.1/1.9 MBProgress (2): 1.2/1.4 MB | 1.1/1.9 MBProgress (2): 1.2/1.4 MB | 1.1/1.9 MBProgress (2): 1.3/1.4 MB | 1.1/1.9 MBProgress (2): 1.3/1.4 MB | 1.1/1.9 MBProgress (2): 1.3/1.4 MB | 1.1/1.9 MBProgress (2): 1.3/1.4 MB | 1.1/1.9 MBProgress (2): 1.3/1.4 MB | 1.1/1.9 MBProgress (2): 1.3/1.4 MB | 1.1/1.9 MBProgress (2): 1.3/1.4 MB | 1.1/1.9 MBProgress (2): 1.3/1.4 MB | 1.1/1.9 MBProgress (2): 1.3/1.4 MB | 1.1/1.9 MBProgress (2): 1.3/1.4 MB | 1.1/1.9 MBProgress (2): 1.3/1.4 MB | 1.1/1.9 MBProgress (2): 1.3/1.4 MB | 1.1/1.9 MBProgress (2): 1.3/1.4 MB | 1.1/1.9 MBProgress (2): 1.3/1.4 MB | 1.1/1.9 MBProgress (2): 1.3/1.4 MB | 1.1/1.9 MBProgress (2): 1.3/1.4 MB | 1.1/1.9 MBProgress (2): 1.3/1.4 MB | 1.1/1.9 MBProgress (2): 1.3/1.4 MB | 1.1/1.9 MBProgress (2): 1.3/1.4 MB | 1.1/1.9 MBProgress (2): 1.3/1.4 MB | 1.1/1.9 MBProgress (2): 1.3/1.4 MB | 1.1/1.9 MBProgress (2): 1.3/1.4 MB | 1.1/1.9 MBProgress (2): 1.3/1.4 MB | 1.1/1.9 MBProgress (2): 1.3/1.4 MB | 1.1/1.9 MBProgress (2): 1.3/1.4 MB | 1.1/1.9 MBProgress (2): 1.3/1.4 MB | 1.1/1.9 MBProgress (2): 1.3/1.4 MB | 1.1/1.9 MBProgress (2): 1.3/1.4 MB | 1.2/1.9 MBProgress (2): 1.3/1.4 MB | 1.2/1.9 MBProgress (2): 1.3/1.4 MB | 1.2/1.9 MBProgress (2): 1.3/1.4 MB | 1.2/1.9 MBProgress (2): 1.3/1.4 MB | 1.2/1.9 MBProgress (2): 1.3/1.4 MB | 1.2/1.9 MBProgress (2): 1.3/1.4 MB | 1.2/1.9 MBProgress (2): 1.3/1.4 MB | 1.2/1.9 MBProgress (2): 1.3/1.4 MB | 1.2/1.9 MBProgress (2): 1.3/1.4 MB | 1.2/1.9 MBProgress (2): 1.3/1.4 MB | 1.2/1.9 MBProgress (2): 1.3/1.4 MB | 1.2/1.9 MBProgress (2): 1.3/1.4 MB | 1.2/1.9 MBProgress (2): 1.3/1.4 MB | 1.2/1.9 MBProgress (2): 1.3/1.4 MB | 1.2/1.9 MBProgress (2): 1.3/1.4 MB | 1.2/1.9 MBProgress (2): 1.3/1.4 MB | 1.2/1.9 MBProgress (2): 1.3/1.4 MB | 1.2/1.9 MBProgress (2): 1.3/1.4 MB | 1.2/1.9 MBProgress (2): 1.3/1.4 MB | 1.2/1.9 MBProgress (2): 1.3/1.4 MB | 1.2/1.9 MBProgress (2): 1.4/1.4 MB | 1.2/1.9 MBProgress (2): 1.4/1.4 MB | 1.2/1.9 MBProgress (2): 1.4/1.4 MB | 1.2/1.9 MBProgress (2): 1.4/1.4 MB | 1.2/1.9 MBProgress (2): 1.4/1.4 MB | 1.2/1.9 MBProgress (2): 1.4/1.4 MB | 1.2/1.9 MBProgress (2): 1.4/1.4 MB | 1.2/1.9 MBProgress (2): 1.4/1.4 MB | 1.2/1.9 MBProgress (2): 1.4/1.4 MB | 1.2/1.9 MBProgress (2): 1.4/1.4 MB | 1.2/1.9 MBProgress (2): 1.4/1.4 MB | 1.2/1.9 MBProgress (2): 1.4/1.4 MB | 1.2/1.9 MBProgress (2): 1.4/1.4 MB | 1.2/1.9 MBProgress (2): 1.4/1.4 MB | 1.2/1.9 MBProgress (2): 1.4/1.4 MB | 1.2/1.9 MBProgress (2): 1.4/1.4 MB | 1.2/1.9 MBProgress (2): 1.4/1.4 MB | 1.2/1.9 MBProgress (2): 1.4/1.4 MB | 1.2/1.9 MBProgress (2): 1.4/1.4 MB | 1.2/1.9 MBProgress (2): 1.4/1.4 MB | 1.2/1.9 MBProgress (2): 1.4/1.4 MB | 1.2/1.9 MBProgress (2): 1.4/1.4 MB | 1.2/1.9 MBProgress (2): 1.4/1.4 MB | 1.2/1.9 MBProgress (2): 1.4/1.4 MB | 1.2/1.9 MBProgress (2): 1.4/1.4 MB | 1.2/1.9 MBProgress (2): 1.4/1.4 MB | 1.2/1.9 MBProgress (2): 1.4/1.4 MB | 1.2/1.9 MBProgress (2): 1.4/1.4 MB | 1.2/1.9 MBProgress (2): 1.4/1.4 MB | 1.3/1.9 MBProgress (2): 1.4/1.4 MB | 1.3/1.9 MBProgress (2): 1.4/1.4 MB | 1.3/1.9 MBProgress (2): 1.4/1.4 MB | 1.3/1.9 MBProgress (2): 1.4/1.4 MB | 1.3/1.9 MBProgress (2): 1.4 MB | 1.3/1.9 MB    Progress (2): 1.4 MB | 1.3/1.9 MBProgress (2): 1.4 MB | 1.3/1.9 MBProgress (2): 1.4 MB | 1.3/1.9 MBProgress (2): 1.4 MB | 1.3/1.9 MBProgress (2): 1.4 MB | 1.3/1.9 MBProgress (2): 1.4 MB | 1.3/1.9 MBProgress (2): 1.4 MB | 1.3/1.9 MBProgress (2): 1.4 MB | 1.3/1.9 MBProgress (2): 1.4 MB | 1.3/1.9 MBProgress (2): 1.4 MB | 1.3/1.9 MBProgress (2): 1.4 MB | 1.3/1.9 MBProgress (2): 1.4 MB | 1.3/1.9 MBProgress (2): 1.4 MB | 1.3/1.9 MBProgress (2): 1.4 MB | 1.3/1.9 MBProgress (2): 1.4 MB | 1.3/1.9 MBProgress (2): 1.4 MB | 1.3/1.9 MBProgress (2): 1.4 MB | 1.3/1.9 MBProgress (2): 1.4 MB | 1.3/1.9 MBProgress (2): 1.4 MB | 1.3/1.9 MBProgress (2): 1.4 MB | 1.3/1.9 MBProgress (2): 1.4 MB | 1.3/1.9 MBProgress (2): 1.4 MB | 1.4/1.9 MBProgress (2): 1.4 MB | 1.4/1.9 MBProgress (2): 1.4 MB | 1.4/1.9 MB                                 Downloaded from central: https://repo.maven.apache.org/maven2/org/mockito/mockito-all/1.8.5/mockito-all-1.8.5.jar (1.4 MB at 7.6 MB/s)
Progress (1): 1.4/1.9 MBProgress (1): 1.4/1.9 MBProgress (1): 1.4/1.9 MBProgress (1): 1.4/1.9 MBProgress (1): 1.4/1.9 MBProgress (1): 1.4/1.9 MBProgress (1): 1.4/1.9 MBProgress (1): 1.4/1.9 MBProgress (1): 1.4/1.9 MBProgress (1): 1.4/1.9 MBProgress (1): 1.4/1.9 MBProgress (1): 1.4/1.9 MBProgress (1): 1.4/1.9 MBProgress (1): 1.4/1.9 MBProgress (1): 1.4/1.9 MBProgress (1): 1.4/1.9 MBProgress (1): 1.4/1.9 MBProgress (1): 1.4/1.9 MBProgress (1): 1.4/1.9 MBProgress (1): 1.4/1.9 MBProgress (1): 1.4/1.9 MBProgress (1): 1.4/1.9 MBProgress (1): 1.5/1.9 MBProgress (1): 1.5/1.9 MBProgress (1): 1.5/1.9 MBProgress (1): 1.5/1.9 MBProgress (1): 1.5/1.9 MBProgress (1): 1.5/1.9 MBProgress (1): 1.5/1.9 MBProgress (1): 1.5/1.9 MBProgress (1): 1.5/1.9 MBProgress (1): 1.5/1.9 MBProgress (1): 1.5/1.9 MBProgress (1): 1.5/1.9 MBProgress (1): 1.5/1.9 MBProgress (1): 1.5/1.9 MBProgress (1): 1.5/1.9 MBProgress (1): 1.5/1.9 MBProgress (1): 1.5/1.9 MBProgress (1): 1.5/1.9 MBProgress (1): 1.5/1.9 MBProgress (1): 1.5/1.9 MBProgress (1): 1.5/1.9 MBProgress (1): 1.5/1.9 MBProgress (1): 1.5/1.9 MBProgress (1): 1.5/1.9 MBProgress (1): 1.6/1.9 MBProgress (1): 1.6/1.9 MBProgress (1): 1.6/1.9 MBProgress (1): 1.6/1.9 MBProgress (1): 1.6/1.9 MBProgress (1): 1.6/1.9 MBProgress (1): 1.6/1.9 MBProgress (1): 1.6/1.9 MBProgress (1): 1.6/1.9 MBProgress (1): 1.6/1.9 MBProgress (1): 1.6/1.9 MBProgress (1): 1.6/1.9 MBProgress (1): 1.6/1.9 MBProgress (1): 1.6/1.9 MBProgress (1): 1.6/1.9 MBProgress (1): 1.6/1.9 MBProgress (1): 1.6/1.9 MBProgress (1): 1.6/1.9 MBProgress (1): 1.6/1.9 MBProgress (1): 1.6/1.9 MBProgress (1): 1.6/1.9 MBProgress (1): 1.6/1.9 MBProgress (1): 1.6/1.9 MBProgress (1): 1.6/1.9 MBProgress (1): 1.7/1.9 MBProgress (1): 1.7/1.9 MBProgress (1): 1.7/1.9 MBProgress (1): 1.7/1.9 MBProgress (1): 1.7/1.9 MBProgress (1): 1.7/1.9 MBProgress (1): 1.7/1.9 MBProgress (1): 1.7/1.9 MBProgress (1): 1.7/1.9 MBProgress (1): 1.7/1.9 MBProgress (1): 1.7/1.9 MBProgress (1): 1.7/1.9 MBProgress (1): 1.7/1.9 MBProgress (1): 1.7/1.9 MBProgress (1): 1.7/1.9 MBProgress (1): 1.7/1.9 MBProgress (1): 1.7/1.9 MBProgress (1): 1.7/1.9 MBProgress (1): 1.7/1.9 MBProgress (1): 1.7/1.9 MBProgress (1): 1.7/1.9 MBProgress (1): 1.7/1.9 MBProgress (1): 1.7/1.9 MBProgress (1): 1.7/1.9 MBProgress (1): 1.7/1.9 MBProgress (1): 1.8/1.9 MBProgress (1): 1.8/1.9 MBProgress (1): 1.8/1.9 MBProgress (1): 1.8/1.9 MBProgress (1): 1.8/1.9 MBProgress (1): 1.8/1.9 MBProgress (1): 1.8/1.9 MBProgress (1): 1.8/1.9 MBProgress (1): 1.8/1.9 MBProgress (1): 1.8/1.9 MBProgress (1): 1.8/1.9 MBProgress (1): 1.8/1.9 MBProgress (1): 1.8/1.9 MBProgress (1): 1.8/1.9 MBProgress (1): 1.8/1.9 MBProgress (1): 1.8/1.9 MBProgress (1): 1.8/1.9 MBProgress (1): 1.8/1.9 MBProgress (1): 1.8/1.9 MBProgress (1): 1.8/1.9 MBProgress (1): 1.8/1.9 MBProgress (1): 1.8/1.9 MBProgress (1): 1.8/1.9 MBProgress (1): 1.8/1.9 MBProgress (1): 1.9/1.9 MBProgress (1): 1.9/1.9 MBProgress (1): 1.9/1.9 MBProgress (1): 1.9/1.9 MBProgress (1): 1.9/1.9 MBProgress (1): 1.9/1.9 MBProgress (1): 1.9/1.9 MBProgress (1): 1.9/1.9 MBProgress (1): 1.9/1.9 MBProgress (1): 1.9/1.9 MBProgress (1): 1.9 MB                        Downloaded from central: https://repo.maven.apache.org/maven2/com/google/guava/guava/13.0.1/guava-13.0.1.jar (1.9 MB at 7.9 MB/s)
[INFO] 
[INFO] --- maven-clean-plugin:2.5:clean (default-clean) @ phoenix-core ---
[INFO] 
[INFO] --- maven-checkstyle-plugin:2.13:check (validate) @ phoenix-core ---
[INFO] 
[INFO] --- build-helper-maven-plugin:1.9.1:add-test-source (add-test-source) @ phoenix-core ---
[INFO] Test Source directory: <https://builds.apache.org/job/Phoenix-master/ws/phoenix-core/src/it/java> added.
[INFO] 
[INFO] --- build-helper-maven-plugin:1.9.1:add-test-resource (add-test-resource) @ phoenix-core ---
[INFO] 
[INFO] --- build-helper-maven-plugin:1.9.1:add-source (add-source) @ phoenix-core ---
[INFO] Source directory: <https://builds.apache.org/job/Phoenix-master/ws/phoenix-core/target/generated-sources/antlr3> added.
[INFO] Source directory: <https://builds.apache.org/job/Phoenix-master/ws/phoenix-core/src/main/antlr3> added.
[INFO] 
[INFO] --- antlr3-maven-plugin:3.5.2:antlr (default) @ phoenix-core ---
Downloading from central: https://repo.maven.apache.org/maven2/org/codehaus/plexus/plexus-utils/1.0.4/plexus-utils-1.0.4.jar
Progress (1): 4.1/164 kBProgress (1): 7.7/164 kBProgress (1): 12/164 kB Progress (1): 16/164 kBProgress (1): 20/164 kBProgress (1): 24/164 kBProgress (1): 28/164 kBProgress (1): 32/164 kBProgress (1): 36/164 kBProgress (1): 40/164 kBProgress (1): 45/164 kBProgress (1): 49/164 kBProgress (1): 53/164 kBProgress (1): 57/164 kBProgress (1): 61/164 kBProgress (1): 65/164 kBProgress (1): 69/164 kBProgress (1): 73/164 kBProgress (1): 77/164 kBProgress (1): 81/164 kBProgress (1): 85/164 kBProgress (1): 90/164 kBProgress (1): 94/164 kBProgress (1): 98/164 kBProgress (1): 102/164 kBProgress (1): 106/164 kBProgress (1): 110/164 kBProgress (1): 114/164 kBProgress (1): 118/164 kBProgress (1): 122/164 kBProgress (1): 126/164 kBProgress (1): 131/164 kBProgress (1): 135/164 kBProgress (1): 139/164 kBProgress (1): 143/164 kBProgress (1): 147/164 kBProgress (1): 151/164 kBProgress (1): 155/164 kBProgress (1): 159/164 kBProgress (1): 163/164 kBProgress (1): 164 kB                        Downloaded from central: https://repo.maven.apache.org/maven2/org/codehaus/plexus/plexus-utils/1.0.4/plexus-utils-1.0.4.jar (164 kB at 4.6 MB/s)
[INFO] ANTLR: Processing source directory <https://builds.apache.org/job/Phoenix-master/ws/phoenix-core/src/main/antlr3>
ANTLR Parser Generator  Version 3.5.2
Output file <https://builds.apache.org/job/Phoenix-master/ws/phoenix-core/target/generated-sources/antlr3/org/apache/phoenix/parse/PhoenixSQLParser.java> does not exist: must build <https://builds.apache.org/job/Phoenix-master/ws/phoenix-core/src/main/antlr3/PhoenixSQL.g>
PhoenixSQL.g
[INFO] 
[INFO] --- maven-dependency-plugin:2.1:build-classpath (create-phoenix-generated-classpath) @ phoenix-core ---
Downloading from central: https://repo.maven.apache.org/maven2/org/codehaus/plexus/plexus-archiver/1.0-alpha-9/plexus-archiver-1.0-alpha-9.pom
Progress (1): 1.8 kB                    Downloaded from central: https://repo.maven.apache.org/maven2/org/codehaus/plexus/plexus-archiver/1.0-alpha-9/plexus-archiver-1.0-alpha-9.pom (1.8 kB at 82 kB/s)
Downloading from central: https://repo.maven.apache.org/maven2/org/codehaus/plexus/plexus-io/1.0-alpha-1/plexus-io-1.0-alpha-1.pom
Progress (1): 1.3 kB                    Downloaded from central: https://repo.maven.apache.org/maven2/org/codehaus/plexus/plexus-io/1.0-alpha-1/plexus-io-1.0-alpha-1.pom (1.3 kB at 86 kB/s)
Downloading from central: https://repo.maven.apache.org/maven2/org/apache/maven/shared/maven-dependency-analyzer/1.1/maven-dependency-analyzer-1.1.pom
Progress (1): 2.2/4.5 kBProgress (1): 4.5 kB                        Downloaded from central: https://repo.maven.apache.org/maven2/org/apache/maven/shared/maven-dependency-analyzer/1.1/maven-dependency-analyzer-1.1.pom (4.5 kB at 267 kB/s)
Downloading from central: https://repo.maven.apache.org/maven2/org/codehaus/plexus/plexus-archiver/1.0-alpha-9/plexus-archiver-1.0-alpha-9.jar
Downloading from central: https://repo.maven.apache.org/maven2/org/codehaus/plexus/plexus-utils/1.4.6/plexus-utils-1.4.6.jar
Downloading from central: https://repo.maven.apache.org/maven2/org/apache/maven/shared/maven-dependency-analyzer/1.1/maven-dependency-analyzer-1.1.jar
Downloading from central: https://repo.maven.apache.org/maven2/org/codehaus/plexus/plexus-io/1.0-alpha-1/plexus-io-1.0-alpha-1.jar
Downloading from central: https://repo.maven.apache.org/maven2/commons-collections/commons-collections/2.1/commons-collections-2.1.jar
Progress (1): 2.2/157 kBProgress (1): 5.0/157 kBProgress (2): 5.0/157 kB | 2.2/204 kBProgress (2): 7.7/157 kB | 2.2/204 kBProgress (2): 7.7/157 kB | 5.0/204 kBProgress (2): 7.7/157 kB | 7.7/204 kBProgress (3): 7.7/157 kB | 7.7/204 kB | 2.8/12 kBProgress (4): 7.7/157 kB | 7.7/204 kB | 2.8/12 kB | 2.2/27 kBProgress (4): 7.7/157 kB | 10/204 kB | 2.8/12 kB | 2.2/27 kB Progress (5): 7.7/157 kB | 10/204 kB | 2.8/12 kB | 2.2/27 kB | 2.2/165 kBProgress (5): 10/157 kB | 10/204 kB | 2.8/12 kB | 2.2/27 kB | 2.2/165 kB Progress (5): 10/157 kB | 13/204 kB | 2.8/12 kB | 2.2/27 kB | 2.2/165 kBProgress (5): 10/157 kB | 13/204 kB | 2.8/12 kB | 5.0/27 kB | 2.2/165 kBProgress (5): 10/157 kB | 13/204 kB | 5.5/12 kB | 5.0/27 kB | 2.2/165 kBProgress (5): 10/157 kB | 13/204 kB | 5.5/12 kB | 7.7/27 kB | 2.2/165 kBProgress (5): 10/157 kB | 16/204 kB | 5.5/12 kB | 7.7/27 kB | 2.2/165 kBProgress (5): 10/157 kB | 16/204 kB | 5.5/12 kB | 10/27 kB | 2.2/165 kB Progress (5): 13/157 kB | 16/204 kB | 5.5/12 kB | 10/27 kB | 2.2/165 kBProgress (5): 13/157 kB | 16/204 kB | 5.5/12 kB | 10/27 kB | 5.0/165 kBProgress (5): 16/157 kB | 16/204 kB | 5.5/12 kB | 10/27 kB | 5.0/165 kBProgress (5): 16/157 kB | 16/204 kB | 5.5/12 kB | 13/27 kB | 5.0/165 kBProgress (5): 16/157 kB | 19/204 kB | 5.5/12 kB | 13/27 kB | 5.0/165 kBProgress (5): 16/157 kB | 19/204 kB | 8.3/12 kB | 13/27 kB | 5.0/165 kBProgress (5): 16/157 kB | 21/204 kB | 8.3/12 kB | 13/27 kB | 5.0/165 kBProgress (5): 16/157 kB | 21/204 kB | 8.3/12 kB | 16/27 kB | 5.0/165 kBProgress (5): 19/157 kB | 21/204 kB | 8.3/12 kB | 16/27 kB | 5.0/165 kBProgress (5): 19/157 kB | 21/204 kB | 8.3/12 kB | 16/27 kB | 7.7/165 kBProgress (5): 19/157 kB | 21/204 kB | 8.3/12 kB | 19/27 kB | 7.7/165 kBProgress (5): 19/157 kB | 24/204 kB | 8.3/12 kB | 19/27 kB | 7.7/165 kBProgress (5): 19/157 kB | 24/204 kB | 11/12 kB | 19/27 kB | 7.7/165 kB Progress (5): 19/157 kB | 27/204 kB | 11/12 kB | 19/27 kB | 7.7/165 kBProgress (5): 19/157 kB | 27/204 kB | 11/12 kB | 21/27 kB | 7.7/165 kBProgress (5): 19/157 kB | 27/204 kB | 11/12 kB | 21/27 kB | 10/165 kB Progress (5): 19/157 kB | 27/204 kB | 11/12 kB | 24/27 kB | 10/165 kBProgress (5): 19/157 kB | 27/204 kB | 11/12 kB | 27/27 kB | 10/165 kBProgress (5): 19/157 kB | 27/204 kB | 11/12 kB | 27 kB | 10/165 kB   Progress (5): 21/157 kB | 27/204 kB | 11/12 kB | 27 kB | 10/165 kBProgress (5): 21/157 kB | 27/204 kB | 11/12 kB | 27 kB | 13/165 kBProgress (5): 21/157 kB | 30/204 kB | 11/12 kB | 27 kB | 13/165 kBProgress (5): 21/157 kB | 30/204 kB | 12 kB | 27 kB | 13/165 kB   Progress (5): 21/157 kB | 30/204 kB | 12 kB | 27 kB | 16/165 kBProgress (5): 24/157 kB | 30/204 kB | 12 kB | 27 kB | 16/165 kBProgress (5): 24/157 kB | 30/204 kB | 12 kB | 27 kB | 19/165 kBProgress (5): 24/157 kB | 32/204 kB | 12 kB | 27 kB | 19/165 kBProgress (5): 27/157 kB | 32/204 kB | 12 kB | 27 kB | 19/165 kBProgress (5): 27/157 kB | 32/204 kB | 12 kB | 27 kB | 21/165 kBProgress (5): 27/157 kB | 36/204 kB | 12 kB | 27 kB | 21/165 kBProgress (5): 30/157 kB | 36/204 kB | 12 kB | 27 kB | 21/165 kBProgress (5): 30/157 kB | 36/204 kB | 12 kB | 27 kB | 24/165 kBProgress (5): 30/157 kB | 40/204 kB | 12 kB | 27 kB | 24/165 kBProgress (5): 30/157 kB | 40/204 kB | 12 kB | 27 kB | 27/165 kBProgress (5): 32/157 kB | 40/204 kB | 12 kB | 27 kB | 27/165 kBProgress (5): 32/157 kB | 40/204 kB | 12 kB | 27 kB | 30/165 kBProgress (5): 32/157 kB | 45/204 kB | 12 kB | 27 kB | 30/165 kBProgress (5): 32/157 kB | 45/204 kB | 12 kB | 27 kB | 32/165 kBProgress (5): 32/157 kB | 49/204 kB | 12 kB | 27 kB | 32/165 kBProgress (5): 36/157 kB | 49/204 kB | 12 kB | 27 kB | 32/165 kB                                                               Downloaded from central: https://repo.maven.apache.org/maven2/org/apache/maven/shared/maven-dependency-analyzer/1.1/maven-dependency-analyzer-1.1.jar (27 kB at 820 kB/s)
Downloaded from central: https://repo.maven.apache.org/maven2/org/codehaus/plexus/plexus-io/1.0-alpha-1/plexus-io-1.0-alpha-1.jar (12 kB at 371 kB/s)
Progress (3): 36/157 kB | 49/204 kB | 36/165 kBProgress (3): 36/157 kB | 53/204 kB | 36/165 kBProgress (3): 40/157 kB | 53/204 kB | 36/165 kBProgress (3): 40/157 kB | 57/204 kB | 36/165 kBProgress (3): 40/157 kB | 57/204 kB | 40/165 kB                                               Downloading from central: https://repo.maven.apache.org/maven2/plexus/plexus-utils/1.0.2/plexus-utils-1.0.2.jar
Progress (3): 40/157 kB | 57/204 kB | 45/165 kBProgress (3): 40/157 kB | 61/204 kB | 45/165 kBProgress (3): 45/157 kB | 61/204 kB | 45/165 kBProgress (3): 45/157 kB | 65/204 kB | 45/165 kBProgress (3): 45/157 kB | 65/204 kB | 49/165 kBProgress (3): 49/157 kB | 65/204 kB | 49/165 kBProgress (3): 49/157 kB | 69/204 kB | 49/165 kBProgress (3): 49/157 kB | 73/204 kB | 49/165 kBProgress (3): 49/157 kB | 77/204 kB | 49/165 kBProgress (3): 49/157 kB | 81/204 kB | 49/165 kBProgress (3): 49/157 kB | 81/204 kB | 53/165 kBProgress (3): 53/157 kB | 81/204 kB | 53/165 kBProgress (3): 53/157 kB | 81/204 kB | 57/165 kBProgress (3): 57/157 kB | 81/204 kB | 57/165 kBProgress (3): 57/157 kB | 81/204 kB | 61/165 kBProgress (3): 61/157 kB | 81/204 kB | 61/165 kBProgress (3): 61/157 kB | 85/204 kB | 61/165 kBProgress (3): 65/157 kB | 85/204 kB | 61/165 kBProgress (3): 65/157 kB | 85/204 kB | 65/165 kBProgress (3): 65/157 kB | 90/204 kB | 65/165 kBProgress (3): 65/157 kB | 94/204 kB | 65/165 kBProgress (3): 65/157 kB | 98/204 kB | 65/165 kBProgress (3): 69/157 kB | 98/204 kB | 65/165 kBProgress (3): 69/157 kB | 98/204 kB | 69/165 kBProgress (3): 69/157 kB | 102/204 kB | 69/165 kBProgress (3): 73/157 kB | 102/204 kB | 69/165 kBProgress (3): 73/157 kB | 106/204 kB | 69/165 kBProgress (3): 73/157 kB | 106/204 kB | 73/165 kBProgress (3): 73/157 kB | 110/204 kB | 73/165 kBProgress (3): 77/157 kB | 110/204 kB | 73/165 kBProgress (3): 77/157 kB | 114/204 kB | 73/165 kBProgress (3): 77/157 kB | 114/204 kB | 77/165 kBProgress (4): 77/157 kB | 114/204 kB | 77/165 kB | 2.2/160 kBProgress (4): 81/157 kB | 114/204 kB | 77/165 kB | 2.2/160 kBProgress (4): 81/157 kB | 114/204 kB | 81/165 kB | 2.2/160 kBProgress (4): 81/157 kB | 118/204 kB | 81/165 kB | 2.2/160 kBProgress (4): 81/157 kB | 118/204 kB | 81/165 kB | 5.0/160 kBProgress (4): 81/157 kB | 122/204 kB | 81/165 kB | 5.0/160 kBProgress (4): 81/157 kB | 126/204 kB | 81/165 kB | 5.0/160 kBProgress (4): 81/157 kB | 126/204 kB | 81/165 kB | 7.7/160 kBProgress (4): 85/157 kB | 126/204 kB | 81/165 kB | 7.7/160 kBProgress (4): 85/157 kB | 131/204 kB | 81/165 kB | 7.7/160 kBProgress (4): 90/157 kB | 131/204 kB | 81/165 kB | 7.7/160 kBProgress (4): 90/157 kB | 131/204 kB | 81/165 kB | 10/160 kB Progress (4): 90/157 kB | 131/204 kB | 85/165 kB | 10/160 kBProgress (4): 94/157 kB | 131/204 kB | 85/165 kB | 10/160 kBProgress (4): 94/157 kB | 135/204 kB | 85/165 kB | 10/160 kBProgress (4): 94/157 kB | 135/204 kB | 90/165 kB | 10/160 kBProgress (4): 94/157 kB | 135/204 kB | 90/165 kB | 13/160 kBProgress (4): 94/157 kB | 135/204 kB | 94/165 kB | 13/160 kBProgress (4): 94/157 kB | 139/204 kB | 94/165 kB | 13/160 kBProgress (4): 98/157 kB | 139/204 kB | 94/165 kB | 13/160 kBProgress (4): 98/157 kB | 143/204 kB | 94/165 kB | 13/160 kBProgress (4): 98/157 kB | 143/204 kB | 94/165 kB | 16/160 kBProgress (4): 98/157 kB | 143/204 kB | 98/165 kB | 16/160 kBProgress (4): 98/157 kB | 143/204 kB | 98/165 kB | 19/160 kBProgress (4): 98/157 kB | 147/204 kB | 98/165 kB | 19/160 kBProgress (4): 98/157 kB | 147/204 kB | 98/165 kB | 21/160 kBProgress (4): 102/157 kB | 147/204 kB | 98/165 kB | 21/160 kBProgress (4): 102/157 kB | 147/204 kB | 98/165 kB | 24/160 kBProgress (4): 102/157 kB | 147/204 kB | 102/165 kB | 24/160 kBProgress (4): 106/157 kB | 147/204 kB | 102/165 kB | 24/160 kBProgress (4): 106/157 kB | 147/204 kB | 106/165 kB | 24/160 kBProgress (4): 106/157 kB | 147/204 kB | 106/165 kB | 27/160 kBProgress (4): 106/157 kB | 151/204 kB | 106/165 kB | 27/160 kBProgress (4): 106/157 kB | 151/204 kB | 106/165 kB | 30/160 kBProgress (4): 106/157 kB | 151/204 kB | 110/165 kB | 30/160 kBProgress (4): 110/157 kB | 151/204 kB | 110/165 kB | 30/160 kBProgress (4): 110/157 kB | 151/204 kB | 114/165 kB | 30/160 kBProgress (4): 110/157 kB | 151/204 kB | 114/165 kB | 32/160 kBProgress (4): 110/157 kB | 155/204 kB | 114/165 kB | 32/160 kBProgress (4): 114/157 kB | 155/204 kB | 114/165 kB | 32/160 kBProgress (4): 114/157 kB | 159/204 kB | 114/165 kB | 32/160 kBProgress (4): 114/157 kB | 159/204 kB | 118/165 kB | 32/160 kBProgress (4): 114/157 kB | 159/204 kB | 118/165 kB | 36/160 kBProgress (4): 114/157 kB | 163/204 kB | 118/165 kB | 36/160 kBProgress (4): 114/157 kB | 163/204 kB | 118/165 kB | 40/160 kBProgress (4): 114/157 kB | 163/204 kB | 122/165 kB | 40/160 kBProgress (4): 114/157 kB | 163/204 kB | 122/165 kB | 45/160 kBProgress (4): 118/157 kB | 163/204 kB | 122/165 kB | 45/160 kBProgress (4): 118/157 kB | 167/204 kB | 122/165 kB | 45/160 kBProgress (4): 118/157 kB | 167/204 kB | 122/165 kB | 49/160 kBProgress (4): 118/157 kB | 167/204 kB | 126/165 kB | 49/160 kBProgress (4): 118/157 kB | 171/204 kB | 126/165 kB | 49/160 kBProgress (4): 122/157 kB | 171/204 kB | 126/165 kB | 49/160 kBProgress (4): 122/157 kB | 176/204 kB | 126/165 kB | 49/160 kBProgress (4): 122/157 kB | 176/204 kB | 131/165 kB | 49/160 kBProgress (4): 122/157 kB | 176/204 kB | 131/165 kB | 53/160 kBProgress (4): 122/157 kB | 180/204 kB | 131/165 kB | 53/160 kBProgress (4): 126/157 kB | 180/204 kB | 131/165 kB | 53/160 kBProgress (4): 126/157 kB | 180/204 kB | 131/165 kB | 57/160 kBProgress (4): 131/157 kB | 180/204 kB | 131/165 kB | 57/160 kBProgress (4): 131/157 kB | 180/204 kB | 131/165 kB | 61/160 kBProgress (4): 131/157 kB | 180/204 kB | 135/165 kB | 61/160 kBProgress (4): 131/157 kB | 180/204 kB | 135/165 kB | 65/160 kBProgress (4): 131/157 kB | 184/204 kB | 135/165 kB | 65/160 kBProgress (4): 135/157 kB | 184/204 kB | 135/165 kB | 65/160 kBProgress (4): 135/157 kB | 184/204 kB | 139/165 kB | 65/160 kBProgress (4): 139/157 kB | 184/204 kB | 139/165 kB | 65/160 kBProgress (4): 139/157 kB | 188/204 kB | 139/165 kB | 65/160 kBProgress (4): 139/157 kB | 188/204 kB | 139/165 kB | 69/160 kBProgress (4): 143/157 kB | 188/204 kB | 139/165 kB | 69/160 kBProgress (4): 143/157 kB | 188/204 kB | 143/165 kB | 69/160 kBProgress (4): 147/157 kB | 188/204 kB | 143/165 kB | 69/160 kBProgress (4): 147/157 kB | 188/204 kB | 143/165 kB | 73/160 kBProgress (4): 147/157 kB | 192/204 kB | 143/165 kB | 73/160 kBProgress (4): 147/157 kB | 192/204 kB | 143/165 kB | 77/160 kBProgress (4): 147/157 kB | 192/204 kB | 147/165 kB | 77/160 kBProgress (4): 147/157 kB | 192/204 kB | 147/165 kB | 81/160 kBProgress (4): 147/157 kB | 196/204 kB | 147/165 kB | 81/160 kBProgress (4): 151/157 kB | 196/204 kB | 147/165 kB | 81/160 kBProgress (4): 155/157 kB | 196/204 kB | 147/165 kB | 81/160 kBProgress (4): 155/157 kB | 196/204 kB | 147/165 kB | 85/160 kBProgress (4): 155/157 kB | 196/204 kB | 151/165 kB | 85/160 kBProgress (4): 155/157 kB | 200/204 kB | 151/165 kB | 85/160 kBProgress (4): 155/157 kB | 200/204 kB | 155/165 kB | 85/160 kBProgress (4): 155/157 kB | 200/204 kB | 155/165 kB | 90/160 kBProgress (4): 157 kB | 200/204 kB | 155/165 kB | 90/160 kB    Progress (4): 157 kB | 200/204 kB | 155/165 kB | 94/160 kBProgress (4): 157 kB | 200/204 kB | 159/165 kB | 94/160 kBProgress (4): 157 kB | 204 kB | 159/165 kB | 94/160 kB    Progress (4): 157 kB | 204 kB | 163/165 kB | 94/160 kBProgress (4): 157 kB | 204 kB | 163/165 kB | 98/160 kBProgress (4): 157 kB | 204 kB | 165 kB | 98/160 kB    Progress (4): 157 kB | 204 kB | 165 kB | 102/160 kBProgress (4): 157 kB | 204 kB | 165 kB | 106/160 kBProgress (4): 157 kB | 204 kB | 165 kB | 110/160 kBProgress (4): 157 kB | 204 kB | 165 kB | 114/160 kBProgress (4): 157 kB | 204 kB | 165 kB | 118/160 kBProgress (4): 157 kB | 204 kB | 165 kB | 122/160 kBProgress (4): 157 kB | 204 kB | 165 kB | 126/160 kBProgress (4): 157 kB | 204 kB | 165 kB | 131/160 kBProgress (4): 157 kB | 204 kB | 165 kB | 135/160 kBProgress (4): 157 kB | 204 kB | 165 kB | 139/160 kBProgress (4): 157 kB | 204 kB | 165 kB | 143/160 kBProgress (4): 157 kB | 204 kB | 165 kB | 147/160 kBProgress (4): 157 kB | 204 kB | 165 kB | 151/160 kBProgress (4): 157 kB | 204 kB | 165 kB | 155/160 kBProgress (4): 157 kB | 204 kB | 165 kB | 159/160 kBProgress (4): 157 kB | 204 kB | 165 kB | 160 kB                                                   Downloaded from central: https://repo.maven.apache.org/maven2/commons-collections/commons-collections/2.1/commons-collections-2.1.jar (165 kB at 2.0 MB/s)
Downloaded from central: https://repo.maven.apache.org/maven2/org/codehaus/plexus/plexus-archiver/1.0-alpha-9/plexus-archiver-1.0-alpha-9.jar (157 kB at 1.8 MB/s)
Downloaded from central: https://repo.maven.apache.org/maven2/org/codehaus/plexus/plexus-utils/1.4.6/plexus-utils-1.4.6.jar (204 kB at 2.4 MB/s)
Downloaded from central: https://repo.maven.apache.org/maven2/plexus/plexus-utils/1.0.2/plexus-utils-1.0.2.jar (160 kB at 2.0 MB/s)
[INFO] Wrote classpath file '<https://builds.apache.org/job/Phoenix-master/ws/phoenix-core/target/cached_classpath.txt'.>
[INFO] 
[INFO] --- maven-remote-resources-plugin:1.5:process (default) @ phoenix-core ---
[INFO] artifact net.minidev:json-smart: checking for updates from apache release
[INFO] artifact net.minidev:json-smart: checking for updates from central
[INFO] artifact net.minidev:json-smart: checking for updates from project.local
[INFO] artifact net.minidev:json-smart: checking for updates from dynamodb-local-oregon
[INFO] artifact net.minidev:json-smart: checking for updates from apache.snapshots.https
[INFO] artifact net.minidev:json-smart: checking for updates from repository.jboss.org
[INFO] artifact net.minidev:json-smart: checking for updates from apache release
[INFO] artifact net.minidev:json-smart: checking for updates from central
[INFO] artifact net.minidev:json-smart: checking for updates from project.local
[INFO] artifact net.minidev:json-smart: checking for updates from dynamodb-local-oregon
[INFO] artifact net.minidev:json-smart: checking for updates from apache.snapshots.https
[INFO] artifact net.minidev:json-smart: checking for updates from repository.jboss.org
[INFO] artifact org.glassfish:javax.el: checking for updates from apache release
[INFO] artifact org.glassfish:javax.el: checking for updates from central
[INFO] artifact org.glassfish:javax.el: checking for updates from project.local
[INFO] artifact org.glassfish:javax.el: checking for updates from java.net.Releases
[INFO] artifact net.minidev:json-smart: checking for updates from apache release
[INFO] artifact net.minidev:json-smart: checking for updates from central
[INFO] artifact net.minidev:json-smart: checking for updates from project.local
[INFO] artifact net.minidev:json-smart: checking for updates from dynamodb-local-oregon
[INFO] artifact net.minidev:json-smart: checking for updates from apache.snapshots.https
[INFO] artifact net.minidev:json-smart: checking for updates from repository.jboss.org
[INFO] artifact net.minidev:json-smart: checking for updates from apache release
[INFO] artifact net.minidev:json-smart: checking for updates from central
[INFO] artifact net.minidev:json-smart: checking for updates from project.local
[INFO] artifact net.minidev:json-smart: checking for updates from dynamodb-local-oregon
[INFO] artifact net.minidev:json-smart: checking for updates from apache.snapshots.https
[INFO] artifact net.minidev:json-smart: checking for updates from repository.jboss.org
[INFO] artifact net.minidev:json-smart: checking for updates from apache release
[INFO] artifact net.minidev:json-smart: checking for updates from central
[INFO] artifact net.minidev:json-smart: checking for updates from project.local
[INFO] artifact net.minidev:json-smart: checking for updates from dynamodb-local-oregon
[INFO] artifact net.minidev:json-smart: checking for updates from apache.snapshots.https
[INFO] artifact net.minidev:json-smart: checking for updates from repository.jboss.org
[INFO] artifact org.glassfish:javax.el: checking for updates from apache release
[INFO] artifact org.glassfish:javax.el: checking for updates from central
[INFO] artifact org.glassfish:javax.el: checking for updates from project.local
[INFO] artifact org.glassfish:javax.el: checking for updates from java.net.Releases
[INFO] artifact net.minidev:json-smart: checking for updates from apache release
[INFO] artifact net.minidev:json-smart: checking for updates from central
[INFO] artifact net.minidev:json-smart: checking for updates from project.local
[INFO] artifact net.minidev:json-smart: checking for updates from dynamodb-local-oregon
[INFO] artifact net.minidev:json-smart: checking for updates from apache.snapshots.https
[INFO] artifact net.minidev:json-smart: checking for updates from repository.jboss.org
[INFO] artifact org.glassfish:javax.el: checking for updates from apache release
[INFO] artifact org.glassfish:javax.el: checking for updates from central
[INFO] artifact org.glassfish:javax.el: checking for updates from project.local
[INFO] artifact org.glassfish:javax.el: checking for updates from java.net.Releases
[INFO] 
[INFO] --- maven-resources-plugin:2.6:resources (default-resources) @ phoenix-core ---
[INFO] Using 'UTF-8' encoding to copy filtered resources.
[INFO] Copying 1 resource to META-INF/services
[INFO] Copying 3 resources
[INFO] 
[INFO] --- maven-compiler-plugin:3.0:compile (default-compile) @ phoenix-core ---
[INFO] Changes detected - recompiling the module!
[INFO] Compiling 1092 source files to <https://builds.apache.org/job/Phoenix-master/ws/phoenix-core/target/classes>
[WARNING] <https://builds.apache.org/job/Phoenix-master/ws/phoenix-core/src/main/java/org/apache/phoenix/execute/DescVarLengthFastByteComparisons.java>:[25,16] sun.misc.Unsafe is internal proprietary API and may be removed in a future release
[WARNING] <https://builds.apache.org/job/Phoenix-master/ws/phoenix-core/src/main/java/org/apache/phoenix/execute/DescVarLengthFastByteComparisons.java>:[116,26] sun.misc.Unsafe is internal proprietary API and may be removed in a future release
[WARNING] <https://builds.apache.org/job/Phoenix-master/ws/phoenix-core/src/main/java/org/apache/phoenix/execute/DescVarLengthFastByteComparisons.java>:[122,30] sun.misc.Unsafe is internal proprietary API and may be removed in a future release
[WARNING] <https://builds.apache.org/job/Phoenix-master/ws/phoenix-core/src/main/java/org/apache/phoenix/execute/DescVarLengthFastByteComparisons.java>:[126,39] sun.misc.Unsafe is internal proprietary API and may be removed in a future release
[WARNING] <https://builds.apache.org/job/Phoenix-master/ws/phoenix-core/src/main/java/org/apache/phoenix/expression/BaseExpression.java>: Some input files use or override a deprecated API.
[WARNING] <https://builds.apache.org/job/Phoenix-master/ws/phoenix-core/src/main/java/org/apache/phoenix/expression/BaseExpression.java>: Recompile with -Xlint:deprecation for details.
[WARNING] <https://builds.apache.org/job/Phoenix-master/ws/phoenix-core/src/main/java/org/apache/phoenix/jdbc/PhoenixStatement.java>: Some input files use unchecked or unsafe operations.
[WARNING] <https://builds.apache.org/job/Phoenix-master/ws/phoenix-core/src/main/java/org/apache/phoenix/jdbc/PhoenixStatement.java>: Recompile with -Xlint:unchecked for details.
[INFO] 
[INFO] --- maven-dependency-plugin:2.1:build-classpath (create-mrapp-generated-classpath) @ phoenix-core ---
[INFO] Wrote classpath file '<https://builds.apache.org/job/Phoenix-master/ws/phoenix-core/target/classes/mrapp-generated-classpath'.>
[INFO] 
[INFO] --- maven-resources-plugin:2.6:testResources (default-testResources) @ phoenix-core ---
[INFO] Using 'UTF-8' encoding to copy filtered resources.
[INFO] Copying 3 resources
[INFO] Copying 2 resources
[INFO] Copying 3 resources
[INFO] 
[INFO] --- maven-compiler-plugin:3.0:testCompile (default-testCompile) @ phoenix-core ---
[INFO] Changes detected - recompiling the module!
[INFO] Compiling 530 source files to <https://builds.apache.org/job/Phoenix-master/ws/phoenix-core/target/test-classes>
[INFO] -------------------------------------------------------------
[WARNING] COMPILATION WARNING : 
[INFO] -------------------------------------------------------------
[WARNING] <https://builds.apache.org/job/Phoenix-master/ws/phoenix-core/src/test/java/org/apache/phoenix/query/BaseTest.java>: Some input files use or override a deprecated API.
[WARNING] <https://builds.apache.org/job/Phoenix-master/ws/phoenix-core/src/test/java/org/apache/phoenix/query/BaseTest.java>: Recompile with -Xlint:deprecation for details.
[WARNING] <https://builds.apache.org/job/Phoenix-master/ws/phoenix-core/src/test/java/org/apache/phoenix/query/BaseTest.java>: Some input files use unchecked or unsafe operations.
[WARNING] <https://builds.apache.org/job/Phoenix-master/ws/phoenix-core/src/test/java/org/apache/phoenix/query/BaseTest.java>: Recompile with -Xlint:unchecked for details.
[INFO] 4 warnings 
[INFO] -------------------------------------------------------------
[INFO] -------------------------------------------------------------
[ERROR] COMPILATION ERROR : 
[INFO] -------------------------------------------------------------
[ERROR] <https://builds.apache.org/job/Phoenix-master/ws/phoenix-core/src/it/java/org/apache/phoenix/end2end/UpsertSelectAutoCommitIT.java>:[177,95] incompatible types: org.apache.hadoop.hbase.client.Admin cannot be converted to org.apache.hadoop.hbase.client.HBaseAdmin
[INFO] 1 error
[INFO] -------------------------------------------------------------
[INFO] ------------------------------------------------------------------------
[INFO] Reactor Summary:
[INFO] 
[INFO] Apache Phoenix 5.1.0-HBase-2.0-SNAPSHOT ............ SUCCESS [  4.086 s]
[INFO] Phoenix Core ....................................... FAILURE [02:07 min]
[INFO] Phoenix - Flume .................................... SKIPPED
[INFO] Phoenix - Kafka .................................... SKIPPED
[INFO] Phoenix - Pig ...................................... SKIPPED
[INFO] Phoenix Query Server Client ........................ SKIPPED
[INFO] Phoenix Query Server ............................... SKIPPED
[INFO] Phoenix - Pherf .................................... SKIPPED
[INFO] Phoenix - Spark .................................... SKIPPED
[INFO] Phoenix - Hive ..................................... SKIPPED
[INFO] Phoenix Client ..................................... SKIPPED
[INFO] Phoenix Server ..................................... SKIPPED
[INFO] Phoenix Assembly ................................... SKIPPED
[INFO] Phoenix - Tracing Web Application .................. SKIPPED
[INFO] Phoenix Load Balancer 5.1.0-HBase-2.0-SNAPSHOT ..... SKIPPED
[INFO] ------------------------------------------------------------------------
[INFO] BUILD FAILURE
[INFO] ------------------------------------------------------------------------
[INFO] Total time: 02:13 min
[INFO] Finished at: 2018-09-26T18:47:24Z
[INFO] ------------------------------------------------------------------------
[ERROR] Failed to execute goal org.apache.maven.plugins:maven-compiler-plugin:3.0:testCompile (default-testCompile) on project phoenix-core: Compilation failure
[ERROR] <https://builds.apache.org/job/Phoenix-master/ws/phoenix-core/src/it/java/org/apache/phoenix/end2end/UpsertSelectAutoCommitIT.java>:[177,95] incompatible types: org.apache.hadoop.hbase.client.Admin cannot be converted to org.apache.hadoop.hbase.client.HBaseAdmin
[ERROR] 
[ERROR] -> [Help 1]
[ERROR] 
[ERROR] To see the full stack trace of the errors, re-run Maven with the -e switch.
[ERROR] Re-run Maven using the -X switch to enable full debug logging.
[ERROR] 
[ERROR] For more information about the errors and possible solutions, please read the following articles:
[ERROR] [Help 1] http://cwiki.apache.org/confluence/display/MAVEN/MojoFailureException
[ERROR] 
[ERROR] After correcting the problems, you can resume the build with the command
[ERROR]   mvn <goals> -rf :phoenix-core
Build step 'Invoke top-level Maven targets' marked build as failure
Archiving artifacts
[Fast Archiver] Compressed 129.77 KB of artifacts by 24.7% relative to #2071
Recording test results
ERROR: Step ?Publish JUnit test result report? failed: No test report files were found. Configuration error?
Not sending mail to unregistered user ankitsinghal59@gmail.com

Mime
View raw message