phoenix-commits mailing list archives

Site index · List index
Message view « Date » · « Thread »
Top « Date » · « Thread »
From Apache Jenkins Server <jenk...@builds.apache.org>
Subject Build failed in Jenkins: Phoenix Compile Compatibility with HBase #762
Date Thu, 20 Sep 2018 09:16:30 GMT
See <https://builds.apache.org/job/Phoenix_Compile_Compat_wHBase/762/display/redirect>

------------------------------------------
Started by timer
[EnvInject] - Loading node environment variables.
Building remotely on H25 (ubuntu xenial) in workspace <https://builds.apache.org/job/Phoenix_Compile_Compat_wHBase/ws/>
FATAL: Unable to produce a script file
Also:   hudson.remoting.Channel$CallSiteStackTrace: Remote call to H25
		at hudson.remoting.Channel.attachCallSiteStackTrace(Channel.java:1741)
		at hudson.remoting.UserRequest$ExceptionResponse.retrieve(UserRequest.java:357)
		at hudson.remoting.Channel.call(Channel.java:955)
		at hudson.FilePath.act(FilePath.java:1036)
		at hudson.FilePath.act(FilePath.java:1025)
		at hudson.FilePath.createTextTempFile(FilePath.java:1423)
		at hudson.tasks.CommandInterpreter.createScriptFile(CommandInterpreter.java:162)
		at hudson.tasks.CommandInterpreter.perform(CommandInterpreter.java:94)
		at hudson.tasks.CommandInterpreter.perform(CommandInterpreter.java:66)
		at hudson.tasks.BuildStepMonitor$1.perform(BuildStepMonitor.java:20)
		at hudson.model.AbstractBuild$AbstractBuildExecution.perform(AbstractBuild.java:744)
		at hudson.model.Build$BuildExecution.build(Build.java:206)
		at hudson.model.Build$BuildExecution.doRun(Build.java:163)
		at hudson.model.AbstractBuild$AbstractBuildExecution.run(AbstractBuild.java:504)
		at hudson.model.Run.execute(Run.java:1794)
		at hudson.model.FreeStyleBuild.run(FreeStyleBuild.java:43)
		at hudson.model.ResourceController.execute(ResourceController.java:97)
		at hudson.model.Executor.run(Executor.java:429)
java.io.IOException: No space left on device
	at java.io.FileOutputStream.writeBytes(Native Method)
	at java.io.FileOutputStream.write(FileOutputStream.java:326)
	at sun.nio.cs.StreamEncoder.writeBytes(StreamEncoder.java:221)
	at sun.nio.cs.StreamEncoder.implClose(StreamEncoder.java:316)
	at sun.nio.cs.StreamEncoder.close(StreamEncoder.java:149)
	at java.io.OutputStreamWriter.close(OutputStreamWriter.java:233)
	at hudson.FilePath$CreateTextTempFile.invoke(FilePath.java:1456)
	at hudson.FilePath$CreateTextTempFile.invoke(FilePath.java:1428)
	at hudson.FilePath$FileCallableWrapper.call(FilePath.java:2918)
	at hudson.remoting.UserRequest.perform(UserRequest.java:212)
	at hudson.remoting.UserRequest.perform(UserRequest.java:54)
	at hudson.remoting.Request$2.run(Request.java:369)
	at hudson.remoting.InterceptingExecutorService$1.call(InterceptingExecutorService.java:72)
	at java.util.concurrent.FutureTask.run(FutureTask.java:266)
	at java.util.concurrent.ThreadPoolExecutor.runWorker(ThreadPoolExecutor.java:1142)
	at java.util.concurrent.ThreadPoolExecutor$Worker.run(ThreadPoolExecutor.java:617)
	at java.lang.Thread.run(Thread.java:748)
Caused: java.io.IOException: remote file operation failed: <https://builds.apache.org/job/Phoenix_Compile_Compat_wHBase/ws/>
at hudson.remoting.Channel@74080f34:H25
	at hudson.FilePath.act(FilePath.java:1043)
	at hudson.FilePath.act(FilePath.java:1025)
	at hudson.FilePath.createTextTempFile(FilePath.java:1423)
Caused: java.io.IOException: Failed to create a temp file on <https://builds.apache.org/job/Phoenix_Compile_Compat_wHBase/ws/>
	at hudson.FilePath.createTextTempFile(FilePath.java:1425)
	at hudson.tasks.CommandInterpreter.createScriptFile(CommandInterpreter.java:162)
	at hudson.tasks.CommandInterpreter.perform(CommandInterpreter.java:94)
	at hudson.tasks.CommandInterpreter.perform(CommandInterpreter.java:66)
	at hudson.tasks.BuildStepMonitor$1.perform(BuildStepMonitor.java:20)
	at hudson.model.AbstractBuild$AbstractBuildExecution.perform(AbstractBuild.java:744)
	at hudson.model.Build$BuildExecution.build(Build.java:206)
	at hudson.model.Build$BuildExecution.doRun(Build.java:163)
	at hudson.model.AbstractBuild$AbstractBuildExecution.run(AbstractBuild.java:504)
	at hudson.model.Run.execute(Run.java:1794)
	at hudson.model.FreeStyleBuild.run(FreeStyleBuild.java:43)
	at hudson.model.ResourceController.execute(ResourceController.java:97)
	at hudson.model.Executor.run(Executor.java:429)
Build step 'Execute shell' marked build as failure

Mime
View raw message