phoenix-commits mailing list archives

Site index · List index
Message view « Date » · « Thread »
Top « Date » · « Thread »
From Apache Jenkins Server <jenk...@builds.apache.org>
Subject Build failed in Jenkins: Phoenix | Master #2091
Date Wed, 29 Aug 2018 00:32:32 GMT
See <https://builds.apache.org/job/Phoenix-master/2091/display/redirect>

------------------------------------------
[...truncated 132.75 KB...]
[INFO] Running org.apache.phoenix.end2end.IndexScrutinyToolIT
[INFO] Running org.apache.phoenix.end2end.IndexToolForPartialBuildIT
[INFO] Running org.apache.phoenix.end2end.IndexToolForPartialBuildWithNamespaceEnabledIT
[INFO] Tests run: 1, Failures: 0, Errors: 0, Skipped: 0, Time elapsed: 10.426 s - in org.apache.phoenix.end2end.IndexToolForPartialBuildIT
[INFO] Tests run: 2, Failures: 0, Errors: 0, Skipped: 0, Time elapsed: 16.189 s - in org.apache.phoenix.end2end.IndexToolForPartialBuildWithNamespaceEnabledIT
[INFO] Running org.apache.phoenix.end2end.IndexToolIT
[INFO] Tests run: 20, Failures: 0, Errors: 0, Skipped: 0, Time elapsed: 398.139 s - in org.apache.phoenix.end2end.CostBasedDecisionIT
[INFO] Running org.apache.phoenix.end2end.MigrateSystemTablesToSystemNamespaceIT
[INFO] Running org.apache.phoenix.end2end.LocalIndexSplitMergeIT
[WARNING] Tests run: 33, Failures: 0, Errors: 0, Skipped: 3, Time elapsed: 277.471 s - in
org.apache.phoenix.end2end.IndexScrutinyToolIT
[INFO] Tests run: 4, Failures: 0, Errors: 0, Skipped: 0, Time elapsed: 232.407 s - in org.apache.phoenix.end2end.MigrateSystemTablesToSystemNamespaceIT
[INFO] Running org.apache.phoenix.end2end.NonColumnEncodedImmutableNonTxStatsCollectorIT
[INFO] Running org.apache.phoenix.end2end.NonColumnEncodedImmutableTxStatsCollectorIT
[WARNING] Tests run: 26, Failures: 0, Errors: 0, Skipped: 4, Time elapsed: 94.971 s - in org.apache.phoenix.end2end.NonColumnEncodedImmutableNonTxStatsCollectorIT
[WARNING] Tests run: 26, Failures: 0, Errors: 0, Skipped: 4, Time elapsed: 95.276 s - in org.apache.phoenix.end2end.NonColumnEncodedImmutableTxStatsCollectorIT
[INFO] Running org.apache.phoenix.end2end.PartialResultServerConfigurationIT
[INFO] Running org.apache.phoenix.end2end.PhoenixDriverIT
[INFO] Tests run: 1, Failures: 0, Errors: 0, Skipped: 0, Time elapsed: 28.167 s - in org.apache.phoenix.end2end.PartialResultServerConfigurationIT
[INFO] Running org.apache.phoenix.end2end.QueryLoggerIT
[INFO] Tests run: 4, Failures: 0, Errors: 0, Skipped: 0, Time elapsed: 51.785 s - in org.apache.phoenix.end2end.PhoenixDriverIT
[INFO] Tests run: 3, Failures: 0, Errors: 0, Skipped: 0, Time elapsed: 459.573 s - in org.apache.phoenix.end2end.LocalIndexSplitMergeIT
[INFO] Running org.apache.phoenix.end2end.QueryTimeoutIT
[INFO] Tests run: 2, Failures: 0, Errors: 0, Skipped: 0, Time elapsed: 7.543 s - in org.apache.phoenix.end2end.QueryTimeoutIT
[INFO] Tests run: 7, Failures: 0, Errors: 0, Skipped: 0, Time elapsed: 50.366 s - in org.apache.phoenix.end2end.QueryLoggerIT
[INFO] Running org.apache.phoenix.end2end.QueryWithLimitIT
[INFO] Tests run: 2, Failures: 0, Errors: 0, Skipped: 0, Time elapsed: 3.999 s - in org.apache.phoenix.end2end.QueryWithLimitIT
[INFO] Running org.apache.phoenix.end2end.RebuildIndexConnectionPropsIT
[INFO] Tests run: 1, Failures: 0, Errors: 0, Skipped: 0, Time elapsed: 0.359 s - in org.apache.phoenix.end2end.RebuildIndexConnectionPropsIT
[INFO] Running org.apache.phoenix.end2end.RegexBulkLoadToolIT
[INFO] Running org.apache.phoenix.end2end.RenewLeaseIT
[INFO] Tests run: 1, Failures: 0, Errors: 0, Skipped: 0, Time elapsed: 26.429 s - in org.apache.phoenix.end2end.RenewLeaseIT
[INFO] Running org.apache.phoenix.end2end.SequencePointInTimeIT
[INFO] Tests run: 1, Failures: 0, Errors: 0, Skipped: 0, Time elapsed: 0.119 s - in org.apache.phoenix.end2end.SequencePointInTimeIT
[INFO] Tests run: 10, Failures: 0, Errors: 0, Skipped: 0, Time elapsed: 63.719 s - in org.apache.phoenix.end2end.RegexBulkLoadToolIT
[INFO] Running org.apache.phoenix.end2end.SpillableGroupByIT
[INFO] Running org.apache.phoenix.end2end.StatsEnabledSplitSystemCatalogIT
[INFO] Tests run: 3, Failures: 0, Errors: 0, Skipped: 0, Time elapsed: 9.481 s - in org.apache.phoenix.end2end.SpillableGroupByIT
[INFO] Running org.apache.phoenix.end2end.SystemCatalogCreationOnConnectionIT
[INFO] Running org.apache.phoenix.end2end.SysTableNamespaceMappedStatsCollectorIT
[INFO] Tests run: 12, Failures: 0, Errors: 0, Skipped: 0, Time elapsed: 49.738 s - in org.apache.phoenix.end2end.StatsEnabledSplitSystemCatalogIT
[INFO] Running org.apache.phoenix.end2end.SystemCatalogIT
[WARNING] Tests run: 26, Failures: 0, Errors: 0, Skipped: 4, Time elapsed: 94.282 s - in org.apache.phoenix.end2end.SysTableNamespaceMappedStatsCollectorIT
[INFO] Running org.apache.phoenix.end2end.SystemTablePermissionsIT
[INFO] Tests run: 1, Failures: 0, Errors: 0, Skipped: 0, Time elapsed: 46.723 s - in org.apache.phoenix.end2end.SystemCatalogIT
[INFO] Running org.apache.phoenix.end2end.TableDDLPermissionsIT
[INFO] Tests run: 2, Failures: 0, Errors: 0, Skipped: 0, Time elapsed: 81.287 s - in org.apache.phoenix.end2end.SystemTablePermissionsIT
[INFO] Running org.apache.phoenix.end2end.TableSnapshotReadsMapReduceIT
[INFO] Tests run: 3, Failures: 0, Errors: 0, Skipped: 0, Time elapsed: 19.412 s - in org.apache.phoenix.end2end.TableSnapshotReadsMapReduceIT
[INFO] Tests run: 96, Failures: 0, Errors: 0, Skipped: 0, Time elapsed: 923.847 s - in org.apache.phoenix.end2end.IndexToolIT
[INFO] Running org.apache.phoenix.end2end.UpdateCacheAcrossDifferentClientsIT
[INFO] Running org.apache.phoenix.end2end.UserDefinedFunctionsIT
[INFO] Tests run: 6, Failures: 0, Errors: 0, Skipped: 0, Time elapsed: 29.961 s - in org.apache.phoenix.end2end.UpdateCacheAcrossDifferentClientsIT
[INFO] Running org.apache.phoenix.end2end.index.ImmutableIndexIT
[INFO] Tests run: 4, Failures: 0, Errors: 0, Skipped: 0, Time elapsed: 305.338 s - in org.apache.phoenix.end2end.TableDDLPermissionsIT
[INFO] Tests run: 16, Failures: 0, Errors: 0, Skipped: 0, Time elapsed: 115.327 s - in org.apache.phoenix.end2end.UserDefinedFunctionsIT
[INFO] Running org.apache.phoenix.end2end.index.LocalIndexIT
[INFO] Running org.apache.phoenix.end2end.index.MutableIndexFailureIT
[INFO] Tests run: 14, Failures: 0, Errors: 0, Skipped: 0, Time elapsed: 567.663 s - in org.apache.phoenix.end2end.SystemCatalogCreationOnConnectionIT
[INFO] Running org.apache.phoenix.end2end.index.MutableIndexFailureWithNamespaceIT
[INFO] Tests run: 14, Failures: 0, Errors: 0, Skipped: 0, Time elapsed: 163.797 s - in org.apache.phoenix.end2end.index.MutableIndexFailureIT
[INFO] Running org.apache.phoenix.end2end.index.MutableIndexRebuilderIT
[ERROR] Tests run: 40, Failures: 0, Errors: 12, Skipped: 16, Time elapsed: 289.541 s <<<
FAILURE! - in org.apache.phoenix.end2end.index.ImmutableIndexIT
[ERROR] testDeleteFromPartialPK[ImmutableIndexIT_localIndex=false,transactional=true,columnEncoded=false](org.apache.phoenix.end2end.index.ImmutableIndexIT)
 Time elapsed: 2.124 s  <<< ERROR!
java.lang.RuntimeException: org.apache.thrift.TException: Unable to discover transaction service.
	at org.apache.phoenix.end2end.index.ImmutableIndexIT.testDeleteFromPartialPK(ImmutableIndexIT.java:174)
Caused by: org.apache.thrift.TException: Unable to discover transaction service.
	at org.apache.phoenix.end2end.index.ImmutableIndexIT.testDeleteFromPartialPK(ImmutableIndexIT.java:174)

[ERROR] testDropIfImmutableKeyValueColumn[ImmutableIndexIT_localIndex=false,transactional=true,columnEncoded=false](org.apache.phoenix.end2end.index.ImmutableIndexIT)
 Time elapsed: 2.004 s  <<< ERROR!
java.lang.RuntimeException: org.apache.thrift.TException: Unable to discover transaction service.
	at org.apache.phoenix.end2end.index.ImmutableIndexIT.testDropIfImmutableKeyValueColumn(ImmutableIndexIT.java:131)
Caused by: org.apache.thrift.TException: Unable to discover transaction service.
	at org.apache.phoenix.end2end.index.ImmutableIndexIT.testDropIfImmutableKeyValueColumn(ImmutableIndexIT.java:131)

[ERROR] testDeleteFromNonPK[ImmutableIndexIT_localIndex=false,transactional=true,columnEncoded=false](org.apache.phoenix.end2end.index.ImmutableIndexIT)
 Time elapsed: 2.005 s  <<< ERROR!
java.lang.RuntimeException: org.apache.thrift.TException: Unable to discover transaction service.
	at org.apache.phoenix.end2end.index.ImmutableIndexIT.testDeleteFromNonPK(ImmutableIndexIT.java:216)
Caused by: org.apache.thrift.TException: Unable to discover transaction service.
	at org.apache.phoenix.end2end.index.ImmutableIndexIT.testDeleteFromNonPK(ImmutableIndexIT.java:216)

[ERROR] testDeleteFromPartialPK[ImmutableIndexIT_localIndex=false,transactional=true,columnEncoded=true](org.apache.phoenix.end2end.index.ImmutableIndexIT)
 Time elapsed: 2.005 s  <<< ERROR!
java.lang.RuntimeException: org.apache.thrift.TException: Unable to discover transaction service.
	at org.apache.phoenix.end2end.index.ImmutableIndexIT.testDeleteFromPartialPK(ImmutableIndexIT.java:174)
Caused by: org.apache.thrift.TException: Unable to discover transaction service.
	at org.apache.phoenix.end2end.index.ImmutableIndexIT.testDeleteFromPartialPK(ImmutableIndexIT.java:174)

[ERROR] testDropIfImmutableKeyValueColumn[ImmutableIndexIT_localIndex=false,transactional=true,columnEncoded=true](org.apache.phoenix.end2end.index.ImmutableIndexIT)
 Time elapsed: 2.006 s  <<< ERROR!
java.lang.RuntimeException: org.apache.thrift.TException: Unable to discover transaction service.
	at org.apache.phoenix.end2end.index.ImmutableIndexIT.testDropIfImmutableKeyValueColumn(ImmutableIndexIT.java:131)
Caused by: org.apache.thrift.TException: Unable to discover transaction service.
	at org.apache.phoenix.end2end.index.ImmutableIndexIT.testDropIfImmutableKeyValueColumn(ImmutableIndexIT.java:131)

[ERROR] testDeleteFromNonPK[ImmutableIndexIT_localIndex=false,transactional=true,columnEncoded=true](org.apache.phoenix.end2end.index.ImmutableIndexIT)
 Time elapsed: 2.009 s  <<< ERROR!
java.lang.RuntimeException: org.apache.thrift.TException: Unable to discover transaction service.
	at org.apache.phoenix.end2end.index.ImmutableIndexIT.testDeleteFromNonPK(ImmutableIndexIT.java:216)
Caused by: org.apache.thrift.TException: Unable to discover transaction service.
	at org.apache.phoenix.end2end.index.ImmutableIndexIT.testDeleteFromNonPK(ImmutableIndexIT.java:216)

[ERROR] testDeleteFromPartialPK[ImmutableIndexIT_localIndex=true,transactional=true,columnEncoded=false](org.apache.phoenix.end2end.index.ImmutableIndexIT)
 Time elapsed: 2.004 s  <<< ERROR!
java.lang.RuntimeException: org.apache.thrift.TException: Unable to discover transaction service.
	at org.apache.phoenix.end2end.index.ImmutableIndexIT.testDeleteFromPartialPK(ImmutableIndexIT.java:174)
Caused by: org.apache.thrift.TException: Unable to discover transaction service.
	at org.apache.phoenix.end2end.index.ImmutableIndexIT.testDeleteFromPartialPK(ImmutableIndexIT.java:174)

[ERROR] testDropIfImmutableKeyValueColumn[ImmutableIndexIT_localIndex=true,transactional=true,columnEncoded=false](org.apache.phoenix.end2end.index.ImmutableIndexIT)
 Time elapsed: 2.003 s  <<< ERROR!
java.lang.RuntimeException: org.apache.thrift.TException: Unable to discover transaction service.
	at org.apache.phoenix.end2end.index.ImmutableIndexIT.testDropIfImmutableKeyValueColumn(ImmutableIndexIT.java:131)
Caused by: org.apache.thrift.TException: Unable to discover transaction service.
	at org.apache.phoenix.end2end.index.ImmutableIndexIT.testDropIfImmutableKeyValueColumn(ImmutableIndexIT.java:131)

[ERROR] testDeleteFromNonPK[ImmutableIndexIT_localIndex=true,transactional=true,columnEncoded=false](org.apache.phoenix.end2end.index.ImmutableIndexIT)
 Time elapsed: 2.005 s  <<< ERROR!
java.lang.RuntimeException: org.apache.thrift.TException: Unable to discover transaction service.
	at org.apache.phoenix.end2end.index.ImmutableIndexIT.testDeleteFromNonPK(ImmutableIndexIT.java:216)
Caused by: org.apache.thrift.TException: Unable to discover transaction service.
	at org.apache.phoenix.end2end.index.ImmutableIndexIT.testDeleteFromNonPK(ImmutableIndexIT.java:216)

[ERROR] testDeleteFromPartialPK[ImmutableIndexIT_localIndex=true,transactional=true,columnEncoded=true](org.apache.phoenix.end2end.index.ImmutableIndexIT)
 Time elapsed: 2.003 s  <<< ERROR!
java.lang.RuntimeException: org.apache.thrift.TException: Unable to discover transaction service.
	at org.apache.phoenix.end2end.index.ImmutableIndexIT.testDeleteFromPartialPK(ImmutableIndexIT.java:174)
Caused by: org.apache.thrift.TException: Unable to discover transaction service.
	at org.apache.phoenix.end2end.index.ImmutableIndexIT.testDeleteFromPartialPK(ImmutableIndexIT.java:174)

[ERROR] testDropIfImmutableKeyValueColumn[ImmutableIndexIT_localIndex=true,transactional=true,columnEncoded=true](org.apache.phoenix.end2end.index.ImmutableIndexIT)
 Time elapsed: 2.003 s  <<< ERROR!
java.lang.RuntimeException: org.apache.thrift.TException: Unable to discover transaction service.
	at org.apache.phoenix.end2end.index.ImmutableIndexIT.testDropIfImmutableKeyValueColumn(ImmutableIndexIT.java:131)
Caused by: org.apache.thrift.TException: Unable to discover transaction service.
	at org.apache.phoenix.end2end.index.ImmutableIndexIT.testDropIfImmutableKeyValueColumn(ImmutableIndexIT.java:131)

[ERROR] testDeleteFromNonPK[ImmutableIndexIT_localIndex=true,transactional=true,columnEncoded=true](org.apache.phoenix.end2end.index.ImmutableIndexIT)
 Time elapsed: 2.009 s  <<< ERROR!
java.lang.RuntimeException: org.apache.thrift.TException: Unable to discover transaction service.
	at org.apache.phoenix.end2end.index.ImmutableIndexIT.testDeleteFromNonPK(ImmutableIndexIT.java:216)
Caused by: org.apache.thrift.TException: Unable to discover transaction service.
	at org.apache.phoenix.end2end.index.ImmutableIndexIT.testDeleteFromNonPK(ImmutableIndexIT.java:216)

[INFO] Tests run: 7, Failures: 0, Errors: 0, Skipped: 0, Time elapsed: 95.288 s - in org.apache.phoenix.end2end.index.MutableIndexFailureWithNamespaceIT
[INFO] Tests run: 1, Failures: 0, Errors: 0, Skipped: 0, Time elapsed: 46.606 s - in org.apache.phoenix.end2end.index.MutableIndexRebuilderIT
[INFO] Running org.apache.phoenix.end2end.index.MutableIndexReplicationIT
[INFO] Running org.apache.phoenix.end2end.index.PartialIndexRebuilderIT
[INFO] Running org.apache.phoenix.end2end.index.txn.TxWriteFailureIT
[INFO] Tests run: 1, Failures: 0, Errors: 0, Skipped: 0, Time elapsed: 16.728 s - in org.apache.phoenix.end2end.index.MutableIndexReplicationIT
[INFO] Tests run: 8, Failures: 0, Errors: 0, Skipped: 0, Time elapsed: 36.578 s - in org.apache.phoenix.end2end.index.txn.TxWriteFailureIT
[INFO] Running org.apache.phoenix.execute.PartialCommitIT
[INFO] Tests run: 12, Failures: 0, Errors: 0, Skipped: 0, Time elapsed: 0.824 s - in org.apache.phoenix.execute.PartialCommitIT
[INFO] Running org.apache.phoenix.hbase.index.FailForUnsupportedHBaseVersionsIT
[INFO] Running org.apache.phoenix.execute.UpsertSelectOverlappingBatchesIT
[INFO] Tests run: 36, Failures: 0, Errors: 0, Skipped: 0, Time elapsed: 355.689 s - in org.apache.phoenix.end2end.index.LocalIndexIT
[INFO] Tests run: 2, Failures: 0, Errors: 0, Skipped: 0, Time elapsed: 20.193 s - in org.apache.phoenix.hbase.index.FailForUnsupportedHBaseVersionsIT
[INFO] Running org.apache.phoenix.iterate.RoundRobinResultIteratorWithStatsIT
[INFO] Running org.apache.phoenix.iterate.ScannerLeaseRenewalIT
[INFO] Tests run: 1, Failures: 0, Errors: 0, Skipped: 0, Time elapsed: 4.118 s - in org.apache.phoenix.iterate.RoundRobinResultIteratorWithStatsIT
[INFO] Tests run: 3, Failures: 0, Errors: 0, Skipped: 0, Time elapsed: 64.583 s - in org.apache.phoenix.execute.UpsertSelectOverlappingBatchesIT
[INFO] Running org.apache.phoenix.monitoring.PhoenixLoggingMetricsIT
[INFO] Running org.apache.phoenix.monitoring.PhoenixMetricsDisabledIT
[INFO] Tests run: 1, Failures: 0, Errors: 0, Skipped: 0, Time elapsed: 0.006 s - in org.apache.phoenix.monitoring.PhoenixMetricsDisabledIT
[INFO] Tests run: 3, Failures: 0, Errors: 0, Skipped: 0, Time elapsed: 17.623 s - in org.apache.phoenix.monitoring.PhoenixLoggingMetricsIT
[INFO] Running org.apache.phoenix.monitoring.PhoenixMetricsIT
[INFO] Running org.apache.phoenix.rpc.PhoenixClientRpcIT
[INFO] Tests run: 2, Failures: 0, Errors: 0, Skipped: 0, Time elapsed: 4.942 s - in org.apache.phoenix.rpc.PhoenixClientRpcIT
[INFO] Running org.apache.phoenix.rpc.PhoenixServerRpcIT
[INFO] Tests run: 21, Failures: 0, Errors: 0, Skipped: 0, Time elapsed: 59.747 s - in org.apache.phoenix.monitoring.PhoenixMetricsIT
[INFO] Tests run: 2, Failures: 0, Errors: 0, Skipped: 0, Time elapsed: 14.1 s - in org.apache.phoenix.rpc.PhoenixServerRpcIT
[INFO] Tests run: 2, Failures: 0, Errors: 0, Skipped: 0, Time elapsed: 163.362 s - in org.apache.phoenix.iterate.ScannerLeaseRenewalIT
[INFO] Tests run: 25, Failures: 0, Errors: 0, Skipped: 0, Time elapsed: 324.083 s - in org.apache.phoenix.end2end.index.PartialIndexRebuilderIT
[INFO] 
[INFO] Results:
[INFO] 
[ERROR] Errors: 
[ERROR]   ImmutableIndexIT.testDeleteFromNonPK:216 » Runtime org.apache.thrift.TExceptio...
[ERROR]   ImmutableIndexIT.testDeleteFromNonPK:216 » Runtime org.apache.thrift.TExceptio...
[ERROR]   ImmutableIndexIT.testDeleteFromNonPK:216 » Runtime org.apache.thrift.TExceptio...
[ERROR]   ImmutableIndexIT.testDeleteFromNonPK:216 » Runtime org.apache.thrift.TExceptio...
[ERROR]   ImmutableIndexIT.testDeleteFromPartialPK:174 » Runtime org.apache.thrift.TExce...
[ERROR]   ImmutableIndexIT.testDeleteFromPartialPK:174 » Runtime org.apache.thrift.TExce...
[ERROR]   ImmutableIndexIT.testDeleteFromPartialPK:174 » Runtime org.apache.thrift.TExce...
[ERROR]   ImmutableIndexIT.testDeleteFromPartialPK:174 » Runtime org.apache.thrift.TExce...
[ERROR]   ImmutableIndexIT.testDropIfImmutableKeyValueColumn:131 » Runtime org.apache.th...
[ERROR]   ImmutableIndexIT.testDropIfImmutableKeyValueColumn:131 » Runtime org.apache.th...
[ERROR]   ImmutableIndexIT.testDropIfImmutableKeyValueColumn:131 » Runtime org.apache.th...
[ERROR]   ImmutableIndexIT.testDropIfImmutableKeyValueColumn:131 » Runtime org.apache.th...
[INFO] 
[ERROR] Tests run: 689, Failures: 0, Errors: 12, Skipped: 48
[INFO] 
[INFO] 
[INFO] --- maven-failsafe-plugin:2.20:integration-test (SplitSystemCatalogTests) @ phoenix-core
---
[INFO] 
[INFO] -------------------------------------------------------
[INFO]  T E S T S
[INFO] -------------------------------------------------------
[INFO] Running org.apache.phoenix.end2end.AlterTableWithViewsIT
[INFO] Running org.apache.phoenix.end2end.AlterMultiTenantTableWithViewsIT
[INFO] Tests run: 9, Failures: 0, Errors: 0, Skipped: 0, Time elapsed: 67.882 s - in org.apache.phoenix.end2end.AlterMultiTenantTableWithViewsIT
[INFO] Running org.apache.phoenix.end2end.TenantSpecificViewIndexSaltedIT
[INFO] Running org.apache.phoenix.end2end.TenantSpecificViewIndexIT
[INFO] Tests run: 4, Failures: 0, Errors: 0, Skipped: 0, Time elapsed: 30.833 s - in org.apache.phoenix.end2end.TenantSpecificViewIndexSaltedIT
[INFO] Tests run: 10, Failures: 0, Errors: 0, Skipped: 0, Time elapsed: 62.005 s - in org.apache.phoenix.end2end.TenantSpecificViewIndexIT
[INFO] Running org.apache.phoenix.end2end.ViewIT
[INFO] Running org.apache.phoenix.end2end.index.ViewIndexIT
[WARNING] Tests run: 14, Failures: 0, Errors: 0, Skipped: 2, Time elapsed: 43.896 s - in org.apache.phoenix.end2end.index.ViewIndexIT
[INFO] Tests run: 52, Failures: 0, Errors: 0, Skipped: 0, Time elapsed: 315.282 s - in org.apache.phoenix.end2end.AlterTableWithViewsIT
[INFO] Tests run: 128, Failures: 0, Errors: 0, Skipped: 0, Time elapsed: 348.781 s - in org.apache.phoenix.end2end.ViewIT
[INFO] 
[INFO] Results:
[INFO] 
[WARNING] Tests run: 217, Failures: 0, Errors: 0, Skipped: 2
[INFO] 
[INFO] 
[INFO] --- maven-failsafe-plugin:2.20:verify (ParallelStatsEnabledTest) @ phoenix-core ---
[INFO] ------------------------------------------------------------------------
[INFO] Reactor Summary:
[INFO] 
[INFO] Apache Phoenix 5.1.0-HBase-2.0-SNAPSHOT ............ SUCCESS [  4.000 s]
[INFO] Phoenix Core ....................................... FAILURE [  02:25 h]
[INFO] Phoenix - Flume .................................... SKIPPED
[INFO] Phoenix - Kafka .................................... SKIPPED
[INFO] Phoenix - Pig ...................................... SKIPPED
[INFO] Phoenix Query Server Client ........................ SKIPPED
[INFO] Phoenix Query Server ............................... SKIPPED
[INFO] Phoenix - Pherf .................................... SKIPPED
[INFO] Phoenix - Spark .................................... SKIPPED
[INFO] Phoenix - Hive ..................................... SKIPPED
[INFO] Phoenix Client ..................................... SKIPPED
[INFO] Phoenix Server ..................................... SKIPPED
[INFO] Phoenix Assembly ................................... SKIPPED
[INFO] Phoenix - Tracing Web Application .................. SKIPPED
[INFO] Phoenix Load Balancer 5.1.0-HBase-2.0-SNAPSHOT ..... SKIPPED
[INFO] ------------------------------------------------------------------------
[INFO] BUILD FAILURE
[INFO] ------------------------------------------------------------------------
[INFO] Total time: 02:25 h
[INFO] Finished at: 2018-08-29T00:28:26Z
[INFO] ------------------------------------------------------------------------
[ERROR] Failed to execute goal org.apache.maven.plugins:maven-failsafe-plugin:2.20:verify
(ParallelStatsEnabledTest) on project phoenix-core: There are test failures.
[ERROR] 
[ERROR] Please refer to <https://builds.apache.org/job/Phoenix-master/ws/phoenix-core/target/failsafe-reports>
for the individual test results.
[ERROR] Please refer to dump files (if any exist) [date]-jvmRun[N].dump, [date].dumpstream
and [date]-jvmRun[N].dumpstream.
[ERROR] -> [Help 1]
[ERROR] 
[ERROR] To see the full stack trace of the errors, re-run Maven with the -e switch.
[ERROR] Re-run Maven using the -X switch to enable full debug logging.
[ERROR] 
[ERROR] For more information about the errors and possible solutions, please read the following
articles:
[ERROR] [Help 1] http://cwiki.apache.org/confluence/display/MAVEN/MojoFailureException
[ERROR] 
[ERROR] After correcting the problems, you can resume the build with the command
[ERROR]   mvn <goals> -rf :phoenix-core
Build step 'Invoke top-level Maven targets' marked build as failure
Archiving artifacts
Recording test results
Not sending mail to unregistered user ankitsinghal59@gmail.com

Mime
View raw message