phoenix-commits mailing list archives

Site index · List index
Message view « Date » · « Thread »
Top « Date » · « Thread »
From Apache Jenkins Server <jenk...@builds.apache.org>
Subject Build failed in Jenkins: Phoenix | Master #2075
Date Tue, 31 Jul 2018 21:04:12 GMT
See <https://builds.apache.org/job/Phoenix-master/2075/display/redirect?page=changes>

Changes:

[elserj] PHOENIX-4822 Ensure the provided timezone is used client-side (Jaanai

------------------------------------------
[...truncated 1.46 MB...]
[INFO] Running org.apache.phoenix.hbase.index.write.TestIndexWriter
[INFO] Tests run: 8, Failures: 0, Errors: 0, Skipped: 0, Time elapsed: 1.059 s - in org.apache.phoenix.util.csv.CsvUpsertExecutorTest
[INFO] Running org.apache.phoenix.hbase.index.write.TestWALRecoveryCaching
[WARNING] Tests run: 1, Failures: 0, Errors: 0, Skipped: 1, Time elapsed: 0.014 s - in org.apache.phoenix.hbase.index.write.TestWALRecoveryCaching
[INFO] Running org.apache.phoenix.hbase.index.write.recovery.TestPerRegionIndexWriteCache
[INFO] Tests run: 2, Failures: 0, Errors: 0, Skipped: 0, Time elapsed: 0.445 s - in org.apache.phoenix.hbase.index.write.TestParalleIndexWriter
[INFO] Running org.apache.phoenix.hbase.index.parallel.TestThreadPoolBuilder
[INFO] Tests run: 2, Failures: 0, Errors: 0, Skipped: 0, Time elapsed: 0.005 s - in org.apache.phoenix.hbase.index.parallel.TestThreadPoolBuilder
[INFO] Running org.apache.phoenix.hbase.index.parallel.TestThreadPoolManager
[INFO] Tests run: 4, Failures: 0, Errors: 0, Skipped: 0, Time elapsed: 0.281 s - in org.apache.phoenix.hbase.index.write.TestIndexWriter
[INFO] Running org.apache.phoenix.hbase.index.covered.CoveredColumnsTest
[INFO] Tests run: 2, Failures: 0, Errors: 0, Skipped: 0, Time elapsed: 0.502 s - in org.apache.phoenix.hbase.index.write.TestParalleWriterIndexCommitter
[INFO] Tests run: 1, Failures: 0, Errors: 0, Skipped: 0, Time elapsed: 0.002 s - in org.apache.phoenix.hbase.index.covered.CoveredColumnsTest
[INFO] Tests run: 3, Failures: 0, Errors: 0, Skipped: 0, Time elapsed: 0.011 s - in org.apache.phoenix.hbase.index.parallel.TestThreadPoolManager
[INFO] Tests run: 2, Failures: 0, Errors: 0, Skipped: 0, Time elapsed: 1.618 s - in org.apache.phoenix.execute.MutationStateTest
[INFO] Running org.apache.phoenix.hbase.index.covered.NonTxIndexBuilderTest
[INFO] Running org.apache.phoenix.hbase.index.covered.data.TestIndexMemStore
[INFO] Running org.apache.phoenix.hbase.index.covered.TestCoveredIndexSpecifierBuilder
[INFO] Running org.apache.phoenix.hbase.index.covered.data.TestLocalTable
[INFO] Tests run: 1, Failures: 0, Errors: 0, Skipped: 0, Time elapsed: 0.006 s - in org.apache.phoenix.hbase.index.covered.data.TestLocalTable
[INFO] Running org.apache.phoenix.hbase.index.covered.filter.TestApplyAndFilterDeletesFilter
[INFO] Tests run: 1, Failures: 0, Errors: 0, Skipped: 0, Time elapsed: 0.017 s - in org.apache.phoenix.hbase.index.covered.TestCoveredIndexSpecifierBuilder
[INFO] Tests run: 2, Failures: 0, Errors: 0, Skipped: 0, Time elapsed: 0.02 s - in org.apache.phoenix.hbase.index.covered.data.TestIndexMemStore
[INFO] Running org.apache.phoenix.hbase.index.covered.filter.TestNewerTimestampFilter
[INFO] Running org.apache.phoenix.hbase.index.covered.update.TestIndexUpdateManager
[INFO] Tests run: 1, Failures: 0, Errors: 0, Skipped: 0, Time elapsed: 0.003 s - in org.apache.phoenix.hbase.index.covered.filter.TestNewerTimestampFilter
[INFO] Tests run: 6, Failures: 0, Errors: 0, Skipped: 0, Time elapsed: 0.014 s - in org.apache.phoenix.hbase.index.covered.filter.TestApplyAndFilterDeletesFilter
[INFO] Running org.apache.phoenix.hbase.index.covered.TestCoveredColumnIndexCodec
[INFO] Running org.apache.phoenix.hbase.index.covered.TestColumnTracker
[INFO] Tests run: 3, Failures: 0, Errors: 0, Skipped: 0, Time elapsed: 0.01 s - in org.apache.phoenix.hbase.index.covered.TestColumnTracker
[INFO] Running org.apache.phoenix.hbase.index.covered.LocalTableStateTest
[INFO] Tests run: 3, Failures: 0, Errors: 0, Skipped: 0, Time elapsed: 0.064 s - in org.apache.phoenix.hbase.index.covered.TestCoveredColumnIndexCodec
[INFO] Running org.apache.phoenix.compile.ScanRangesTest
[INFO] Tests run: 6, Failures: 0, Errors: 0, Skipped: 0, Time elapsed: 1.745 s - in org.apache.phoenix.execute.CorrelatePlanTest
[INFO] Running org.apache.phoenix.compile.CreateTableCompilerTest
[INFO] Tests run: 34, Failures: 0, Errors: 0, Skipped: 0, Time elapsed: 0.091 s - in org.apache.phoenix.compile.ScanRangesTest
[INFO] Running org.apache.phoenix.compile.TenantSpecificViewIndexCompileTest
[INFO] Tests run: 2, Failures: 0, Errors: 0, Skipped: 0, Time elapsed: 0.442 s - in org.apache.phoenix.hbase.index.covered.update.TestIndexUpdateManager
[INFO] Running org.apache.phoenix.compile.WhereOptimizerTest
[INFO] Tests run: 5, Failures: 0, Errors: 0, Skipped: 0, Time elapsed: 0.49 s - in org.apache.phoenix.hbase.index.covered.LocalTableStateTest
[INFO] Running org.apache.phoenix.compile.ViewCompilerTest
[INFO] Tests run: 1, Failures: 0, Errors: 0, Skipped: 0, Time elapsed: 0.756 s - in org.apache.phoenix.compile.CreateTableCompilerTest
[INFO] Running org.apache.phoenix.compile.SaltedScanRangesTest
[INFO] Tests run: 4, Failures: 0, Errors: 0, Skipped: 0, Time elapsed: 2.254 s - in org.apache.phoenix.util.csv.StringToArrayConverterTest
[INFO] Running org.apache.phoenix.compile.QueryCompilerTest
[INFO] Tests run: 9, Failures: 0, Errors: 0, Skipped: 0, Time elapsed: 0.071 s - in org.apache.phoenix.compile.SaltedScanRangesTest
[INFO] Running org.apache.phoenix.compile.LimitCompilerTest
[INFO] Tests run: 12, Failures: 0, Errors: 0, Skipped: 0, Time elapsed: 1.797 s - in org.apache.phoenix.util.PhoenixRuntimeTest
[INFO] Running org.apache.phoenix.compile.QueryOptimizerTest
[INFO] Tests run: 3, Failures: 0, Errors: 0, Skipped: 0, Time elapsed: 1.55 s - in org.apache.phoenix.hbase.index.covered.NonTxIndexBuilderTest
[INFO] Running org.apache.phoenix.compile.WhereCompilerTest
[INFO] Tests run: 6, Failures: 0, Errors: 0, Skipped: 0, Time elapsed: 0.797 s - in org.apache.phoenix.compile.LimitCompilerTest
[INFO] Running org.apache.phoenix.compile.HavingCompilerTest
[INFO] Tests run: 3, Failures: 0, Errors: 0, Skipped: 0, Time elapsed: 1.454 s - in org.apache.phoenix.compile.ViewCompilerTest
[INFO] Running org.apache.phoenix.compile.CursorCompilerTest
[INFO] Tests run: 6, Failures: 0, Errors: 0, Skipped: 0, Time elapsed: 2.203 s - in org.apache.phoenix.compile.TenantSpecificViewIndexCompileTest
[INFO] Running org.apache.phoenix.compile.StatementHintsCompilationTest
[INFO] Tests run: 11, Failures: 0, Errors: 0, Skipped: 0, Time elapsed: 0.663 s - in org.apache.phoenix.compile.HavingCompilerTest
[INFO] Running org.apache.phoenix.compile.QueryMetaDataTest
[WARNING] Tests run: 45, Failures: 0, Errors: 0, Skipped: 1, Time elapsed: 1.123 s - in org.apache.phoenix.compile.WhereCompilerTest
[INFO] Running org.apache.phoenix.compile.SelectStatementRewriterTest
[INFO] Tests run: 4, Failures: 0, Errors: 0, Skipped: 0, Time elapsed: 0.633 s - in org.apache.phoenix.compile.StatementHintsCompilationTest
[INFO] Running org.apache.phoenix.compile.JoinQueryCompilerTest
[INFO] Tests run: 5, Failures: 0, Errors: 0, Skipped: 0, Time elapsed: 0.485 s - in org.apache.phoenix.compile.SelectStatementRewriterTest
[INFO] Running org.apache.phoenix.compile.ScanRangesIntersectTest
[INFO] Tests run: 1, Failures: 0, Errors: 0, Skipped: 0, Time elapsed: 0 s - in org.apache.phoenix.compile.ScanRangesIntersectTest
[INFO] Running org.apache.phoenix.query.QueryPlanTest
[INFO] Tests run: 1, Failures: 0, Errors: 0, Skipped: 0, Time elapsed: 1.206 s - in org.apache.phoenix.compile.CursorCompilerTest
[INFO] Running org.apache.phoenix.query.PropertyPolicyProviderTest
[INFO] Tests run: 32, Failures: 0, Errors: 0, Skipped: 0, Time elapsed: 0.914 s - in org.apache.phoenix.compile.QueryMetaDataTest
[INFO] Running org.apache.phoenix.query.KeyRangeIntersectTest
[INFO] Tests run: 9, Failures: 0, Errors: 0, Skipped: 0, Time elapsed: 0.059 s - in org.apache.phoenix.query.KeyRangeIntersectTest
[INFO] Running org.apache.phoenix.query.KeyRangeMoreTest
[INFO] Tests run: 2, Failures: 0, Errors: 0, Skipped: 0, Time elapsed: 0.564 s - in org.apache.phoenix.compile.JoinQueryCompilerTest
[INFO] Running org.apache.phoenix.query.OrderByTest
[INFO] Tests run: 3, Failures: 0, Errors: 0, Skipped: 0, Time elapsed: 0.429 s - in org.apache.phoenix.query.PropertyPolicyProviderTest
[INFO] Running org.apache.phoenix.query.ParallelIteratorsSplitTest
[INFO] Tests run: 4, Failures: 0, Errors: 0, Skipped: 0, Time elapsed: 0.447 s - in org.apache.phoenix.query.OrderByTest
[INFO] Running org.apache.phoenix.query.KeyRangeUnionTest
[INFO] Tests run: 8, Failures: 0, Errors: 0, Skipped: 0, Time elapsed: 0.068 s - in org.apache.phoenix.query.KeyRangeUnionTest
[INFO] Running org.apache.phoenix.query.ScannerLeaseRenewalTest
[INFO] Tests run: 5, Failures: 0, Errors: 0, Skipped: 0, Time elapsed: 0.965 s - in org.apache.phoenix.query.QueryPlanTest
[INFO] Running org.apache.phoenix.query.PhoenixStatsCacheRemovalListenerTest
[INFO] Tests run: 1, Failures: 0, Errors: 0, Skipped: 0, Time elapsed: 0.016 s - in org.apache.phoenix.query.PhoenixStatsCacheRemovalListenerTest
[INFO] Running org.apache.phoenix.query.HBaseFactoryProviderTest
[INFO] Tests run: 3, Failures: 0, Errors: 0, Skipped: 0, Time elapsed: 0.006 s - in org.apache.phoenix.query.HBaseFactoryProviderTest
[INFO] Running org.apache.phoenix.query.ConnectionQueryServicesImplTest
[INFO] Tests run: 117, Failures: 0, Errors: 0, Skipped: 0, Time elapsed: 3.815 s - in org.apache.phoenix.compile.WhereOptimizerTest
[INFO] Running org.apache.phoenix.query.EncodedColumnQualifierCellsListTest
[INFO] Tests run: 8, Failures: 0, Errors: 0, Skipped: 0, Time elapsed: 0.625 s - in org.apache.phoenix.query.ParallelIteratorsSplitTest
[INFO] Running org.apache.phoenix.query.KeyRangeClipTest
[INFO] Tests run: 22, Failures: 0, Errors: 0, Skipped: 0, Time elapsed: 0.022 s - in org.apache.phoenix.query.EncodedColumnQualifierCellsListTest
[INFO] Running org.apache.phoenix.query.ConnectionlessTest
[INFO] Tests run: 1, Failures: 0, Errors: 0, Skipped: 0, Time elapsed: 0.203 s - in org.apache.phoenix.query.ConnectionQueryServicesImplTest
[INFO] Running org.apache.phoenix.query.KeyRangeCoalesceTest
[INFO] Tests run: 13, Failures: 0, Errors: 0, Skipped: 0, Time elapsed: 0.1 s - in org.apache.phoenix.query.KeyRangeCoalesceTest
[INFO] Running org.apache.phoenix.jdbc.PhoenixDriverTest
[INFO] Tests run: 3, Failures: 0, Errors: 0, Skipped: 0, Time elapsed: 0.481 s - in org.apache.phoenix.query.ConnectionlessTest
[INFO] Running org.apache.phoenix.jdbc.ReadOnlyPropertiesTest
[INFO] Tests run: 4, Failures: 0, Errors: 0, Skipped: 0, Time elapsed: 0.005 s - in org.apache.phoenix.jdbc.ReadOnlyPropertiesTest
[INFO] Running org.apache.phoenix.jdbc.PhoenixEmbeddedDriverTest
[INFO] Tests run: 8, Failures: 0, Errors: 0, Skipped: 0, Time elapsed: 0.538 s - in org.apache.phoenix.query.KeyRangeClipTest
[INFO] Running org.apache.phoenix.jdbc.PhoenixPreparedStatementTest
[INFO] Tests run: 4, Failures: 0, Errors: 0, Skipped: 0, Time elapsed: 0.143 s - in org.apache.phoenix.jdbc.PhoenixEmbeddedDriverTest
[INFO] Running org.apache.phoenix.jdbc.PhoenixResultSetMetadataTest
[INFO] Tests run: 1, Failures: 0, Errors: 0, Skipped: 0, Time elapsed: 0.25 s - in org.apache.phoenix.jdbc.PhoenixResultSetMetadataTest
[INFO] Running org.apache.phoenix.jdbc.SecureUserConnectionsTest
[INFO] Tests run: 8, Failures: 0, Errors: 0, Skipped: 0, Time elapsed: 0.431 s - in org.apache.phoenix.jdbc.PhoenixPreparedStatementTest
[INFO] Running org.apache.phoenix.metrics.MetricTypeTest
[INFO] Tests run: 1, Failures: 0, Errors: 0, Skipped: 0, Time elapsed: 0.002 s - in org.apache.phoenix.metrics.MetricTypeTest
[INFO] Running org.apache.phoenix.iterate.AggregateResultScannerTest
[WARNING] Tests run: 7, Failures: 0, Errors: 0, Skipped: 1, Time elapsed: 0.826 s - in org.apache.phoenix.jdbc.PhoenixDriverTest
[INFO] Running org.apache.phoenix.iterate.SpoolingResultIteratorTest
[INFO] Tests run: 3, Failures: 0, Errors: 0, Skipped: 0, Time elapsed: 0.026 s - in org.apache.phoenix.iterate.SpoolingResultIteratorTest
[INFO] Running org.apache.phoenix.iterate.MergeSortResultIteratorTest
[INFO] Tests run: 2, Failures: 0, Errors: 0, Skipped: 0, Time elapsed: 0.023 s - in org.apache.phoenix.iterate.MergeSortResultIteratorTest
[INFO] Running org.apache.phoenix.iterate.OrderedResultIteratorTest
[INFO] Tests run: 1, Failures: 0, Errors: 0, Skipped: 0, Time elapsed: 0.005 s - in org.apache.phoenix.iterate.OrderedResultIteratorTest
[INFO] Running org.apache.phoenix.iterate.ConcatResultIteratorTest
[INFO] Tests run: 2, Failures: 0, Errors: 0, Skipped: 0, Time elapsed: 0.002 s - in org.apache.phoenix.iterate.ConcatResultIteratorTest
[INFO] Running org.apache.phoenix.iterate.RowKeyOrderedAggregateResultIteratorTest
[INFO] Tests run: 1, Failures: 0, Errors: 0, Skipped: 0, Time elapsed: 0.246 s - in org.apache.phoenix.iterate.AggregateResultScannerTest
[INFO] Running org.apache.phoenix.trace.TraceSpanReceiverTest
[INFO] Tests run: 4, Failures: 0, Errors: 0, Skipped: 0, Time elapsed: 0.17 s - in org.apache.phoenix.iterate.RowKeyOrderedAggregateResultIteratorTest
[INFO] Running org.apache.phoenix.schema.ValueBitSetTest
[INFO] Tests run: 4, Failures: 0, Errors: 0, Skipped: 0, Time elapsed: 0.006 s - in org.apache.phoenix.schema.ValueBitSetTest
[INFO] Running org.apache.phoenix.schema.SchemaUtilTest
[INFO] Tests run: 6, Failures: 0, Errors: 0, Skipped: 0, Time elapsed: 0.004 s - in org.apache.phoenix.schema.SchemaUtilTest
[INFO] Running org.apache.phoenix.schema.PCharPadTest
[INFO] Tests run: 9, Failures: 0, Errors: 0, Skipped: 0, Time elapsed: 0.007 s - in org.apache.phoenix.schema.PCharPadTest
[INFO] Running org.apache.phoenix.schema.SystemSplitPolicyTest
[INFO] Tests run: 2, Failures: 0, Errors: 0, Skipped: 0, Time elapsed: 0.004 s - in org.apache.phoenix.schema.SystemSplitPolicyTest
[INFO] Running org.apache.phoenix.schema.RowKeyValueAccessorTest
[INFO] Tests run: 2, Failures: 0, Errors: 0, Skipped: 0, Time elapsed: 0.228 s - in org.apache.phoenix.trace.TraceSpanReceiverTest
[INFO] Running org.apache.phoenix.schema.RowKeySchemaTest
[INFO] Tests run: 1, Failures: 0, Errors: 0, Skipped: 0, Time elapsed: 0.182 s - in org.apache.phoenix.schema.RowKeyValueAccessorTest
[INFO] Running org.apache.phoenix.schema.MutationTest
[INFO] Tests run: 49, Failures: 0, Errors: 0, Skipped: 0, Time elapsed: 4.723 s - in org.apache.phoenix.compile.QueryOptimizerTest
[INFO] Running org.apache.phoenix.schema.PMetaDataImplTest
[INFO] Tests run: 6, Failures: 0, Errors: 0, Skipped: 0, Time elapsed: 0.022 s - in org.apache.phoenix.schema.PMetaDataImplTest
[INFO] Running org.apache.phoenix.schema.SequenceAllocationTest
[INFO] Tests run: 2, Failures: 0, Errors: 0, Skipped: 0, Time elapsed: 0.01 s - in org.apache.phoenix.schema.SequenceAllocationTest
[INFO] Running org.apache.phoenix.schema.stats.StatisticsScannerTest
[INFO] Tests run: 7, Failures: 0, Errors: 0, Skipped: 0, Time elapsed: 0.292 s - in org.apache.phoenix.schema.RowKeySchemaTest
[INFO] Running org.apache.phoenix.schema.types.PrimitiveFloatPhoenixArrayToStringTest
[INFO] Tests run: 2, Failures: 0, Errors: 0, Skipped: 0, Time elapsed: 0.284 s - in org.apache.phoenix.schema.MutationTest
[INFO] Tests run: 6, Failures: 0, Errors: 0, Skipped: 0, Time elapsed: 0.026 s - in org.apache.phoenix.schema.types.PrimitiveFloatPhoenixArrayToStringTest
[INFO] Running org.apache.phoenix.schema.types.PrimitiveBytePhoenixArrayToStringTest
[INFO] Running org.apache.phoenix.schema.types.PrimitiveBooleanPhoenixArrayToStringTest
[INFO] Tests run: 6, Failures: 0, Errors: 0, Skipped: 0, Time elapsed: 0.009 s - in org.apache.phoenix.schema.types.PrimitiveBooleanPhoenixArrayToStringTest
[INFO] Running org.apache.phoenix.schema.types.PVarcharArrayToStringTest
[INFO] Tests run: 6, Failures: 0, Errors: 0, Skipped: 0, Time elapsed: 0.013 s - in org.apache.phoenix.schema.types.PrimitiveBytePhoenixArrayToStringTest
[INFO] Tests run: 8, Failures: 0, Errors: 0, Skipped: 0, Time elapsed: 0.006 s - in org.apache.phoenix.schema.types.PVarcharArrayToStringTest
[INFO] Running org.apache.phoenix.schema.types.PrimitiveShortPhoenixArrayToStringTest
[INFO] Running org.apache.phoenix.schema.types.PDateArrayToStringTest
[INFO] Tests run: 6, Failures: 0, Errors: 0, Skipped: 0, Time elapsed: 0.006 s - in org.apache.phoenix.schema.types.PrimitiveShortPhoenixArrayToStringTest
[INFO] Running org.apache.phoenix.schema.types.PDataTypeTest
[INFO] Tests run: 6, Failures: 0, Errors: 0, Skipped: 0, Time elapsed: 0.014 s - in org.apache.phoenix.schema.types.PDateArrayToStringTest
[INFO] Running org.apache.phoenix.schema.types.PrimitiveLongPhoenixArrayToStringTest
[INFO] Tests run: 6, Failures: 0, Errors: 0, Skipped: 0, Time elapsed: 0.005 s - in org.apache.phoenix.schema.types.PrimitiveLongPhoenixArrayToStringTest
[INFO] Running org.apache.phoenix.schema.types.PDataTypeForArraysTest
[INFO] Tests run: 69, Failures: 0, Errors: 0, Skipped: 0, Time elapsed: 0.076 s - in org.apache.phoenix.schema.types.PDataTypeForArraysTest
[INFO] Running org.apache.phoenix.schema.types.PrimitiveIntPhoenixArrayToStringTest
[INFO] Tests run: 6, Failures: 0, Errors: 0, Skipped: 0, Time elapsed: 0.003 s - in org.apache.phoenix.schema.types.PrimitiveIntPhoenixArrayToStringTest
[INFO] Running org.apache.phoenix.schema.types.PrimitiveDoublePhoenixArrayToStringTest
[INFO] Tests run: 6, Failures: 0, Errors: 0, Skipped: 0, Time elapsed: 0.005 s - in org.apache.phoenix.schema.types.PrimitiveDoublePhoenixArrayToStringTest
[INFO] Running org.apache.phoenix.schema.SortOrderTest
[INFO] Tests run: 4, Failures: 0, Errors: 0, Skipped: 0, Time elapsed: 0.394 s - in org.apache.phoenix.schema.stats.StatisticsScannerTest
[INFO] Running org.apache.phoenix.schema.SaltingUtilTest
[INFO] Tests run: 8, Failures: 0, Errors: 0, Skipped: 0, Time elapsed: 0.005 s - in org.apache.phoenix.schema.SortOrderTest
[INFO] Tests run: 2, Failures: 0, Errors: 0, Skipped: 0, Time elapsed: 0.004 s - in org.apache.phoenix.schema.SaltingUtilTest
[INFO] Running org.apache.phoenix.schema.ImmutableStorageSchemeTest
[INFO] Running org.apache.phoenix.index.automated.MRJobSubmitterTest
[INFO] Tests run: 36, Failures: 0, Errors: 0, Skipped: 0, Time elapsed: 0.195 s - in org.apache.phoenix.schema.types.PDataTypeTest
[INFO] Running org.apache.phoenix.index.IndexMaintainerTest
[INFO] Tests run: 6, Failures: 0, Errors: 0, Skipped: 0, Time elapsed: 0.098 s - in org.apache.phoenix.index.automated.MRJobSubmitterTest
[INFO] Running org.apache.hadoop.hbase.regionserver.wal.IndexedWALEditCodecTest
[INFO] Tests run: 1, Failures: 0, Errors: 0, Skipped: 0, Time elapsed: 0.008 s - in org.apache.hadoop.hbase.regionserver.wal.IndexedWALEditCodecTest
[INFO] Running org.apache.hadoop.hbase.regionserver.wal.ReadWriteKeyValuesWithCodecTest
[ERROR] Tests run: 1, Failures: 0, Errors: 1, Skipped: 0, Time elapsed: 1.254 s <<<
FAILURE! - in org.apache.phoenix.jdbc.SecureUserConnectionsTest
[ERROR] org.apache.phoenix.jdbc.SecureUserConnectionsTest  Time elapsed: 1.253 s  <<<
ERROR!
java.lang.IllegalArgumentException: Can't get Kerberos realm
	at org.apache.phoenix.jdbc.SecureUserConnectionsTest.setupKdc(SecureUserConnectionsTest.java:101)
Caused by: java.lang.reflect.InvocationTargetException
	at org.apache.phoenix.jdbc.SecureUserConnectionsTest.setupKdc(SecureUserConnectionsTest.java:101)
Caused by: sun.security.krb5.KrbException: Cannot locate default realm
	at org.apache.phoenix.jdbc.SecureUserConnectionsTest.setupKdc(SecureUserConnectionsTest.java:101)

[INFO] Running org.apache.hadoop.hbase.regionserver.PhoenixRpcSchedulerFactoryTest
[INFO] Tests run: 2, Failures: 0, Errors: 0, Skipped: 0, Time elapsed: 0.05 s - in org.apache.hadoop.hbase.regionserver.PhoenixRpcSchedulerFactoryTest
[INFO] Running org.apache.hadoop.hbase.ipc.PhoenixIndexRpcSchedulerTest
[INFO] Tests run: 4, Failures: 0, Errors: 0, Skipped: 0, Time elapsed: 3.344 s - in org.apache.phoenix.query.KeyRangeMoreTest
[INFO] Tests run: 2, Failures: 0, Errors: 0, Skipped: 0, Time elapsed: 0.569 s - in org.apache.hadoop.hbase.regionserver.wal.ReadWriteKeyValuesWithCodecTest
[INFO] Tests run: 22, Failures: 0, Errors: 0, Skipped: 0, Time elapsed: 0.746 s - in org.apache.phoenix.schema.ImmutableStorageSchemeTest
[INFO] Tests run: 24, Failures: 0, Errors: 0, Skipped: 0, Time elapsed: 0.935 s - in org.apache.phoenix.index.IndexMaintainerTest
[INFO] Tests run: 2, Failures: 0, Errors: 0, Skipped: 0, Time elapsed: 1.391 s - in org.apache.hadoop.hbase.ipc.PhoenixIndexRpcSchedulerTest
[WARNING] Tests run: 186, Failures: 0, Errors: 0, Skipped: 2, Time elapsed: 7.202 s - in org.apache.phoenix.compile.QueryCompilerTest
[INFO] Tests run: 2, Failures: 0, Errors: 0, Skipped: 0, Time elapsed: 5.314 s - in org.apache.phoenix.query.ScannerLeaseRenewalTest
[INFO] Tests run: 3, Failures: 0, Errors: 0, Skipped: 0, Time elapsed: 12.117 s - in org.apache.phoenix.hbase.index.write.recovery.TestPerRegionIndexWriteCache
[INFO] 
[INFO] Results:
[INFO] 
[ERROR] Errors: 
[ERROR]   SecureUserConnectionsTest.setupKdc:101 ยป IllegalArgument Can't get Kerberos re...
[INFO] 
[ERROR] Tests run: 1649, Failures: 0, Errors: 1, Skipped: 5
[INFO] 
[INFO] ------------------------------------------------------------------------
[INFO] Reactor Summary:
[INFO] 
[INFO] Apache Phoenix 5.1.0-HBase-2.0-SNAPSHOT ............ SUCCESS [  5.439 s]
[INFO] Phoenix Core ....................................... FAILURE [03:22 min]
[INFO] Phoenix - Flume .................................... SKIPPED
[INFO] Phoenix - Kafka .................................... SKIPPED
[INFO] Phoenix - Pig ...................................... SKIPPED
[INFO] Phoenix Query Server Client ........................ SKIPPED
[INFO] Phoenix Query Server ............................... SKIPPED
[INFO] Phoenix - Pherf .................................... SKIPPED
[INFO] Phoenix - Spark .................................... SKIPPED
[INFO] Phoenix - Hive ..................................... SKIPPED
[INFO] Phoenix Client ..................................... SKIPPED
[INFO] Phoenix Server ..................................... SKIPPED
[INFO] Phoenix Assembly ................................... SKIPPED
[INFO] Phoenix - Tracing Web Application .................. SKIPPED
[INFO] Phoenix Load Balancer 5.1.0-HBase-2.0-SNAPSHOT ..... SKIPPED
[INFO] ------------------------------------------------------------------------
[INFO] BUILD FAILURE
[INFO] ------------------------------------------------------------------------
[INFO] Total time: 03:29 min
[INFO] Finished at: 2018-07-31T21:03:46Z
[INFO] ------------------------------------------------------------------------
[ERROR] Failed to execute goal org.apache.maven.plugins:maven-surefire-plugin:2.20:test (default-test)
on project phoenix-core: There are test failures.
[ERROR] 
[ERROR] Please refer to <https://builds.apache.org/job/Phoenix-master/ws/phoenix-core/target/surefire-reports>
for the individual test results.
[ERROR] Please refer to dump files (if any exist) [date]-jvmRun[N].dump, [date].dumpstream
and [date]-jvmRun[N].dumpstream.
[ERROR] -> [Help 1]
[ERROR] 
[ERROR] To see the full stack trace of the errors, re-run Maven with the -e switch.
[ERROR] Re-run Maven using the -X switch to enable full debug logging.
[ERROR] 
[ERROR] For more information about the errors and possible solutions, please read the following
articles:
[ERROR] [Help 1] http://cwiki.apache.org/confluence/display/MAVEN/MojoFailureException
[ERROR] 
[ERROR] After correcting the problems, you can resume the build with the command
[ERROR]   mvn <goals> -rf :phoenix-core
Build step 'Invoke top-level Maven targets' marked build as failure
Archiving artifacts
Recording test results
Not sending mail to unregistered user ankitsinghal59@gmail.com

Mime
View raw message