phoenix-commits mailing list archives

Site index · List index
Message view « Date » · « Thread »
Top « Date » · « Thread »
From Apache Jenkins Server <jenk...@builds.apache.org>
Subject Build failed in Jenkins: Phoenix Compile Compatibility with HBase #711
Date Sun, 29 Jul 2018 09:16:49 GMT
See <https://builds.apache.org/job/Phoenix_Compile_Compat_wHBase/711/display/redirect>

------------------------------------------
Started by timer
[EnvInject] - Loading node environment variables.
Building remotely on H25 (ubuntu xenial) in workspace <https://builds.apache.org/job/Phoenix_Compile_Compat_wHBase/ws/>
[Phoenix_Compile_Compat_wHBase] $ /bin/bash /tmp/jenkins7237264784402952588.sh
core file size          (blocks, -c) 0
data seg size           (kbytes, -d) unlimited
scheduling priority             (-e) 0
file size               (blocks, -f) unlimited
pending signals                 (-i) 386413
max locked memory       (kbytes, -l) 64
max memory size         (kbytes, -m) unlimited
open files                      (-n) 60000
pipe size            (512 bytes, -p) 8
POSIX message queues     (bytes, -q) 819200
real-time priority              (-r) 0
stack size              (kbytes, -s) 8192
cpu time               (seconds, -t) unlimited
max user processes              (-u) 10240
virtual memory          (kbytes, -v) unlimited
file locks                      (-x) unlimited
core id		: 0
core id		: 1
core id		: 2
core id		: 3
core id		: 4
core id		: 5
physical id	: 0
physical id	: 1
MemTotal:       98957736 kB
MemFree:        51797632 kB
Filesystem      Size  Used Avail Use% Mounted on
udev             48G     0   48G   0% /dev
tmpfs           9.5G   82M  9.4G   1% /run
/dev/sda1       364G  294G   53G  85% /
tmpfs            48G     0   48G   0% /dev/shm
tmpfs           5.0M     0  5.0M   0% /run/lock
tmpfs            48G     0   48G   0% /sys/fs/cgroup
tmpfs           9.5G     0  9.5G   0% /run/user/910
apache-maven-2.2.1
apache-maven-3.0.4
apache-maven-3.0.5
apache-maven-3.2.1
apache-maven-3.2.5
apache-maven-3.3.3
apache-maven-3.3.9
apache-maven-3.5.0
apache-maven-3.5.2
apache-maven-3.5.4
latest
latest2
latest3


===========================================================================================
Verifying compile level compatibility with HBase 0.98 with Phoenix 4.x-HBase-0.98
===========================================================================================

Cloning into 'hbase'...
Switched to a new branch '0.98'
Branch 0.98 set up to track remote branch 0.98 from origin.
[ERROR] [ERROR] Some problems were encountered while processing the POMs:
[ERROR] Unresolveable build extension: Plugin org.apache.felix:maven-bundle-plugin:2.5.3 or
one of its dependencies could not be resolved: The following artifacts could not be resolved:
org.apache.maven:maven-core:jar:2.0.7, org.apache.maven:maven-settings:jar:2.0.7, org.apache.maven:maven-plugin-parameter-documenter:jar:2.0.7,
org.apache.maven:maven-profile:jar:2.0.7, org.apache.maven:maven-model:jar:2.0.7, org.apache.maven:maven-artifact:jar:2.0.7,
org.apache.maven:maven-repository-metadata:jar:2.0.7, org.apache.maven:maven-error-diagnostics:jar:2.0.7,
org.apache.maven:maven-project:jar:2.0.7, org.apache.maven:maven-plugin-registry:jar:2.0.7,
org.apache.maven:maven-plugin-api:jar:2.0.7, org.apache.maven:maven-plugin-descriptor:jar:2.0.7,
org.apache.maven:maven-artifact-manager:jar:2.0.7, org.apache.maven:maven-monitor:jar:2.0.7:
Could not transfer artifact org.apache.maven:maven-core:jar:2.0.7 from/to central (https://repo.maven.apache.org/maven2):
Received fatal alert: protocol_version @ 
 @ 
[ERROR] The build could not read 1 project -> [Help 1]
[ERROR]   
[ERROR]   The project org.apache.hbase:hbase:0.98.25-SNAPSHOT (<https://builds.apache.org/job/Phoenix_Compile_Compat_wHBase/ws/hbase/pom.xml)>
has 1 error
[ERROR]     Unresolveable build extension: Plugin org.apache.felix:maven-bundle-plugin:2.5.3
or one of its dependencies could not be resolved: The following artifacts could not be resolved:
org.apache.maven:maven-core:jar:2.0.7, org.apache.maven:maven-settings:jar:2.0.7, org.apache.maven:maven-plugin-parameter-documenter:jar:2.0.7,
org.apache.maven:maven-profile:jar:2.0.7, org.apache.maven:maven-model:jar:2.0.7, org.apache.maven:maven-artifact:jar:2.0.7,
org.apache.maven:maven-repository-metadata:jar:2.0.7, org.apache.maven:maven-error-diagnostics:jar:2.0.7,
org.apache.maven:maven-project:jar:2.0.7, org.apache.maven:maven-plugin-registry:jar:2.0.7,
org.apache.maven:maven-plugin-api:jar:2.0.7, org.apache.maven:maven-plugin-descriptor:jar:2.0.7,
org.apache.maven:maven-artifact-manager:jar:2.0.7, org.apache.maven:maven-monitor:jar:2.0.7:
Could not transfer artifact org.apache.maven:maven-core:jar:2.0.7 from/to central (https://repo.maven.apache.org/maven2):
Received fatal alert: protocol_version -> [Help 2]
[ERROR] 
[ERROR] To see the full stack trace of the errors, re-run Maven with the -e switch.
[ERROR] Re-run Maven using the -X switch to enable full debug logging.
[ERROR] 
[ERROR] For more information about the errors and possible solutions, please read the following
articles:
[ERROR] [Help 1] http://cwiki.apache.org/confluence/display/MAVEN/ProjectBuildingException
[ERROR] [Help 2] http://cwiki.apache.org/confluence/display/MAVEN/PluginManagerException
Build step 'Execute shell' marked build as failure

Mime
View raw message